{
 
  "indentation": {
    "regex": "^(\s+)",
    "skip": true
  },
  "keywords": {
    "regex": "^([a-z]{2,})\b",
    "list": {
      "self": [
        "while", "switch", "if", "then", "else", "unless", "not", "is",
        "isnt", "for", "in", "of", "when", "by", "until", "do",
        "and", "or", "true", "on", "false", "return"
      ],
      "logic_operator": ["and", "or", "xor"]

    }
  },
  "ident": {
    "regex": "^(([a-zA-Z]\w*)|(_\w+))\b",
    "link": "arrayOfIdent",
    "name": "ident" 
  },
  "digit_const": {
    "regex": "^(\d+)(\.\d+){0,1}\b",
    "link": "arrayOfConst",
    "name": "digit_const" 
  },
  "string_const": {
    "regex": "^(\$){0,1}((\"(.*?)\")|(\'(.*?)\'))",
    "link": "arrayOfConst",
    "name": "string_const" 
  },
 "one_line_comment": {
    "regex": "\#(.*)",
    "skip": true
  },
  "multi_line_comment": {
    "regex": "\#\#\#([\s\S]*?)\#\#\#",
    "skip": true
  },  
 "operators": {
    "regex": "(^(((<->)(=>))|([-_=+\*\/\|%>:<]){1,2}))",
    "list": { "two_points": "..",
      "three_points": "...",
      "point": ".",
      "minus_assing": "-=",
      "plus_assing": "+=",
      "rise": "->",
      "existence": "?",
      "greater_or_eq": ">=",
      "less_or_eq": "<=",
      "assing": "=",
      "plus": "+",
      "minus": "-",
      "mult": "*",
      "div": "/",
      "equal": "==",
      "equall": "*=",
      "greater": ">",
      "greater1": "->",
      "less": "<"

    }
  },
  "type":{
    "regex": "^: \w+((\[.*?\])|(\(.*?\))){0,1}",
    "skip": true
  },
  "separators": {
    "regex": "([\[\])(:,;.}{]{1})",
    "list": {
      "self": ["(", ")", ";", ":", ",", ".", "{", "}","[","]"]
    }
  }
}
