{
  "defaultSeverity": "error",
  "extends": [
    "tslint:recommended"
  ],
  "jsRules": {},
  "rules": {
    "no-console": false,
    "trailing-comma": true,
    "semicolon": [
      true,
      "never"
    ],
    "quotemark": [
      true,
      "single"
    ]
  },
  "rulesDirectory": []
}