{
  "defaultSeverity": "error",
  "extends": [
    "tslint:recommended",
    "tslint-config-standard",
    "tslint-react",
    "tslint-config-prettier"
  ],
  "jsRules": {},
  "rules": {
    "no-console": false,
    "trailing-comma": true,
    "semicolon": [true, "never"],
    "curly": [true, "ignore-same-line"],
    "quotemark": [true, "single"]
  },
  "rulesDirectory": []
}
