{
    "objectIdFieldName": "ObjectId",
    "uniqueIdField": {
        "name": "ObjectId",
        "isSystemMaintained": true
    },
    "globalIdFieldName": "",
    "fields": [
        {
            "name": "Bundesland",
            "type": "esriFieldTypeString",
            "alias": "Bundesland",
            "sqlType": "sqlTypeNVarchar",
            "length": 2147483647,
            "domain": null,
            "defaultValue": null
        },
        {
            "name": "Landkreis",
            "type": "esriFieldTypeString",
            "alias": "Landkreis",
            "sqlType": "sqlTypeNVarchar",
            "length": 2147483647,
            "domain": null,
            "defaultValue": null
        },
        {
            "name": "AnzahlFall",
            "type": "esriFieldTypeInteger",
            "alias": "AnzahlFall",
            "sqlType": "sqlTypeInteger",
            "domain": null,
            "defaultValue": null
        },
        {
            "name": "AnzahlTodesfall",
            "type": "esriFieldTypeInteger",
            "alias": "AnzahlTodesfall",
            "sqlType": "sqlTypeInteger",
            "domain": null,
            "defaultValue": null
        },
        {
            "name": "Meldedatum",
            "type": "esriFieldTypeDate",
            "alias": "Meldedatum",
            "sqlType": "sqlTypeOther",
            "length": 0,
            "domain": null,
            "defaultValue": null
        },
        {
            "name": "Datenstand",
            "type": "esriFieldTypeString",
            "alias": "Datenstand",
            "sqlType": "sqlTypeOther",
            "length": 256,
            "domain": null,
            "defaultValue": null
        },
        {
            "name": "NeuerFall",
            "type": "esriFieldTypeInteger",
            "alias": "Neuer Fall",
            "sqlType": "sqlTypeOther",
            "domain": null,
            "defaultValue": null
        },
        {
            "name": "NeuerTodesfall",
            "type": "esriFieldTypeInteger",
            "alias": "Neuer Todesfall",
            "sqlType": "sqlTypeOther",
            "domain": null,
            "defaultValue": null
        }
    ],
    "features": [
        {
            "attributes": {
                "Bundesland": "Thüringen",
                "Landkreis": "LK Altenburger Land",
                "AnzahlFall": 1,
                "AnzahlTodesfall": 0,
                "Meldedatum": 1587340800000,
                "Datenstand": "17.05.2020, 00:00 Uhr",
                "NeuerFall": 0,
                "NeuerTodesfall": -9
            }
        },
        {
            "attributes": {
                "Bundesland": "Thüringen",
                "Landkreis": "LK Altenburger Land",
                "AnzahlFall": 1,
                "AnzahlTodesfall": 0,
                "Meldedatum": 1588032000000,
                "Datenstand": "17.05.2020, 00:00 Uhr",
                "NeuerFall": 0,
                "NeuerTodesfall": -9
            }
        },
        {
            "attributes": {
                "Bundesland": "Thüringen",
                "Landkreis": "LK Altenburger Land",
                "AnzahlFall": 1,
                "AnzahlTodesfall": 0,
                "Meldedatum": 1585008000000,
                "Datenstand": "17.05.2020, 00:00 Uhr",
                "NeuerFall": 0,
                "NeuerTodesfall": -9
            }
        },
        {
            "attributes": {
                "Bundesland": "Thüringen",
                "Landkreis": "LK Altenburger Land",
                "AnzahlFall": 1,
                "AnzahlTodesfall": 0,
                "Meldedatum": 1585008000000,
                "Datenstand": "17.05.2020, 00:00 Uhr",
                "NeuerFall": 0,
                "NeuerTodesfall": -9
            }
        },
        {
            "attributes": {
                "Bundesland": "Thüringen",
                "Landkreis": "LK Altenburger Land",
                "AnzahlFall": 1,
                "AnzahlTodesfall": 0,
                "Meldedatum": 1586217600000,
                "Datenstand": "17.05.2020, 00:00 Uhr",
                "NeuerFall": 0,
                "NeuerTodesfall": -9
            }
        },
        {
            "attributes": {
                "Bundesland": "Thüringen",
                "Landkreis": "LK Altenburger Land",
                "AnzahlFall": 1,
                "AnzahlTodesfall": 0,
                "Meldedatum": 1586995200000,
                "Datenstand": "17.05.2020, 00:00 Uhr",
                "NeuerFall": 0,
                "NeuerTodesfall": -9
            }
        },
        {
            "attributes": {
                "Bundesland": "Thüringen",
                "Landkreis": "LK Altenburger Land",
                "AnzahlFall": 1,
                "AnzahlTodesfall": 0,
                "Meldedatum": 1587600000000,
                "Datenstand": "17.05.2020, 00:00 Uhr",
                "NeuerFall": 0,
                "NeuerTodesfall": -9
            }
        },
        {
            "attributes": {
                "Bundesland": "Thüringen",
                "Landkreis": "LK Altenburger Land",
                "AnzahlFall": 1,
                "AnzahlTodesfall": 0,
                "Meldedatum": 1588032000000,
                "Datenstand": "17.05.2020, 00:00 Uhr",
                "NeuerFall": 0,
                "NeuerTodesfall": -9
            }
        },
        {
            "attributes": {
                "Bundesland": "Thüringen",
                "Landkreis": "LK Altenburger Land",
                "AnzahlFall": 1,
                "AnzahlTodesfall": 0,
                "Meldedatum": 1584403200000,
                "Datenstand": "17.05.2020, 00:00 Uhr",
                "NeuerFall": 0,
                "NeuerTodesfall": -9
            }
        },
        {
            "attributes": {
                "Bundesland": "Thüringen",
                "Landkreis": "LK Altenburger Land",
                "AnzahlFall": 1,
                "AnzahlTodesfall": 0,
                "Meldedatum": 1584748800000,
                "Datenstand": "17.05.2020, 00:00 Uhr",
                "NeuerFall": 0,
                "NeuerTodesfall": -9
            }
        },
        {
            "attributes": {
                "Bundesland": "Thüringen",
                "Landkreis": "LK Altenburger Land",
                "AnzahlFall": 1,
                "AnzahlTodesfall": 0,
                "Meldedatum": 1584748800000,
                "Datenstand": "17.05.2020, 00:00 Uhr",
                "NeuerFall": 0,
                "NeuerTodesfall": -9
            }
        },
        {
            "attributes": {
                "Bundesland": "Thüringen",
                "Landkreis": "LK Altenburger Land",
                "AnzahlFall": 1,
                "AnzahlTodesfall": 0,
                "Meldedatum": 1585353600000,
                "Datenstand": "17.05.2020, 00:00 Uhr",
                "NeuerFall": 0,
                "NeuerTodesfall": -9
            }
        },
        {
            "attributes": {
                "Bundesland": "Thüringen",
                "Landkreis": "LK Altenburger Land",
                "AnzahlFall": 1,
                "AnzahlTodesfall": 0,
                "Meldedatum": 1585699200000,
                "Datenstand": "17.05.2020, 00:00 Uhr",
                "NeuerFall": 0,
                "NeuerTodesfall": -9
            }
        },
        {
            "attributes": {
                "Bundesland": "Thüringen",
                "Landkreis": "LK Altenburger Land",
                "AnzahlFall": 1,
                "AnzahlTodesfall": 0,
                "Meldedatum": 1585699200000,
                "Datenstand": "17.05.2020, 00:00 Uhr",
                "NeuerFall": 0,
                "NeuerTodesfall": -9
            }
        },
        {
            "attributes": {
                "Bundesland": "Thüringen",
                "Landkreis": "LK Altenburger Land",
                "AnzahlFall": 1,
                "AnzahlTodesfall": 0,
                "Meldedatum": 1585785600000,
                "Datenstand": "17.05.2020, 00:00 Uhr",
                "NeuerFall": 0,
                "NeuerTodesfall": -9
            }
        },
        {
            "attributes": {
                "Bundesland": "Thüringen",
                "Landkreis": "LK Altenburger Land",
                "AnzahlFall": 1,
                "AnzahlTodesfall": 1,
                "Meldedatum": 1586390400000,
                "Datenstand": "17.05.2020, 00:00 Uhr",
                "NeuerFall": 0,
                "NeuerTodesfall": 0
            }
        },
        {
            "attributes": {
                "Bundesland": "Thüringen",
                "Landkreis": "LK Altenburger Land",
                "AnzahlFall": 1,
                "AnzahlTodesfall": 0,
                "Meldedatum": 1586476800000,
                "Datenstand": "17.05.2020, 00:00 Uhr",
                "NeuerFall": 0,
                "NeuerTodesfall": -9
            }
        },
        {
            "attributes": {
                "Bundesland": "Thüringen",
                "Landkreis": "LK Altenburger Land",
                "AnzahlFall": 1,
                "AnzahlTodesfall": 0,
                "Meldedatum": 1587340800000,
                "Datenstand": "17.05.2020, 00:00 Uhr",
                "NeuerFall": 0,
                "NeuerTodesfall": -9
            }
        },
        {
            "attributes": {
                "Bundesland": "Thüringen",
                "Landkreis": "LK Altenburger Land",
                "AnzahlFall": 1,
                "AnzahlTodesfall": 0,
                "Meldedatum": 1588118400000,
                "Datenstand": "17.05.2020, 00:00 Uhr",
                "NeuerFall": 0,
                "NeuerTodesfall": -9
            }
        },
        {
            "attributes": {
                "Bundesland": "Thüringen",
                "Landkreis": "LK Altenburger Land",
                "AnzahlFall": 1,
                "AnzahlTodesfall": 0,
                "Meldedatum": 1588204800000,
                "Datenstand": "17.05.2020, 00:00 Uhr",
                "NeuerFall": 0,
                "NeuerTodesfall": -9
            }
        },
        {
            "attributes": {
                "Bundesland": "Thüringen",
                "Landkreis": "LK Altenburger Land",
                "AnzahlFall": 1,
                "AnzahlTodesfall": 0,
                "Meldedatum": 1589155200000,
                "Datenstand": "17.05.2020, 00:00 Uhr",
                "NeuerFall": 0,
                "NeuerTodesfall": -9
            }
        },
        {
            "attributes": {
                "Bundesland": "Thüringen",
                "Landkreis": "LK Altenburger Land",
                "AnzahlFall": 1,
                "AnzahlTodesfall": 0,
                "Meldedatum": 1589155200000,
                "Datenstand": "17.05.2020, 00:00 Uhr",
                "NeuerFall": 0,
                "NeuerTodesfall": -9
            }
        },
        {
            "attributes": {
                "Bundesland": "Thüringen",
                "Landkreis": "LK Altenburger Land",
                "AnzahlFall": 1,
                "AnzahlTodesfall": 0,
                "Meldedatum": 1584403200000,
                "Datenstand": "17.05.2020, 00:00 Uhr",
                "NeuerFall": 0,
                "NeuerTodesfall": -9
            }
        },
        {
            "attributes": {
                "Bundesland": "Thüringen",
                "Landkreis": "LK Altenburger Land",
                "AnzahlFall": 1,
                "AnzahlTodesfall": 0,
                "Meldedatum": 1584835200000,
                "Datenstand": "17.05.2020, 00:00 Uhr",
                "NeuerFall": 0,
                "NeuerTodesfall": -9
            }
        },
        {
            "attributes": {
                "Bundesland": "Thüringen",
                "Landkreis": "LK Altenburger Land",
                "AnzahlFall": 1,
                "AnzahlTodesfall": 0,
                "Meldedatum": 1585008000000,
                "Datenstand": "17.05.2020, 00:00 Uhr",
                "NeuerFall": 0,
                "NeuerTodesfall": -9
            }
        },
        {
            "attributes": {
                "Bundesland": "Thüringen",
                "Landkreis": "LK Altenburger Land",
                "AnzahlFall": 2,
                "AnzahlTodesfall": 0,
                "Meldedatum": 1585008000000,
                "Datenstand": "17.05.2020, 00:00 Uhr",
                "NeuerFall": 0,
                "NeuerTodesfall": -9
            }
        },
        {
            "attributes": {
                "Bundesland": "Thüringen",
                "Landkreis": "LK Altenburger Land",
                "AnzahlFall": 1,
                "AnzahlTodesfall": 0,
                "Meldedatum": 1585008000000,
                "Datenstand": "17.05.2020, 00:00 Uhr",
                "NeuerFall": 0,
                "NeuerTodesfall": -9
            }
        },
        {
            "attributes": {
                "Bundesland": "Thüringen",
                "Landkreis": "LK Altenburger Land",
                "AnzahlFall": 1,
                "AnzahlTodesfall": 0,
                "Meldedatum": 1585094400000,
                "Datenstand": "17.05.2020, 00:00 Uhr",
                "NeuerFall": 0,
                "NeuerTodesfall": -9
            }
        },
        {
            "attributes": {
                "Bundesland": "Thüringen",
                "Landkreis": "LK Altenburger Land",
                "AnzahlFall": 1,
                "AnzahlTodesfall": 0,
                "Meldedatum": 1585612800000,
                "Datenstand": "17.05.2020, 00:00 Uhr",
                "NeuerFall": 0,
                "NeuerTodesfall": -9
            }
        },
        {
            "attributes": {
                "Bundesland": "Thüringen",
                "Landkreis": "LK Altenburger Land",
                "AnzahlFall": 1,
                "AnzahlTodesfall": 0,
                "Meldedatum": 1585612800000,
                "Datenstand": "17.05.2020, 00:00 Uhr",
                "NeuerFall": 0,
                "NeuerTodesfall": -9
            }
        },
        {
            "attributes": {
                "Bundesland": "Thüringen",
                "Landkreis": "LK Altenburger Land",
                "AnzahlFall": 1,
                "AnzahlTodesfall": 0,
                "Meldedatum": 1585699200000,
                "Datenstand": "17.05.2020, 00:00 Uhr",
                "NeuerFall": 0,
                "NeuerTodesfall": -9
            }
        },
        {
            "attributes": {
                "Bundesland": "Thüringen",
                "Landkreis": "LK Altenburger Land",
                "AnzahlFall": 1,
                "AnzahlTodesfall": 0,
                "Meldedatum": 1585699200000,
                "Datenstand": "17.05.2020, 00:00 Uhr",
                "NeuerFall": 0,
                "NeuerTodesfall": -9
            }
        },
        {
            "attributes": {
                "Bundesland": "Thüringen",
                "Landkreis": "LK Altenburger Land",
                "AnzahlFall": 1,
                "AnzahlTodesfall": 0,
                "Meldedatum": 1586476800000,
                "Datenstand": "17.05.2020, 00:00 Uhr",
                "NeuerFall": 0,
                "NeuerTodesfall": -9
            }
        },
        {
            "attributes": {
                "Bundesland": "Thüringen",
                "Landkreis": "LK Altenburger Land",
                "AnzahlFall": 1,
                "AnzahlTodesfall": 0,
                "Meldedatum": 1586822400000,
                "Datenstand": "17.05.2020, 00:00 Uhr",
                "NeuerFall": 0,
                "NeuerTodesfall": -9
            }
        },
        {
            "attributes": {
                "Bundesland": "Thüringen",
                "Landkreis": "LK Altenburger Land",
                "AnzahlFall": 1,
                "AnzahlTodesfall": 0,
                "Meldedatum": 1586995200000,
                "Datenstand": "17.05.2020, 00:00 Uhr",
                "NeuerFall": 0,
                "NeuerTodesfall": -9
            }
        },
        {
            "attributes": {
                "Bundesland": "Thüringen",
                "Landkreis": "LK Altenburger Land",
                "AnzahlFall": 1,
                "AnzahlTodesfall": 0,
                "Meldedatum": 1587945600000,
                "Datenstand": "17.05.2020, 00:00 Uhr",
                "NeuerFall": 0,
                "NeuerTodesfall": -9
            }
        },
        {
            "attributes": {
                "Bundesland": "Thüringen",
                "Landkreis": "LK Altenburger Land",
                "AnzahlFall": 1,
                "AnzahlTodesfall": 0,
                "Meldedatum": 1589155200000,
                "Datenstand": "17.05.2020, 00:00 Uhr",
                "NeuerFall": 0,
                "NeuerTodesfall": -9
            }
        },
        {
            "attributes": {
                "Bundesland": "Thüringen",
                "Landkreis": "LK Altenburger Land",
                "AnzahlFall": 1,
                "AnzahlTodesfall": 0,
                "Meldedatum": 1584057600000,
                "Datenstand": "17.05.2020, 00:00 Uhr",
                "NeuerFall": 0,
                "NeuerTodesfall": -9
            }
        },
        {
            "attributes": {
                "Bundesland": "Thüringen",
                "Landkreis": "LK Altenburger Land",
                "AnzahlFall": 1,
                "AnzahlTodesfall": 0,
                "Meldedatum": 1584057600000,
                "Datenstand": "17.05.2020, 00:00 Uhr",
                "NeuerFall": 0,
                "NeuerTodesfall": -9
            }
        },
        {
            "attributes": {
                "Bundesland": "Thüringen",
                "Landkreis": "LK Altenburger Land",
                "AnzahlFall": 1,
                "AnzahlTodesfall": 0,
                "Meldedatum": 1585008000000,
                "Datenstand": "17.05.2020, 00:00 Uhr",
                "NeuerFall": 0,
                "NeuerTodesfall": -9
            }
        },
        {
            "attributes": {
                "Bundesland": "Thüringen",
                "Landkreis": "LK Altenburger Land",
                "AnzahlFall": 1,
                "AnzahlTodesfall": 0,
                "Meldedatum": 1585612800000,
                "Datenstand": "17.05.2020, 00:00 Uhr",
                "NeuerFall": 0,
                "NeuerTodesfall": -9
            }
        },
        {
            "attributes": {
                "Bundesland": "Thüringen",
                "Landkreis": "LK Altenburger Land",
                "AnzahlFall": 1,
                "AnzahlTodesfall": 0,
                "Meldedatum": 1585612800000,
                "Datenstand": "17.05.2020, 00:00 Uhr",
                "NeuerFall": 0,
                "NeuerTodesfall": -9
            }
        },
        {
            "attributes": {
                "Bundesland": "Thüringen",
                "Landkreis": "LK Altenburger Land",
                "AnzahlFall": 1,
                "AnzahlTodesfall": 1,
                "Meldedatum": 1586217600000,
                "Datenstand": "17.05.2020, 00:00 Uhr",
                "NeuerFall": 0,
                "NeuerTodesfall": 0
            }
        },
        {
            "attributes": {
                "Bundesland": "Thüringen",
                "Landkreis": "LK Altenburger Land",
                "AnzahlFall": 1,
                "AnzahlTodesfall": 0,
                "Meldedatum": 1587427200000,
                "Datenstand": "17.05.2020, 00:00 Uhr",
                "NeuerFall": 0,
                "NeuerTodesfall": -9
            }
        },
        {
            "attributes": {
                "Bundesland": "Thüringen",
                "Landkreis": "LK Altenburger Land",
                "AnzahlFall": 1,
                "AnzahlTodesfall": 0,
                "Meldedatum": 1589155200000,
                "Datenstand": "17.05.2020, 00:00 Uhr",
                "NeuerFall": 0,
                "NeuerTodesfall": -9
            }
        },
        {
            "attributes": {
                "Bundesland": "Thüringen",
                "Landkreis": "LK Altenburger Land",
                "AnzahlFall": 1,
                "AnzahlTodesfall": 0,
                "Meldedatum": 1584316800000,
                "Datenstand": "17.05.2020, 00:00 Uhr",
                "NeuerFall": 0,
                "NeuerTodesfall": -9
            }
        },
        {
            "attributes": {
                "Bundesland": "Thüringen",
                "Landkreis": "LK Altenburger Land",
                "AnzahlFall": 1,
                "AnzahlTodesfall": 0,
                "Meldedatum": 1585267200000,
                "Datenstand": "17.05.2020, 00:00 Uhr",
                "NeuerFall": 0,
                "NeuerTodesfall": -9
            }
        },
        {
            "attributes": {
                "Bundesland": "Thüringen",
                "Landkreis": "LK Altenburger Land",
                "AnzahlFall": 1,
                "AnzahlTodesfall": 0,
                "Meldedatum": 1585785600000,
                "Datenstand": "17.05.2020, 00:00 Uhr",
                "NeuerFall": 0,
                "NeuerTodesfall": -9
            }
        },
        {
            "attributes": {
                "Bundesland": "Thüringen",
                "Landkreis": "LK Altenburger Land",
                "AnzahlFall": 1,
                "AnzahlTodesfall": 0,
                "Meldedatum": 1586044800000,
                "Datenstand": "17.05.2020, 00:00 Uhr",
                "NeuerFall": 0,
                "NeuerTodesfall": -9
            }
        },
        {
            "attributes": {
                "Bundesland": "Thüringen",
                "Landkreis": "LK Altenburger Land",
                "AnzahlFall": 1,
                "AnzahlTodesfall": 0,
                "Meldedatum": 1586995200000,
                "Datenstand": "17.05.2020, 00:00 Uhr",
                "NeuerFall": 0,
                "NeuerTodesfall": -9
            }
        },
        {
            "attributes": {
                "Bundesland": "Thüringen",
                "Landkreis": "LK Altenburger Land",
                "AnzahlFall": 1,
                "AnzahlTodesfall": 0,
                "Meldedatum": 1587513600000,
                "Datenstand": "17.05.2020, 00:00 Uhr",
                "NeuerFall": 0,
                "NeuerTodesfall": -9
            }
        },
        {
            "attributes": {
                "Bundesland": "Thüringen",
                "Landkreis": "LK Altenburger Land",
                "AnzahlFall": 1,
                "AnzahlTodesfall": 1,
                "Meldedatum": 1585008000000,
                "Datenstand": "17.05.2020, 00:00 Uhr",
                "NeuerFall": 0,
                "NeuerTodesfall": 0
            }
        },
        {
            "attributes": {
                "Bundesland": "Thüringen",
                "Landkreis": "LK Altenburger Land",
                "AnzahlFall": 1,
                "AnzahlTodesfall": 0,
                "Meldedatum": 1585267200000,
                "Datenstand": "17.05.2020, 00:00 Uhr",
                "NeuerFall": 0,
                "NeuerTodesfall": -9
            }
        },
        {
            "attributes": {
                "Bundesland": "Thüringen",
                "Landkreis": "LK Altenburger Land",
                "AnzahlFall": 1,
                "AnzahlTodesfall": 0,
                "Meldedatum": 1588809600000,
                "Datenstand": "17.05.2020, 00:00 Uhr",
                "NeuerFall": 0,
                "NeuerTodesfall": -9
            }
        },
        {
            "attributes": {
                "Bundesland": "Thüringen",
                "Landkreis": "LK Altenburger Land",
                "AnzahlFall": 1,
                "AnzahlTodesfall": 0,
                "Meldedatum": 1588723200000,
                "Datenstand": "17.05.2020, 00:00 Uhr",
                "NeuerFall": 0,
                "NeuerTodesfall": -9
            }
        },
        {
            "attributes": {
                "Bundesland": "Thüringen",
                "Landkreis": "LK Altenburger Land",
                "AnzahlFall": 1,
                "AnzahlTodesfall": 0,
                "Meldedatum": 1589155200000,
                "Datenstand": "17.05.2020, 00:00 Uhr",
                "NeuerFall": 0,
                "NeuerTodesfall": -9
            }
        }
    ]
}