{
  "type": "service_account",
  "project_id": "curso-devops-zenaida",
  "private_key_id": "59553fcd80855f7e6071f58a790dbf9408bdd8cf",
  "private_key": "-----BEGIN PRIVATE KEY-----\nMIIEvQIBADANBgkqhkiG9w0BAQEFAASCBKcwggSjAgEAAoIBAQC/6K65r/zudkE7\nu92JKUn0fZfbcEt2wPcF/MuUF04UYER21PrDzZNFE97gV0Ar0ujr0Ji2Ly5guDc5\nZsmzt2OV0lKkY8pvDW1s7KYVprCwAUQRXv+zxGHtSgMtpJqVaXXdLal884/jEFD9\nt3MCMi50nlAvvJk8/uM/Rehmbi2DlYYo9z6lVX/KQeF3zVI1nWK/7EP/ovWGaEpi\nkd1heT8xQ3XnEHW3vPtFr5/bKr0gKHaqwtLBxpl/X7cGMV+ant0GQpj7k9j7nDLR\nYqEUkEqX8Za7cuAX4Z9gSqkZ3R8mwUInoU4TtLVK7k6hCpvThZdmaymRQ8mlaKmG\n+QGedXNrAgMBAAECggEAW5lDNKw0jNly34EXB63md8Uuo3Xg/yixf3Ee9mt9QCqG\n4zVbD/Rik7kdS3U50vETbeMd0O+KMm4bJdHS+m3RIaTG/2IGMKV3EmOODo2Gjiu8\ngpIWeIaGu0z1YWbMxf4VXOG7oUFb72RNVByoz2aGV/Fskqxxc/SxIPVMLP/vx3rV\nhrs/6dRQ+CZR0OLxGWhBgpYTLjqFtylQ1t/Q9WBx63iYvan3ND6q/eZ6oZXCE1Il\ni7kRALmsqXCcsYBmhPmKwgJzidoy2lXS8o0kgpgzE3kimhLRQ1eRfiTz+qH4502o\nxVBiKK3Sc5MAFHu8ToGgiWURubKlhrcnMvhzIQrEEQKBgQDzxHCEDg22gvtmOBpT\nA+bFofMCyaGy9IFdVSw/s4DYMpuuNaD6lZLNdXuBjMfAtecvXZrzAVfRst+faXlk\niFtmszrwuiNGkxzmp6Rap6J7CM4VR2ecsEzgQgRXuSyXTnscDSta6CprJRV6Pteh\nH6BT2PrbTA3YzIz6kjT4LQfsEwKBgQDJigsEGylq4bgbUuikbp1odpmtVXuJLtxH\nXCMKmv8tGC9T9FuDbiDryg27TA0TCvfexQ2EGAs4apHd1UKl9LYFudm5jcoQqBSa\nGFf1r3uO7O6z4XNszCEs1W86ZH7Xh23U9dx1EoOYGrBMNUE4kiVRmqJj3pkgq7XV\na1pj7aCWSQKBgQDCM2Z8HgIYvALyrZFzP3FzU5EZUG9M9XO2WmuVGDl2g+L5B+qG\nl/DLVGQfknt08LYMSyNto01GV53GDy5RxDwk9nbnXzNJP1xP+ZB7VH+iSyJ7W1aV\nQvML2ixBgtmedTyo3WkD1GAu2e1hZX099Mcy5XL8kHubk2JhIWenq6BbFwKBgFVC\nheiFyR7DQMymZW7ysLq5ucefazSc02mI6/YXni4olhURQgm29Exr3SVIRhuxPy1J\n9a7VMSH7y5uqFZj5jmubtSUPe9VSFe0esU9pnn7XcyA8F0WGkd5SqMxuKU7qpyc5\nn7sTSwJ0//ItcVsKUKlWHq7bQ7KTkcgos0OlCpOpAoGAXwZbBYe2RAqC8rMgxfUp\n7zb5/1uSMhKVxu8gRjg9xpzxmzN1XA+X5W48Hy10IFBz66Oy/zeWntPt/eMC6jx/\npHmw8kLkPIZK/EMgJSearNorHCGpdo2u+peJ5E24eD/j8vSe0qmQNOaUeaaWEf+c\n5PKXxBcFAsQwMLplfWvM3HM=\n-----END PRIVATE KEY-----\n",
  "client_email": "service-jenkins@curso-devops-zenaida.iam.gserviceaccount.com",
  "client_id": "112432085913913463198",
  "auth_uri": "https://accounts.google.com/o/oauth2/auth",
  "token_uri": "https://oauth2.googleapis.com/token",
  "auth_provider_x509_cert_url": "https://www.googleapis.com/oauth2/v1/certs",
  "client_x509_cert_url": "https://www.googleapis.com/robot/v1/metadata/x509/service-jenkins%40curso-devops-zenaida.iam.gserviceaccount.com"
}
