value2,date
784.288,0
784.288,1
784.288,2
784.288,3
784.288,4
784.288,5
784.288,6
784.288,7
784.288,8
784.288,9
784.288,10
784.288,11
784.288,12
784.288,13
7232.130999999999,14
7335.383000000002,15
8146.053000000002,16
8158.720000000002,17
8940.342000000002,18
8940.3420225378,19
9624.351000000002,20
10498.959000000004,21
10822.375000000002,22
11261.125000000002,23
11944.464000000002,24
12919.247,25
13758.521,26
13578.838,27
13266.594,28
12913.685,29
12456.661,30
12912.221,31
13805.028,32
14425.307,33
14560.395,34
14740.34,35
15667.356,36
15667.356177726413,37
15667.3563605098,38
17361.09,39
17838.458,40
17966.066,41
18748.483,42
19552.435,43
19552.435390144972,44
20666.462000000003,45
20666.462472615945,46
20666.462957090032,47
22591.904,48
22904.377000000004,49
23543.629000000004,50
23828.043000000005,51
23828.04377642827,52
25584.800000000003,53
25939.743,54
25939.74402076504,55
27374.712,56
27843.574,57
27979.004,58
27979.005331747536,59
29110.266,60
29938.586,61
30018.838,62
30554.532,63
30948.214,64
31646.501,65
31646.503061827527,66
32866.767,67
33134.813,68
33315.826,69
33315.82851425162,70
33315.831072857676,71
33315.833675818176,72
35992.044,73
36894.608,74
37233.898,75
37581.119,76
37581.122806612584,77
38455.931,78
39403.513000000006,79
40325.416000000005,80
40424.812000000005,81
41130.77500000001,82
41130.78021674547,83
41814.70100000001,84
42310.91400000001,85
42962.49300000001,86
43631.33000000001,87
43693.55200000001,88
44050.70500000001,89
44244.12700000001,90
44840.350000000006,91
45632.92600000001,92
46167.55900000001,93
46168.810000000005,94
46364.41500000001,95
47014.85300000001,96
47966.06900000001,97
48908.35800000001,98
49379.592,99
49876.48100000001,100
50436.62100000001,101
50513.918000000005,102
51509.65700000001,103
52019.78200000001,104
52484.842,105
52484.855138915525,106
53163.681,107
54132.467,108
54478.331000000006,109
55082.59300000001,110
55299.047000000006,111
55299.0630948973,112
55299.07937456465,113
57467.869000000006,114
58320.41700000001,115
59128.69800000001,116
59445.818000000014,117
59820.960000000014,118
59820.981200709975,119
59821.00263216635,120
60871.532000000014,121
61765.02400000001,122
61854.40300000001,123
62537.621000000014,124
63353.34600000001,125
63642.415000000015,126
64175.70600000001,127
65083.746000000014,128
65522.46900000001,129
66407.42300000001,130
66407.45425408012,131
66407.48581875736,132
67182.28600000001,133
68157.315,134
68517.052,135
68517.0875165943,136
69366.157,137
69397.99900000001,138
69398.03674430255,139
70560.12100000001,140
70750.90900000001,141
71532.33500000002,142
71890.24900000003,143
71890.29227944341,144
72680.64500000003,145
72680.69032831509,146
73862.54700000004,147
73862.5951089979,148
72223.89100000003,149
71688.11700000003,150
70851.55600000003,151
70274.35200000003,152
70291.14400000003,153
70291.18810351497,154
71001.20900000003,155
71192.23200000003,156
72085.10600000003,157
73026.38700000003,158
73329.83600000002,159
73951.51000000002,160
74204.21700000002,161
74303.61200000002,162
74876.13900000002,163
75433.25000000003,164
76131.82500000003,165
76131.88656508643,166
76131.94860577313,167
76132.0111220601,168
76132.07411394735,169
76132.1375814349,170
76132.20152452272,171
76132.26594321083,172
76132.33083749923,173
76132.39620738791,174
76132.46205287687,175
76132.52837396612,176
76132.59517065565,177
76132.66244294547,178
76132.73019083557,179
84715.753,180
85203.417,181
85203.51257482439,182
85203.60883513188,183
86642.634,184
86798.407,185
86798.51052005816,186
87762.79000000001,187
87762.89825598002,188
87833.79800000001,189
87833.90800943466,190
87834.01877315648,191
87834.1302911655,192
89227.43100000001,193
90071.07600000002,194
90890.219,195
91620.798,196
92243.839,197
92243.97225054339,198
94143.907,199
95017.724,200
95326.984,201
95970.81,202
95970.9633922649,203
97335.016,204
97690.986,205
98266.118,206
99035.585,207
99892.179,208
100349.767,209
100737.645,210
101362.858,211
101925.464,212
102893.387,213
103564.384,214
103825.49,215
104821.225,216
105497.137,217
105701.94,218
105718.919,219
106475.946,220
106476.17191757548,221
106476.3991900826,222
106476.62781752132,223
106476.85779989166,224
108608.757,225
109021.074,226
109021.3230403351,227
110018.277,228
110925.849,229
111746.557,230
111746.82891285056,231
111992.988,232
112594.474,233
112594.75614046058,234
113602.402,235
113605.204,236
113783.625,237
113783.92161703874,238
113492.96,239
112850.476,240
112276.897,241
112163.045,242
112381.34600000002,243
113118.818,244
113997.97500000002,245
114792.553,246
115301.412,247
115301.73715848278,248
116688.24,249
116702.109,250
116702.45053819811,251
118137.604,252
118403.686,253
118407.105,254
118521.359,255
118521.7247795755,256
118966.42,257
119485.271,258
120303.303,259
121119.105,260
121148.986,261
121924.537,262
122025.48,263
122190.194,264
122410.61,265
122411.0308486849,266
123312.092,267
123397.163,268
123515.992,269
123888.485,270
123888.93103519306,271
124373.349,272
124430.03,273
124991.728,274
125174.287,275
125345.284,276
125345.75853930485,277
126160.981,278
126784.419,279
127374.777,280
127751.26399999998,281
128232.11599999998,282
128232.63690891289,283
129403.85199999998,284
130028.01099999998,285
130186.216,286
131070.58,287
131252.74,288
131253.31201491915,289
132412.552,290
133161.346,291
133161.94992391748,292
133965.20099999997,293
134139.62799999997,294
134897.76599999997,295
135350.20799999998,296
136153.12499999997,297
136424.55199999997,298
136425.2187891952,299
137121.13599999994,300
137821.43299999993,301
138515.61399999994,302
138896.75399999996,303
139079.21899999995,304
139926.84999999995,305
140412.48399999994,306
140413.23210498932,307
141639.64599999992,308
142322.0249999999,309
142322.81158883462,310
143393.63799999992,311
144232.2529999999,312
144233.07935585795,313
146049.32899999988,314
147037.41599999988,315
147038.29770934503,316
147039.18312669185,317
148178.2959999999,318
148732.7919999999,319
148733.71661065877,320
150394.3009999999,321
150395.261452065,322
150396.22587262743,323
150397.19426168723,324
153036.7839999999,325
153057.4409999999,326
153365.5639999999,327
153366.60080094228,328
154693.52399999992,329
155514.44399999993,330
155947.92299999992,331
156483.77099999992,332
156600.1849999999,333
156767.4979999999,334
157224.2899999999,335
157225.43339264067,336
158801.1999999999,337
159728.0129999999,338
160262.68799999988,339
160919.22899999988,340
160920.4687895936,341
161803.71299999987,342
161850.50099999987,343
161890.61399999988,344
161891.893175785,345
162980.46199999988,346
162981.77411311364,347
163925.7269999999,348
164650.0879999999,349
164823.6489999999,350
165198.5209999999,351
165597.4849999999,352
165793.9899999999,353
165795.3997020508,354
166949.0579999999,355
167277.9239999999,356
167279.38366306596,357
169201.6579999999,358
169444.18399999992,359
168940.77899999992,360
168942.29955291492,361
167786.6339999999,362
167456.9689999999,363
167373.02999999988,364
167650.75299999988,365
167726.38999999987,366
168487.61299999987,367
168596.59899999987,368
169554.66099999988,369
170305.84299999988,370
170600.04799999986,371
170601.6737541047,372
171504.10399999985,373
172214.04899999985,374
172831.34899999984,375
172891.19699999984,376
173826.88499999983,377
173831.95699999982,378
173893.25799999983,379
174710.52399999983,380
175680.14099999983,381
176461.57899999982,382
177285.22099999982,383
178003.0559999998,384
178635.27499999982,385
178894.0669999998,386
179581.3419999998,387
180561.9589999998,388
180625.7279999998,389
181589.0339999998,390
181708.87299999985,391
181687.42999999985,392
180819.49199999985,393
180719.82499999984,394
180258.39699999985,395
180816.32499999984,396
181403.00799999983,397
181405.1083530451,398
182742.63099999985,399
183219.72899999985,400
183897.5309999998,401
183899.74072519637,402
184545.5609999998,403
184547.80676111445,404
186451.84599999984,405
187132.8759999998,406
187163.3579999998,407
187165.72236664136,408
187168.09440737573,409
187170.4741222029,410
187172.8615111229,411
187175.2565741357,412
187177.65931124132,413
187180.06972243977,414
187182.48780773103,415
187184.9135671151,416
191846.63499999975,417
191849.2458900682,418
193050.15899999975,419
193059.5679999998,420
193619.3849999998,421
194523.34599999984,422
195381.17199999985,423
196209.2269999998,424
196266.2189999998,425
197170.6399999998,426
197332.4959999998,427
197335.40313072084,428
197338.319279193,429
198434.0899999998,430
199284.67499999976,431
199287.69717068647,432
201054.83999999976,433
201838.68699999977,434
201886.27099999975,435
202234.07799999975,436
202513.26399999976,437
203282.14499999976,438
203731.15899999972,439
203890.5189999997,440
203893.8203669396,441
203897.1316827868,442
204811.01699999973,443
204814.38843851467,444
205258.1279999997,445
205282.5759999997,446
206001.18799999973,447
206004.6531682266,448
206877.2039999997,449
207280.25899999973,450
207633.70199999973,451
208058.1219999997,452
208061.73378610134,453
208065.35614754682,454
208068.98908433612,455
210682.4219999998,456
211132.3909999998,457
211364.7119999998,458
211368.54642426537,459
212791.1829999998,460
213775.0439999998,461
213908.9219999998,462
214398.70499999975,463
215101.9619999998,464
215415.6329999998,465
216238.3669999998,466
216517.8179999998,467
217042.6409999998,468
217048.3439999998,469
217219.5749999998,470
217223.84278479134,471
218678.76399999985,472
218727.8029999998,473
218732.187029048,474
218736.58334762807,475
220177.52299999984,476
220541.05299999984,477
221191.18099999984,478
221639.12199999983,479
221800.28399999984,480
222364.44599999985,481
223260.28299999985,482
224206.79899999985,483
224888.96299999984,484
225796.23699999985,485
225801.169395712,486
225806.11530771974,487
227829.05499999985,488
228488.60399999985,489
228493.74850157305,490
230132.36399999983,491
230337.59299999985,492
231217.12199999983,493
231222.4864987374,494
231227.8654903731,495
232470.56699999984,496
233196.11899999983,497
233713.93599999984,498
233719.52699777507,499
234614.28599999985,500
234675.09999999983,501
234680.79587989498,502
235544.51499999984,503
235550.296475977,504
236306.79699999985,505
236866.21899999984,506
237137.55699999983,507
237480.7699999998,508
238317.38899999985,509
238323.44423092745,510
239165.97599999985,511
239178.2869999998,512
239040.36999999985,513
239046.53595211223,514
238800.42399999985,515
238806.60443793592,516
238146.47399999984,517
238152.6396624603,518
238932.52099999983,519
238938.7729607846,520
238945.04085953766,521
240559.0649999998,522
240565.48030526,523
240571.91187844114,524
241740.59499999983,525
241747.1440528765,526
242969.72599999985,527
243701.70299999983,528
244236.71999999983,529
245019.90399999983,530
245026.77896948223,531
246069.71899999984,532
246649.37499999985,533
247360.96399999983,534
248333.60399999985,535
248969.10699999984,536
249283.75899999985,537
249291.0818319795,538
250381.38899999985,539
250474.98499999984,540
251298.72999999984,541
251539.94399999984,542
252406.31299999985,543
252413.99209985504,544
253651.74199999985,545
254222.65299999985,546
254872.98499999984,547
255454.30499999985,548
255462.32693663938,549
256535.08199999985,550
256543.2322459112,551
256551.40219181994,552
258453.54799999984,553
258461.91871464776,554
259734.63199999984,555
259743.15200782387,556
259751.6924441194,557
261264.67899999983,558
261273.39191892304,559
261889.34899999984,560
262354.5929999998,561
262363.46284492075,562
263432.50999999983,563
263489.58399999986,564
264219.30699999986,565
264914.1689999999,566
264923.37298275036,567
265944.5269999999,568
265953.8676667694,569
267098.60599999985,570
267396.15699999983,571
267405.6965272141,572
268572.17799999984,573
268581.8715715587,574
270222.2779999998,575
271015.4849999998,576
271657.88499999983,577
271667.96235306235,578
271678.06297977985,579
271688.1868801524,580
271698.3340541799,581
271708.5045018624,582
271718.69822319987,583
271728.9152181923,584
271739.15548683977,585
271749.4190291422,586
271759.7058450996,587
271770.01593471196,588
271780.3492979793,589
271790.70593490166,590
271801.08584547904,591
271811.4890297114,592
271821.91548759874,593
271832.36521914107,594
271842.83822433837,595
271853.33450319065,596
271863.8540556979,597
271874.39688186016,598
271884.9629816774,599
271895.5523551496,600
271906.1650022768,601
271916.80092305894,602
271927.46011749614,603
271938.1425855883,604
271948.8483273355,605
271959.57734273764,606
271970.32963179477,607
286279.52299999964,608
286673.49499999965,609
286685.9181822003,610
286698.36851805693,611
287526.21799999964,612
288308.95599999966,613
288702.37099999964,614
289658.12099999964,615
289910.96899999963,616
289923.9493022653,617
290185.5039999996,618
291048.7049999996,619
291866.9459999996,620
292183.4449999996,621
292323.4649999996,622
293070.8009999996,623
293084.3471555791,624
293799.32799999963,625
294201.85799999966,626
294242.4209999997,627
294530.8259999997,628
294934.2629999997,629
295545.3159999997,630
296171.6059999997,631
296185.75725732354,632
297355.3389999997,633
297380.0929999997,634
297394.4818736977,635
297408.9009072357,636
298861.0149999997,637
299153.1799999997,638
299573.0639999997,639
299587.87901103985,640
300324.2509999997,641
301282.0969999997,642
302099.3199999997,643
302114.5851817579,644
302888.78599999973,645
302904.21595421387,646
304428.3069999997,647
305004.50999999966,648
305493.52199999965,649
306110.8829999996,650
306126.32099999965,651
307046.95599999966,652
307063.16468290053,653
308715.4259999997,654
309118.09699999966,655
309343.8989999997,656
309400.8659999997,657
309417.55938044057,658
309702.83499999973,659
310299.58499999973,660
310387.5259999997,661
311312.5649999997,662
311329.69100935955,663
312501.0069999997,664
312663.2539999997,665
312761.3089999997,666
312907.9089999997,667
312925.42860882345,668
312942.98310551123,669
315243.4079999997,670
315261.3733612982,671
316048.6529999997,672
316804.2999999997,673
316822.60051363736,674
317586.8869999997,675
317983.5859999997,676
318002.16736344027,677
319718.27499999973,678
320534.8459999997,679
320788.0979999997,680
321059.2929999997,681
321828.3849999997,682
321947.4279999997,683
322400.01399999973,684
323362.15499999974,685
323753.34299999976,686
324517.29999999976,687
325218.08399999974,688
325238.2230650106,689
326385.2989999997,690
326642.4619999997,691
327368.43799999973,692
327439.6589999997,693
327866.0859999998,694
327886.87511355354,695
328218.1489999998,696
328559.3349999998,697
329286.6099999998,698
329525.86299999984,699
329547.1137812044,700
330609.12399999984,701
331486.15699999983,702
331507.85342505167,703
331696.48699999985,704
332159.80299999984,705
332181.7282099477,706
333637.6059999998,707
334127.6749999998,708
334150.0574006768,709
335613.64899999986,710
335636.3703389026,711
335659.1342541532,712
335681.94074575166,713
335704.78981369804,714
335727.6814579923,715
336701.57399999985,716
336724.72235894826,717
337748.8919999999,718
338739.8649999999,719
338763.5029440456,720
339813.71999999986,721
340235.85099999985,722
341024.7939999999,723
341049.0139772879,724
341073.27848322236,725
341141.3749999999,726
341165.736809588,727
340335.8799999999,728
339527.60499999986,729
339900.0869999999,730
339924.37146510516,731
340164.3249999999,732
340188.73912846425,733
340686.5259999999,734
341329.2889999999,735
342266.8569999999,736
342913.3689999999,737
343420.2859999999,738
343995.2909999999,739
344845.95199999993,740
345818.66199999995,741
346175.03299999994,742
346344.732,743
346713.73,744
347107.392,745
347411.062,746
348019.35,747
348453.114,748
348750.172,749
349118.129,750
349145.06640796515,751
349172.0513573469,752
350133.71400000004,753
351040.68000000005,754
351068.1882721565,755
351448.34500000003,756
350646.69,757
350674.241591801,758
349638.655,759
349017.861,760
349901.017,761
350059.598,762
350682.911,763
350989.95900000003,764
351017.88202834985,765
352246.272,766
352935.278,767
352963.75554570334,768
354225.45800000004,769
354974.53,770
355656.77200000006,771
356333.55000000005,772
356442.128,773
356471.64758946805,774
356933.275,775
357654.34500000003,776
357710.591,777
358351.09500000003,778
358951.81000000006,779
359308.481,780
360250.98500000004,781
360876.942,782
360907.88086242724,783
360938.87198838673,784
360969.91537787847,785
363646.0120000001,786
363946.399,787
364677.238,788
365414.831,789
365531.968,790
365796.752,791
366586.871,792
366782.381,793
367753.486,794
368077.645,795
368433.144,796
368902.476,797
369390.185,798
369509.814,799
369669.78,800
370242.899,801
370467.842,802
370502.0229235617,803
371484.371,804
371496.404,805
371922.008,806
372264.98400000005,807
372690.9110000001,808
373662.1490000001,809
374231.59700000007,810
375175.07100000005,811
375210.88800220506,812
376391.1060000001,813
376427.3371266101,814
377720.3050000001,815
377756.98277866474,816
379316.8700000001,817
379508.6960000001,818
379545.9952949688,819
380451.0110000001,820
381424.2620000001,821
382231.4420000001,822
383076.3520000001,823
383844.0630000001,824
383861.48300000007,825
384263.95600000006,826
384505.7620000001,827
384995.818,828
385606.77200000006,829
385904.208,830
386279.53200000006,831
386763.7400000001,832
386861.197,833
387111.269,834
387352.525,835
388206.285,836
388923.717,837
389698.914,838
390548.559,839
390964.396,840
391005.9904262046,841
392048.861,842
392510.955,843
392894.958,844
392990.341,845
393032.7873770727,846
393768.852,847
394591.728,848
394803.411,849
394846.6042425491,850
395374.3229999999,851
396137.6459999999,852
396370.7149999999,853
396414.59118323686,854
397863.669,855
398596.444,856
399463.274,857
400069.128,858
400111.936,859
400454.217,860
400707.453,861
400969.984,862
401015.7469648188,863
401061.5803135286,864
401107.48404612934,865
401153.458162621,866
401199.50266300363,867
401245.6175472772,868
401291.80281544174,869
402970.044,870
403016.8787812727,871
403485.1869999999,872
403591.4109999999,873
404179.2589999999,874
404953.8779999999,875
405001.6251121029,876
405361.17999999993,877
405271.978,878
404316.913,879
404364.68139797606,880
404412.52155380376,881
402701.526,882
403067.76699999993,883
403670.624,884
404579.741,885
404802.523,886
405428.333,887
405476.9191369886,888
405525.5774469011,889
407088.166,890
407916.222,891
408833.084,892
408889.36,893
408939.441308916,894
408989.5965771509,895
409039.8258047046,896
409090.1289915772,897
409140.50613776856,898
409190.9572432788,899
409241.48230810784,900
413131.826,901
413880.79,902
414724.665,903
415299.654,904
415424.596,905
416054.516,906
416383.03899999993,907
417069.456,908
417809.085,909
418542.507,910
418596.9211369551,911
418843.738,912
419613.124,913
420014.415,914
420947.771,915
421346.868,916
421770.0,917
422022.525,918
422955.677,919
423135.147,920
423718.203,921
424691.378,922
425409.449,923
426309.902,924
426482.02799999993,925
427304.8829999999,926
427530.88699999993,927
428295.928,928
428892.677,929
428997.71,930
429003.16,931
429315.579,932
430182.156,933
430242.2459677046,934
431338.872,935
431534.765,936
432018.7839999999,937
432079.82459072274,938
432500.1589999999,939
432561.51028629544,940
433762.2529999999,941
434373.84899999993,942
435294.0349999999,943
435586.1939999999,944
435882.5919999999,945
435945.6371535642,946
436388.10399999993,947
437237.548,948
437258.571,949
437313.20199999993,950
437517.917,951
438358.401,952
438635.3219999999,953
439029.0569999999,954
439712.2049999999,955
439865.5239999999,956
439930.85774329124,957
440064.081,958
440097.737,959
440816.503,960
441091.37,961
441671.313,962
441737.76796211925,963
442468.656,964
442535.56765893265,965
442602.57101182523,966
444685.048,967
445671.681,968
445234.465,969
445302.84802392934,970
444946.462,971
444564.873,972
444633.1669540773,973
445498.81599999993,974
445848.994,975
445918.02428964514,976
446843.939,977
447092.554,978
447667.103,979
447737.16818221327,980
448463.83799999993,981
448966.375,982
449548.478,983
449619.6150526859,984
449690.84759297967,985
451126.876,986
451162.279,987
451695.368,988
452665.432,989
453658.405,990
453731.80259995954,991
454725.587,992
454799.5895959451,993
455743.694,994
456416.235,995
456491.190760051,996
457413.498,997
457649.987,998
457725.69628450816,999
458882.535,1000
459460.572,1001
459553.57500000007,1002
459652.9040000001,1003
459729.8541736264,1004
460710.6670000001,1005
461566.4330000001,1006
462062.5790000001,1007
462140.9041181552,1008
462533.64700000006,1009
463475.53,1010
463755.14,1011
464300.711,1012
464456.551,1013
464536.39205081627,1014
465253.815,1015
465396.99,1016
465451.589,1017
466006.855,1018
466363.27,1019
467004.321,1020
467842.098,1021
468051.7,1022
468536.7569999999,1023
468565.647,1024
469513.4209999999,1025
470162.3029999999,1026
470615.7749999999,1027
470815.3229999999,1028
471813.9689999999,1029
472739.3219999999,1030
473513.6879999999,1031
474316.2319999999,1032
474844.4379999999,1033
475116.1189999999,1034
475874.5379999999,1035
476451.7039999999,1036
476702.9099999999,1037
476727.4989999999,1038
476739.7069999999,1039
477168.8539999999,1040
477256.6866785069,1041
478931.4029999999,1042
479020.2584111808,1043
480086.6319999999,1044
480466.8149999999,1045
481063.2219999999,1046
481811.1129999999,1047
482367.4469999999,1048
482458.4579029557,1049
483919.6419999999,1050
484011.5863416884,1051
485132.5019999999,1052
485511.3839999999,1053
485985.8419999999,1054
486079.1287086728,1055
486106.2339999999,1056
486643.0139999999,1057
486736.8492751823,1058
487782.3099999999,1059
487869.5879999999,1060
487872.6819999999,1061
488679.5999999999,1062
488774.8481116405,1063
489828.0939999999,1064
490746.9919999999,1065
490752.86799999984,1066
490832.6269999999,1067
491207.1709999999,1068
491304.1734797463,1069
492496.1149999999,1070
493360.5989999999,1071
494031.1629999999,1072
494129.9606726068,1073
495227.9089999999,1074
496097.1329999999,1075
497038.22199999983,1076
497381.0839999999,1077
497422.9779999998,1078
497524.0347833038,1079
498423.5339999998,1080
499017.2279999998,1081
499622.0869999998,1082
500527.5379999998,1083
501152.4349999998,1084
501806.36799999984,1085
502563.42299999984,1086
502667.8789969931,1087
502772.46245759004,1088
503734.0279999998,1089
503839.3473910549,1090
503944.79491509014,1091
504050.37057210546,1092
501730.92299999984,1093
501623.0769999998,1094
501904.55799999984,1095
502239.0119999999,1096
502525.3309999999,1097
503440.2809999999,1098
503546.0512270105,1099
504039.961,1100
504130.83,1101
504899.494,1102
505034.423,1103
505584.823,1104
505692.2299327223,1105
505908.511,1106
506016.2380805668,1107
507013.933,1108
507039.72,1109
507308.371,1110
508277.302,1111
508936.251,1112
509665.353,1113
509956.197,1114
510153.131,1115
510966.988,1116
511623.202,1117
512322.107,1118
512434.4157695928,1119
513754.594,1120
514517.877,1121
514034.388,1122
513371.9740000001,1123
512828.36,1124
512941.35694060393,1125
512816.12500000006,1126
513702.0660000001,1127
513855.88600000006,1128
514657.393,1129
515172.3760000001,1130
515908.981,1131
516858.822,1132
517181.753,1133
517297.9925690938,1134
519145.083,1135
519262.66587510763,1136
520331.835,1137
521301.398,1138
521468.0150000001,1139
521639.1380000001,1140
521758.59351823595,1141
522663.1020000001,1142
522783.32754749275,1143
523173.4750000001,1144
523282.1400000001,1145
524056.409,1146
524859.7710000001,1147
525829.795,1148
526265.525,1149
526730.924,1150
526752.742,1151
527590.027,1152
528208.759,1153
528911.1259999999,1154
528969.4389999999,1155
529242.5589999999,1156
529367.8624531925,1157
530780.6299999999,1158
531093.2889999999,1159
532033.0129999999,1160
532414.019,1161
533143.3369999999,1162
534089.5539999999,1163
534218.4519675997,1164
534347.4962908352,1165
535176.5179999999,1166
535306.3164555094,1167
535899.168,1168
536006.948,1169
536022.053,1170
536089.188,1171
536963.12,1172
537045.44,1173
537856.1449999999,1174
538692.4219999999,1175
538849.1479999999,1176
539254.516,1177
540098.598,1178
540163.072,1179
540704.542,1180
541281.649,1181
541416.4469131137,1182
541985.635,1183
542610.8150000001,1184
542973.2840000001,1185
543320.1280000001,1186
543333.4260000001,1187
543469.9764409211,1188
543887.658,1189
544023.7000000001,1190
544960.4040000001,1191
545860.3610000001,1192
546698.1040000002,1193
547272.3700000001,1194
547426.2270000001,1195
548307.8230000001,1196
549079.9890000001,1197
549499.4010000001,1198
549665.099,1199
550185.138,1200
550523.893,1201
551370.604,1202
552157.4450000001,1203
552408.454,1204
553301.622,1205
553446.1695470192,1206
555011.962,1207
556007.099,1208
556673.5850000001,1209
556820.7610353064,1210
557788.403,1211
557846.2080000001,1212
558807.5780000001,1213
559558.68,1214
560078.662,1215
560842.111,1216
561562.03,1217
562179.814,1218
563022.414,1219
563174.7299548241,1220
563787.0099999999,1221
564040.0669999999,1222
564158.754,1223
564946.7609999999,1224
565100.7552778267,1225
565832.8449999999,1226
566693.0639999999,1227
567484.9249999999,1228
567641.0051590757,1229
568192.0059999999,1230
568480.8979999999,1231
568637.8742708974,1232
569358.137,1233
569405.335,1234
569564.134,1235
570486.7019999999,1236
570645.4349075108,1237
571725.8839999998,1238
571885.6502186545,1239
573511.0969999998,1240
574242.9829999999,1241
574404.8017896735,1242
574051.9639999998,1243
573300.9139999998,1244
573162.3789999997,1245
572813.4069999998,1246
572321.8669999997,1247
572482.5113373117,1248
573766.1679999998,1249
573928.013325644,1250
574608.2269999998,1251
575032.8769999999,1252
575195.8363202709,1253
575712.6259999998,1254
575958.6359999998,1255
576122.4477767634,1256
576989.6919999998,1257
577612.9709999998,1258
577665.6839999998,1259
578366.3599999998,1260
578989.5979999998,1261
579151.9619999997,1262
579953.2279999997,1263
580644.5299999997,1264
580812.4011639883,1265
581765.4009999997,1266
582749.8549999997,1267
583149.9189999998,1268
583830.2629999998,1269
584000.8653024088,1270
584674.7629999998,1271
584686.6649999998,1272
584712.0869999998,1273
585370.3019999998,1274
585542.3039999998,1275
586138.4369999998,1276
586311.1683113844,1277
586648.0659999998,1278
587576.7169999997,1279
587878.9009999997,1280
588053.1912285355,1281
588227.6607486898,1282
590047.0559999997,1283
590050.4119999998,1284
590213.7819999998,1285
590328.6669999998,1286
590522.5659999998,1287
590911.0639999998,1288
590969.2069999998,1289
591314.0099999998,1290
591366.8069999998,1291
591806.8559999998,1292
591984.7846240922,1293
592560.7319999998,1294
592608.1979999999,1295
593128.5519999999,1296
593660.315,1297
593681.367,1298
593810.1749999999,1299
594016.139,1300
594763.699,1301
595041.1610000001,1302
595328.3740000001,1303
595509.588116996,1304
595690.9848098332,1305
596612.648,1306
596629.4400000001,1307
597319.6860000001,1308
598073.6460000001,1309
598243.0360000001,1310
598456.359,1311
598640.4452666853,1312
599597.083,1313
599598.565,1314
599783.7045430713,1315
600407.7259999999,1316
601029.3039999999,1317
601250.2169999998,1318
601394.7699999998,1319
601505.8759999998,1320
602174.8729999998,1321
603058.8049999998,1322
603694.4369999998,1323
604044.6389999999,1324
604577.0919999998,1325
605305.4289999999,1326
605880.2539999998,1327
606724.4299999998,1328
606916.0596084046,1329
607482.8829999998,1330
607675.2179236892,1331
608850.9479999999,1332
608947.6909999999,1333
608523.0259999998,1334
607528.7659999998,1335
607464.8089999998,1336
606720.8329999998,1337
607185.3459999998,1338
607691.4819999998,1339
607884.177642437,1340
608283.8799999999,1341
608477.1349789599,1342
609175.6369999999,1343
609229.3589999998,1344
609423.5030000751,1345
611157.9529999999,1346
611569.6019999998,1347
611743.2819999999,1348
612594.3619999998,1349
612632.1149999999,1350
612829.3871666335,1351
613371.2699999999,1352
614191.4509999999,1353
614857.2339999999,1354
615055.8999999999,1355
615125.3809999999,1356
615985.083,1357
616137.953,1358
616928.392,1359
617372.2069999999,1360
617890.1529999999,1361
618694.043,1362
619598.887,1363
620391.3859999999,1364
620395.5269999999,1365
620509.6619999999,1366
620910.7319999998,1367
621258.8179999999,1368
621635.1109999998,1369
622477.6829999998,1370
623142.4769999998,1371
623349.5351746497,1372
624911.8329999999,1373
625056.2099999998,1374
625265.0554902429,1375
625474.0998323427,1376
627209.0849999998,1377
627746.9489999998,1378
627831.0029999998,1379
628410.2719999998,1380
628933.1799999998,1381
629258.5189999999,1382
629562.0629999998,1383
630445.2129999999,1384
630947.9319999999,1385
631880.298,1386
632029.874,1387
632482.836,1388
633200.072,1389
633672.2570000001,1390
634199.6390000001,1391
634417.0881352999,1392
634744.082,1393
635224.635,1394
635414.306,1395
635566.9689999999,1396
635785.7054945965,1397
636982.916,1398
637894.325,1399
637991.833,1400
638506.396,1401
638727.9209328151,1402
639647.9679999999,1403
640451.8089999999,1404
640809.5959999999,1405
641638.3749999999,1406
642281.9219999999,1407
642788.4779999999,1408
643014.081530531,1409
643023.5719999999,1410
643074.1989999999,1411
643275.9239999999,1412
643317.3719999999,1413
643888.2859999998,1414
644558.5749999998,1415
644785.8312013436,1416
645730.5009999998,1417
645958.8785909215,1418
646924.1959999999,1419
647553.8269999999,1420
648030.5219999999,1421
648820.8589999999,1422
649323.7529999999,1423
649555.5770822809,1424
649787.6143065813,1425
651033.7679999999,1426
651140.0659999999,1427
651259.0199999999,1428
651492.6741094248,1429
652076.4699999999,1430
652130.1229999999,1431
652161.3479999999,1432
652395.8238024878,1433
652630.5135406372,1434
653477.205,1435
653712.9335951067,1436
654459.6909999999,1437
654900.9799999999,1438
655138.0698538324,1439
655233.6929999999,1440
655741.7469999999,1441
656342.3979999998,1442
656808.7509999998,1443
657553.7829999998,1444
658489.2359999998,1445
658707.7409999998,1446
658750.6109999998,1447
659410.3899999998,1448
659912.6569999998,1449
660803.9809999998,1450
661434.3369999998,1451
661940.8039999998,1452
662184.661650443,1453
662105.5519999998,1454
662349.5183747323,1455
662593.7037913749,1456
662838.1082499274,1457
663082.7317503898,1458
663327.5742927622,1459
659746.6939999998,1460
