date,value
2018-01-01,268.188
2018-01-02,
2018-01-03,
2018-01-04,
2018-01-05,
2018-01-06,
2018-01-07,
2018-01-08,
2018-01-09,
2018-01-10,
2018-01-11,
2018-01-12,
2018-01-13,
2018-01-14,
2018-01-15,
2018-01-16,226.568
2018-01-17,226.212
2018-01-18,258.693
2018-01-19,210.607
2018-01-20,288.924
2018-01-21,224.231
2018-01-22,259.525
2018-01-23,298.188
2018-01-24,276.703
2018-01-25,168.757
2018-01-26,
2018-01-27,
2018-01-28,221.259
2018-01-29,279.685
2018-01-30,195.221
2018-01-31,208.535
2018-02-01,265.579
2018-02-02,158.189
2018-02-03,265.091
2018-02-04,
2018-02-05,
2018-02-06,
2018-02-07,154.994
2018-02-08,219.494
2018-02-09,167.946
2018-02-10,222.317
2018-02-11,268.282
2018-02-12,285.951
2018-02-13,298.867
2018-02-14,253.228
2018-02-15,234.523
2018-02-16,160.081
2018-02-17,177.663
2018-02-18,277.381
2018-02-19,219.931
2018-02-20,202.678
2018-02-21,189.114
2018-02-22,158.171
2018-02-23,
2018-02-24,278.44
2018-02-25,
2018-02-26,
2018-02-27,283.478
2018-02-28,223.516
2018-03-01,281.097
2018-03-02,232.462
2018-03-03,174.748
2018-03-04,275.791
2018-03-05,159.482
2018-03-06,254.366
2018-03-07,220.775
2018-03-08,270.901
2018-03-09,167.144
2018-03-10,282.426
2018-03-11,202.017
2018-03-12,201.41
2018-03-13,208.517
2018-03-14,150.721
2018-03-15,212.878
2018-03-16,296.672
2018-03-17,201.482
2018-03-18,254.85
2018-03-19,277.139
2018-03-20,194.334
2018-03-21,207.071
2018-03-22,169.264
2018-03-23,275.658
2018-03-24,267.92
2018-03-25,166.254
2018-03-26,294.215
2018-03-27,207.108
2018-03-28,193.894
2018-03-29,205.821
2018-03-30,169.229
2018-03-31,262.07
2018-04-01,199.086
2018-04-02,188.824
2018-04-03,
2018-04-04,194.812
2018-04-05,
2018-04-06,162.597
2018-04-07,
2018-04-08,173.579
2018-04-09,299.763
2018-04-10,282.075
2018-04-11,
2018-04-12,287.334
2018-04-13,
2018-04-14,292.926
2018-04-15,257.877
2018-04-16,172.986
2018-04-17,255.6
2018-04-18,270.089
2018-04-19,251.026
2018-04-20,228.594
2018-04-21,247.126
2018-04-22,
2018-04-23,207.466
2018-04-24,
2018-04-25,253.514
2018-04-26,184.36
2018-04-27,256.967
2018-04-28,178.447
2018-04-29,248.658
2018-04-30,260.066
2018-05-01,199.564
2018-05-02,
2018-05-03,162.705
2018-05-04,
2018-05-05,296.2
2018-05-06,
2018-05-07,196.345
2018-05-08,168.711
2018-05-09,
2018-05-10,291.962
2018-05-11,
2018-05-12,210.928
2018-05-13,173.763
2018-05-14,
2018-05-15,
2018-05-16,
2018-05-17,
2018-05-18,222.033
2018-05-19,
2018-05-20,297.198
2018-05-21,236.847
2018-05-22,208.726
2018-05-23,169.015
2018-05-24,
2018-05-25,270.261
2018-05-26,292.948
2018-05-27,
2018-05-28,268.934
2018-05-29,
2018-05-30,168.138
2018-05-31,292.957
2018-06-01,251.909
2018-06-02,250.215
2018-06-03,161.209
2018-06-04,202.131
2018-06-05,
2018-06-06,248.605
2018-06-07,163.001
2018-06-08,268.011
2018-06-09,
2018-06-10,169.695
2018-06-11,230.802
2018-06-12,264.263
2018-06-13,178.256
2018-06-14,200.012
2018-06-15,297.557
2018-06-16,
2018-06-17,
2018-06-18,
2018-06-19,
2018-06-20,
2018-06-21,
2018-06-22,
2018-06-23,
2018-06-24,
2018-06-25,
2018-06-26,
2018-06-27,
2018-06-28,
2018-06-29,
2018-06-30,
2018-07-01,159.057
2018-07-02,273.039
2018-07-03,174.962
2018-07-04,167.744
2018-07-05,281.298
2018-07-06,175.512
2018-07-07,233.63
2018-07-08,291.861
2018-07-09,220.862
2018-07-10,211.438
2018-07-11,220.784
2018-07-12,198.478
2018-07-13,215.809
2018-07-14,167.607
2018-07-15,299.449
2018-07-16,238.263
2018-07-17,169.04
2018-07-18,214.313
2018-07-19,
2018-07-20,208.475
2018-07-21,
2018-07-22,265.392
2018-07-23,279.328
2018-07-24,166.562
2018-07-25,
2018-07-26,245.396
2018-07-27,213.969
2018-07-28,255.809
2018-07-29,282.484
2018-07-30,
2018-07-31,196.775
2018-08-01,222.026
2018-08-02,153.407
2018-08-03,159.723
2018-08-04,
2018-08-05,181.667
2018-08-06,177.369
2018-08-07,163.232
2018-08-08,218.857
2018-08-09,173.93
2018-08-10,266.905
2018-08-11,157.206
2018-08-12,
2018-08-13,279.28
2018-08-14,276.68
2018-08-15,191.322
2018-08-16,
2018-08-17,298.985
2018-08-18,176.815
2018-08-19,152.945
2018-08-20,153.43
2018-08-21,288.863
2018-08-22,
2018-08-23,
2018-08-24,
2018-08-25,247.014
2018-08-26,201.07
2018-08-27,164.195
2018-08-28,
2018-08-29,
2018-08-30,256.314
2018-08-31,
2018-09-01,224.28
2018-09-02,
2018-09-03,233.621
2018-09-04,190.794
2018-09-05,
2018-09-06,276.232
2018-09-07,247.157
2018-09-08,
2018-09-09,
2018-09-10,291.533
2018-09-11,
2018-09-12,248.926
2018-09-13,
2018-09-14,202.479
2018-09-15,157.122
2018-09-16,
2018-09-17,236.875
2018-09-18,289.812
2018-09-19,
2018-09-20,
2018-09-21,295.03
2018-09-22,151.579
2018-09-23,230.099
2018-09-24,184.367
2018-09-25,219.729
2018-09-26,295.585
2018-09-27,235.335
2018-09-28,170.746
2018-09-29,
2018-09-30,191.258
2018-10-01,170.798
2018-10-02,
2018-10-03,248.723
2018-10-04,197.059
2018-10-05,
2018-10-06,186.969
2018-10-07,
2018-10-08,
2018-10-09,158.226
2018-10-10,228.776
2018-10-11,161.443
2018-10-12,
2018-10-13,193.904
2018-10-14,195.721
2018-10-15,188.298
2018-10-16,
2018-10-17,201.237
2018-10-18,207.719
2018-10-19,185.38
2018-10-20,273.858
2018-10-21,
2018-10-22,295.545
2018-10-23,
2018-10-24,298.172
2018-10-25,217.741
2018-10-26,279.237
2018-10-27,
2018-10-28,
2018-10-29,178.774
2018-10-30,217.149
2018-10-31,227.935
2018-11-01,
2018-11-02,
2018-11-03,297.156
2018-11-04,
2018-11-05,285.907
2018-11-06,269.015
2018-11-07,211.519
2018-11-08,
2018-11-09,218.521
2018-11-10,213.508
2018-11-11,
2018-11-12,159.996
2018-11-13,166.495
2018-11-14,229.558
2018-11-15,229.641
2018-11-16,152.638
2018-11-17,222.362
2018-11-18,275.259
2018-11-19,208.638
2018-11-20,260.822
2018-11-21,
2018-11-22,156.083
2018-11-23,234.276
2018-11-24,203.417
2018-11-25,268.087
2018-11-26,279.452
2018-11-27,234.571
2018-11-28,183.779
2018-11-29,254.104
2018-11-30,244.731
2018-12-01,210.135
2018-12-02,
2018-12-03,279.383
2018-12-04,218.821
2018-12-05,205.406
2018-12-06,270.508
2018-12-07,241.848
2018-12-08,297.719
2018-12-09,282.041
2018-12-10,214.807
2018-12-11,
2018-12-12,169.745
2018-12-13,221.185
2018-12-14,208.12
2018-12-15,207.669
2018-12-16,173.269
2018-12-17,167.125
2018-12-18,290.194
2018-12-19,298.957
2018-12-20,250.153
2018-12-21,179.303
2018-12-22,232.492
2018-12-23,188.031
2018-12-24,260.695
2018-12-25,247.578
2018-12-26,219.271
2018-12-27,291.001
2018-12-28,197.305
2018-12-29,
2018-12-30,225.502
2018-12-31,
2019-01-01,242.214
2019-01-02,275.926
2019-01-03,
2019-01-04,165.638
2019-01-05,175.153
2019-01-06,276.495
2019-01-07,
2019-01-08,270.397
2019-01-09,
2019-01-10,225.688
2019-01-11,186.823
2019-01-12,168.007
2019-01-13,187.197
2019-01-14,159.103
2019-01-15,275.936
2019-01-16,291.763
2019-01-17,
2019-01-18,202.491
2019-01-19,
2019-01-20,243.784
2019-01-21,264.819
2019-01-22,212.19
2019-01-23,275.715
2019-01-24,181.545
2019-01-25,263.761
2019-01-26,159.005
2019-01-27,
2019-01-28,264.461
2019-01-29,197.878
2019-01-30,196.708
2019-01-31,241.257
2019-02-01,
2019-02-02,224.558
2019-02-03,189.535
2019-02-04,170.935
2019-02-05,
2019-02-06,269.453
2019-02-07,229.293
2019-02-08,237.599
2019-02-09,208.146
2019-02-10,
2019-02-11,295.646
2019-02-12,266.052
2019-02-13,
2019-02-14,
2019-02-15,
2019-02-16,
2019-02-17,
2019-02-18,
2019-02-19,
2019-02-20,
2019-02-21,
2019-02-22,179.478
2019-02-23,219.462
2019-02-24,234.795
2019-02-25,252.363
2019-02-26,173.745
2019-02-27,201.143
2019-02-28,171.151
2019-03-01,194.767
2019-03-02,212.937
2019-03-03,246.396
2019-03-04,204.998
2019-03-05,239.503
2019-03-06,272.771
2019-03-07,
2019-03-08,290.661
2019-03-09,286.174
2019-03-10,
2019-03-11,
2019-03-12,282.007
2019-03-13,213.409
2019-03-14,
2019-03-15,289.034
2019-03-16,251.61
2019-03-17,239.178
2019-03-18,187.112
2019-03-19,291.24
2019-03-20,171.792
2019-03-21,284.433
2019-03-22,
2019-03-23,
2019-03-24,175.483
2019-03-25,205.334
2019-03-26,200.651
2019-03-27,235.658
2019-03-28,231.585
2019-03-29,
2019-03-30,223.772
2019-03-31,281.508
2019-04-01,
2019-04-02,186.705
2019-04-03,153.935
2019-04-04,274.842
2019-04-05,269.548
2019-04-06,
2019-04-07,244.344
2019-04-08,172.444
2019-04-09,
2019-04-10,
2019-04-11,
2019-04-12,158.543
2019-04-13,198.879
2019-04-14,244.97
2019-04-15,237.131
2019-04-16,221.809
2019-04-17,194.189
2019-04-18,
2019-04-19,245.936
2019-04-20,
2019-04-21,297.766
2019-04-22,254.802
2019-04-23,248.421
2019-04-24,246.422
2019-04-25,
2019-04-26,236.331
2019-04-27,271.2
2019-04-28,167.171
2019-04-29,236.702
2019-04-30,213.144
2019-05-01,166.94
2019-05-02,246.765
2019-05-03,211.95
2019-05-04,293.508
2019-05-05,159.786
2019-05-06,242.03
2019-05-07,291.362
2019-05-08,207.905
2019-05-09,184.774
2019-05-10,244.143
2019-05-11,205.131
2019-05-12,295.956
2019-05-13,162.906
2019-05-14,242.412
2019-05-15,272.669
2019-05-16,290.551
2019-05-17,
2019-05-18,263.165
2019-05-19,230.065
2019-05-20,
2019-05-21,297.085
2019-05-22,202.923
2019-05-23,253.646
2019-05-24,214.563
2019-05-25,
2019-05-26,197.645
2019-05-27,197.283
2019-05-28,237.926
2019-05-29,168.578
2019-05-30,238.317
2019-05-31,252.246
2019-06-01,221.986
2019-06-02,273.174
2019-06-03,251.32
2019-06-04,
2019-06-05,241.214
2019-06-06,
2019-06-07,211.026
2019-06-08,226.392
2019-06-09,292.026
2019-06-10,
2019-06-11,
2019-06-12,177.979
2019-06-13,234.203
2019-06-14,206.068
2019-06-15,227.545
2019-06-16,250.051
2019-06-17,237.45
2019-06-18,191.951
2019-06-19,290.305
2019-06-20,155.263
2019-06-21,222.71
2019-06-22,230.582
2019-06-23,196.802
2019-06-24,243.576
2019-06-25,268.012
2019-06-26,279.26
2019-06-27,171.689
2019-06-28,236.067
2019-06-29,230.546
2019-06-30,
2019-07-01,152.336
2019-07-02,282.645
2019-07-03,258.882
2019-07-04,260.836
2019-07-05,275.932
2019-07-06,215.637
2019-07-07,
2019-07-08,256.231
2019-07-09,191.017
2019-07-10,296.137
2019-07-11,237.891
2019-07-12,152.835
2019-07-13,188.871
2019-07-14,184.94
2019-07-15,259.04
2019-07-16,223.387
2019-07-17,245.696
2019-07-18,286.076
2019-07-19,190.874
2019-07-20,199.475
2019-07-21,281.75
2019-07-22,
2019-07-23,212.606
2019-07-24,269.898
2019-07-25,209.056
2019-07-26,253.33
2019-07-27,265.54
2019-07-28,173.557
2019-07-29,275.812
2019-07-30,271.986
2019-07-31,243.688
2019-08-01,198.897
2019-08-02,
2019-08-03,
2019-08-04,
2019-08-05,
2019-08-06,
2019-08-07,
2019-08-08,
2019-08-09,
2019-08-10,
2019-08-11,
2019-08-12,
2019-08-13,
2019-08-14,
2019-08-15,
2019-08-16,
2019-08-17,
2019-08-18,
2019-08-19,
2019-08-20,
2019-08-21,
2019-08-22,
2019-08-23,
2019-08-24,
2019-08-25,
2019-08-26,
2019-08-27,
2019-08-28,
2019-08-29,
2019-08-30,
2019-08-31,
2019-09-01,
2019-09-02,237.182
2019-09-03,
2019-09-04,
2019-09-05,
2019-09-06,230.921
2019-09-07,191.274
2019-09-08,254.188
2019-09-09,277.981
2019-09-10,
2019-09-11,179.15
2019-09-12,171.791
2019-09-13,167.787
2019-09-14,296.55
2019-09-15,275.873
2019-09-16,172.721
2019-09-17,187.862
2019-09-18,231.311
2019-09-19,
2019-09-20,
2019-09-21,
2019-09-22,233.695
2019-09-23,253.32
2019-09-24,238.362
2019-09-25,242.519
2019-09-26,
2019-09-27,179.944
2019-09-28,
2019-09-29,170.863
2019-09-30,
2019-10-01,
2019-10-02,217.76
2019-10-03,216.076
2019-10-04,260.328
2019-10-05,263.24
2019-10-06,260.23
2019-10-07,
2019-10-08,252.628
2019-10-09,
2019-10-10,168.114
2019-10-11,229.615
2019-10-12,257.186
2019-10-13,196.068
2019-10-14,
2019-10-15,173.212
2019-10-16,241.905
2019-10-17,195.457
2019-10-18,
2019-10-19,282.163
2019-10-20,233.01
2019-10-21,293.065
2019-10-22,165.022
2019-10-23,214.933
2019-10-24,216.606
2019-10-25,177.527
2019-10-26,
2019-10-27,205.939
2019-10-28,
2019-10-29,
2019-10-30,171.097
2019-10-31,
2019-11-01,183.107
2019-11-02,
2019-11-03,201.714
2019-11-04,233.273
2019-11-05,199.09
2019-11-06,247.913
2019-11-07,283.948
2019-11-08,271.512
2019-11-09,193.06
2019-11-10,186.068
2019-11-11,244.623
2019-11-12,286.255
2019-11-13,298.266
2019-11-14,277.077
2019-11-15,227.05
2019-11-16,
2019-11-17,197.218
2019-11-18,183.382
2019-11-19,163.593
2019-11-20,
2019-11-21,219.376
2019-11-22,211.011
2019-11-23,254.004
2019-11-24,206.17
2019-11-25,
2019-11-26,234.27
2019-11-27,218.52
2019-11-28,
2019-11-29,241.086
2019-11-30,213.849
2019-12-01,272.43
2019-12-02,
2019-12-03,164.807
2019-12-04,271.917
2019-12-05,255.567
2019-12-06,218.371
2019-12-07,217.781
2019-12-08,
2019-12-09,299.185
2019-12-10,192.747
2019-12-11,165.448
2019-12-12,283.536
2019-12-13,
2019-12-14,
2019-12-15,
2019-12-16,
2019-12-17,
2019-12-18,278.311
2019-12-19,254.829
2019-12-20,
2019-12-21,214.92
2019-12-22,157.638
2019-12-23,260.367
2019-12-24,270.706
2019-12-25,
2019-12-26,179.311
2019-12-27,257.224
2019-12-28,257.993
2019-12-29,232.496
2019-12-30,259.287
2019-12-31,
2020-01-01,269.209
2020-01-02,278.402
2020-01-03,239.92
2020-01-04,273.434
2020-01-05,298.262
2020-01-06,
2020-01-07,215.07
2020-01-08,291.183
2020-01-09,209.484
2020-01-10,255.671
2020-01-11,243.632
2020-01-12,188.444
2020-01-13,229.675
2020-01-14,208.964
2020-01-15,265.426
2020-01-16,
2020-01-17,228.985
2020-01-18,
2020-01-19,181.965
2020-01-20,161.488
2020-01-21,299.807
2020-01-22,283.267
2020-01-23,260.738
2020-01-24,208.559
2020-01-25,201.249
2020-01-26,299.124
2020-01-27,156.04
2020-01-28,160.574
2020-01-29,
2020-01-30,210.336
2020-01-31,
2020-02-01,
2020-02-02,256.981
2020-02-03,
2020-02-04,277.612
2020-02-05,266.478
2020-02-06,
2020-02-07,265.938
2020-02-08,263.34
2020-02-09,
2020-02-10,297.376
2020-02-11,212.12
2020-02-12,173.842
2020-02-13,288.429
2020-02-14,
2020-02-15,195.481
2020-02-16,210.21
2020-02-17,
2020-02-18,
2020-02-19,255.748
2020-02-20,152.097
2020-02-21,220.154
2020-02-22,
2020-02-23,162.584
2020-02-24,214.935
2020-02-25,
2020-02-26,184.811
2020-02-27,275.504
2020-02-28,204.456
2020-02-29,
2020-03-01,
2020-03-02,
2020-03-03,234.251
2020-03-04,272.024
2020-03-05,169.604
2020-03-06,246.592
2020-03-07,188.885
2020-03-08,269.59
2020-03-09,217.189
2020-03-10,
2020-03-11,288.539
2020-03-12,289.118
2020-03-13,297.324
2020-03-14,272.293
2020-03-15,265.995
2020-03-16,151.61
2020-03-17,177.639
2020-03-18,195.14
2020-03-19,223.247
2020-03-20,
2020-03-21,220.777
2020-03-22,
2020-03-23,170.201
2020-03-24,296.12
2020-03-25,201.866
2020-03-26,
2020-03-27,171.33
2020-03-28,201.224
2020-03-29,
2020-03-30,246.668
2020-03-31,258.095
2020-04-01,247.043
2020-04-02,185.111
2020-04-03,
2020-04-04,250.318
2020-04-05,212.861
2020-04-06,165.993
2020-04-07,176.668
2020-04-08,220.793
2020-04-09,158.007
2020-04-10,266.506
2020-04-11,295.556
2020-04-12,199.955
2020-04-13,240.177
2020-04-14,235.358
2020-04-15,289.976
2020-04-16,235.415
2020-04-17,185.157
2020-04-18,290.195
2020-04-19,
2020-04-20,
2020-04-21,270.036
2020-04-22,207.739
2020-04-23,
2020-04-24,187.677
2020-04-25,261.878
2020-04-26,298.526
2020-04-27,223.365
2020-04-28,257.659
2020-04-29,
2020-04-30,
2020-05-01,
2020-05-02,171.742
2020-05-03,212.777
2020-05-04,281.463
2020-05-05,189.645
2020-05-06,
2020-05-07,
2020-05-08,171.908
2020-05-09,
2020-05-10,237.848
2020-05-11,243.507
2020-05-12,229.431
2020-05-13,
2020-05-14,
2020-05-15,
2020-05-16,
2020-05-17,
2020-05-18,
2020-05-19,295.134
2020-05-20,
2020-05-21,183.704
2020-05-22,275.499
2020-05-23,192.333
2020-05-24,256.372
2020-05-25,274.963
2020-05-26,288.739
2020-05-27,244.964
2020-05-28,283.782
2020-05-29,
2020-05-30,255.04
2020-05-31,194.655
2020-06-01,250.183
2020-06-02,240.541
2020-06-03,239.71
2020-06-04,289.011
2020-06-05,
2020-06-06,172.779
2020-06-07,228.092
2020-06-08,
2020-06-09,221.273
2020-06-10,273.919
2020-06-11,275.705
2020-06-12,188.908
2020-06-13,
2020-06-14,
2020-06-15,
2020-06-16,
2020-06-17,
2020-06-18,
2020-06-19,249.597
2020-06-20,284.484
2020-06-21,222.787
2020-06-22,181.326
2020-06-23,177.974
2020-06-24,
2020-06-25,231.252
2020-06-26,256.213
2020-06-27,246.617
2020-06-28,220.845
2020-06-29,262.05
2020-06-30,
2020-07-01,215.335
2020-07-02,272.937
2020-07-03,
2020-07-04,
2020-07-05,296.918
2020-07-06,231.238
2020-07-07,209.977
2020-07-08,
2020-07-09,218.959
2020-07-10,220.264
2020-07-11,192.236
2020-07-12,
2020-07-13,269.364
2020-07-14,171.058
2020-07-15,206.309
2020-07-16,
2020-07-17,251.102
2020-07-18,225.216
2020-07-19,192.582
2020-07-20,241.235
2020-07-21,252.209
2020-07-22,203.339
2020-07-23,175.178
2020-07-24,198.944
2020-07-25,262.603
2020-07-26,264.176
2020-07-27,197.213
2020-07-28,189.617
2020-07-29,275.744
2020-07-30,289.758
2020-07-31,
2020-08-01,173.662
2020-08-02,176.42
2020-08-03,265.27
2020-08-04,285.2
2020-08-05,
2020-08-06,277.442
2020-08-07,
2020-08-08,
2020-08-09,
2020-08-10,232.784
2020-08-11,161.168
2020-08-12,198.976
2020-08-13,260.358
2020-08-14,266.779
2020-08-15,237.175
2020-08-16,246.633
2020-08-17,
2020-08-18,228.198
2020-08-19,291.461
2020-08-20,157.473
2020-08-21,266.931
2020-08-22,269.75
2020-08-23,
2020-08-24,244.384
2020-08-25,269.25
2020-08-26,293.196
2020-08-27,
2020-08-28,240.721
2020-08-29,223.047
2020-08-30,
2020-08-31,202.71
2020-09-01,156.015
2020-09-02,194.581
2020-09-03,181.121
2020-09-04,232.536
2020-09-05,
2020-09-06,
2020-09-07,261.125
2020-09-08,250.855
2020-09-09,
2020-09-10,197.959
2020-09-11,212.379
2020-09-12,220.646
2020-09-13,161.045
2020-09-14,180.046
2020-09-15,279.318
2020-09-16,
2020-09-17,172.283
2020-09-18,191.522
2020-09-19,231.061
2020-09-20,
2020-09-21,207.58
2020-09-22,251.86
2020-09-23,224.697
2020-09-24,
2020-09-25,288.673
2020-09-26,
2020-09-27,
2020-09-28,
2020-09-29,151.197
2020-09-30,288.199
2020-10-01,255.238
2020-10-02,293.623
2020-10-03,289.55
2020-10-04,
2020-10-05,182.519
2020-10-06,212.579
2020-10-07,234.019
2020-10-08,246.092
2020-10-09,
2020-10-10,234.356
2020-10-11,170.522
2020-10-12,234.109
2020-10-13,252.747
2020-10-14,289.013
2020-10-15,241.249
2020-10-16,
2020-10-17,
2020-10-18,264.655
2020-10-19,215.601
2020-10-20,274.879
2020-10-21,169.967
2020-10-22,222.884
2020-10-23,174.626
2020-10-24,220.101
2020-10-25,233.928
2020-10-26,280.07
2020-10-27,
2020-10-28,281.523
2020-10-29,286.242
2020-10-30,221.97
2020-10-31,214.875
2020-11-01,214.827
2020-11-02,151.014
2020-11-03,
2020-11-04,
2020-11-05,267.022
2020-11-06,177.024
2020-11-07,
2020-11-08,
2020-11-09,229.818
2020-11-10,258.559
2020-11-11,235.593
2020-11-12,210.61
2020-11-13,183.309
2020-11-14,279.373
2020-11-15,251.261
2020-11-16,265.186
2020-11-17,
2020-11-18,287.351
2020-11-19,168.861
2020-11-20,
2020-11-21,157.388
2020-11-22,187.447
2020-11-23,288.222
2020-11-24,227.328
2020-11-25,
2020-11-26,
2020-11-27,208.723
2020-11-28,172.981
2020-11-29,
2020-11-30,255.607
2020-12-01,194.569
2020-12-02,177.744
2020-12-03,
2020-12-04,
2020-12-05,184.174
2020-12-06,175.927
2020-12-07,183.687
2020-12-08,299.127
2020-12-09,278.123
2020-12-10,220.768
2020-12-11,276.229
2020-12-12,267.57
2020-12-13,259.354
2020-12-14,213.232
2020-12-15,249.601
2020-12-16,268.438
2020-12-17,273.346
2020-12-18,299.158
2020-12-19,155.241
2020-12-20,190.063
2020-12-21,179.738
2020-12-22,192.843
2020-12-23,180.25
2020-12-24,
2020-12-25,262.082
2020-12-26,236.968
2020-12-27,
2020-12-28,164.332
2020-12-29,177.941
2020-12-30,292.95
2020-12-31,269.661
2021-01-01,207.565
2021-01-02,
2021-01-03,151.739
2021-01-04,
2021-01-05,253.331
2021-01-06,196.488
2021-01-07,178.656
2021-01-08,250.917
2021-01-09,169.614
2021-01-10,285.842
2021-01-11,
2021-01-12,231.227
2021-01-13,195.907
2021-01-14,233.79
2021-01-15,248.261
2021-01-16,271.441
2021-01-17,258.018
2021-01-18,201.1
2021-01-19,165.213
2021-01-20,224.051
2021-01-21,193.855
2021-01-22,258.268
2021-01-23,292.223
2021-01-24,225.173
2021-01-25,168.611
2021-01-26,162.499
2021-01-27,233.826
2021-01-28,189.525
2021-01-29,269.907
2021-01-30,172.369
2021-01-31,220.069
2021-02-01,262.934
2021-02-02,266.958
2021-02-03,288.982
2021-02-04,175.308
2021-02-05,289.04
2021-02-06,209.849
2021-02-07,291.632
2021-02-08,268.066
2021-02-09,260.923
2021-02-10,240.76
2021-02-11,225.787
2021-02-12,184.366
2021-02-13,270.164
2021-02-14,258.838
2021-02-15,235.844
2021-02-16,266.638
2021-02-17,220.786
2021-02-18,
2021-02-19,162.096
2021-02-20,
2021-02-21,204.106
2021-02-22,195.447
2021-02-23,190.365
2021-02-24,176.628
2021-02-25,
2021-02-26,
2021-02-27,285.637
2021-02-28,
2021-03-01,161.848
2021-03-02,155.05
2021-03-03,158.686
2021-03-04,259.284
2021-03-05,235.279
2021-03-06,214.396
2021-03-07,279.159
2021-03-08,172.212
2021-03-09,174.343
2021-03-10,256.395
2021-03-11,298.115
2021-03-12,
2021-03-13,
2021-03-14,210.422
2021-03-15,223.981
2021-03-16,216.802
2021-03-17,267.375
2021-03-18,221.477
2021-03-19,239.67
2021-03-20,220.588
2021-03-21,189.838
2021-03-22,247.425
2021-03-23,270.319
2021-03-24,256.464
2021-03-25,236.247
2021-03-26,
2021-03-27,251.132
2021-03-28,294.363
2021-03-29,150.126
2021-03-30,188.73
2021-03-31,208.237
2021-04-01,238.205
2021-04-02,278.638
2021-04-03,228.548
2021-04-04,200.054
2021-04-05,226.437
2021-04-06,
2021-04-07,257.003
2021-04-08,225.554
2021-04-09,
2021-04-10,229.996
2021-04-11,151.605
2021-04-12,270.443
2021-04-13,194.329
2021-04-14,164.846
2021-04-15,214.125
2021-04-16,207.465
2021-04-17,
2021-04-18,164.061
2021-04-19,184.541
2021-04-20,188.281
2021-04-21,265.607
2021-04-22,220.51
2021-04-23,221.041
2021-04-24,239.158
2021-04-25,
2021-04-26,232.917
2021-04-27,
2021-04-28,
2021-04-29,211.176
2021-04-30,
2021-05-01,
2021-05-02,227.649
2021-05-03,154.601
2021-05-04,174.468
2021-05-05,
2021-05-06,294.275
2021-05-07,266.231
2021-05-08,190.88
2021-05-09,243.685
2021-05-10,192.531
2021-05-11,258.862
2021-05-12,246.954
2021-05-13,
2021-05-14,151.782
2021-05-15,
2021-05-16,229.686
2021-05-17,
2021-05-18,285.796
2021-05-19,246.42
2021-05-20,
2021-05-21,170.039
2021-05-22,177.29
2021-05-23,225.388
2021-05-24,215.867
2021-05-25,206.537
2021-05-26,211.986
2021-05-27,242.233
2021-05-28,
2021-05-29,263.437
2021-05-30,180.606
2021-05-31,276.764
2021-06-01,199.275
2021-06-02,158.134
2021-06-03,206.19
2021-06-04,194.891
2021-06-05,178.104
2021-06-06,287.059
2021-06-07,258.546
2021-06-08,276.242
2021-06-09,
2021-06-10,295.217
2021-06-11,
2021-06-12,250.475
2021-06-13,189.113
2021-06-14,
2021-06-15,229.812
2021-06-16,253.742
2021-06-17,251.208
2021-06-18,214.431
2021-06-19,228.37
2021-06-20,152.912
2021-06-21,239.655
2021-06-22,297.506
2021-06-23,235.937
2021-06-24,233.887
2021-06-25,188.517
2021-06-26,173.274
2021-06-27,239.101
2021-06-28,201.047
2021-06-29,266.892
2021-06-30,276.641
2021-07-01,150.003
2021-07-02,216.891
2021-07-03,291.062
2021-07-04,257.849
2021-07-05,
2021-07-06,
2021-07-07,262.12
2021-07-08,
2021-07-09,173.542
2021-07-10,277.812
2021-07-11,
2021-07-12,227.363
2021-07-13,
2021-07-14,182.446
2021-07-15,163.923
2021-07-16,280.718
2021-07-17,220.741
2021-07-18,277.424
2021-07-19,165.187
2021-07-20,165.069
2021-07-21,200.598
2021-07-22,
2021-07-23,191.418
2021-07-24,200.422
2021-07-25,
2021-07-26,178.982
2021-07-27,
2021-07-28,267.129
2021-07-29,
2021-07-30,202.091
2021-07-31,247.07
2021-08-01,220.111
2021-08-02,
2021-08-03,204.683
2021-08-04,213.455
2021-08-05,260.567
2021-08-06,239.181
2021-08-07,296.074
2021-08-08,
2021-08-09,163.631
2021-08-10,260.94
2021-08-11,233.567
2021-08-12,169.197
2021-08-13,272.416
2021-08-14,242.68
2021-08-15,156.676
2021-08-16,
2021-08-17,236.846
2021-08-18,
2021-08-19,
2021-08-20,251.279
2021-08-21,225.696
2021-08-22,
2021-08-23,
2021-08-24,212.15
2021-08-25,
2021-08-26,257.862
2021-08-27,244.655
2021-08-28,167.267
2021-08-29,210.239
2021-08-30,211.576
2021-08-31,238.388
2021-09-01,175.621
2021-09-02,254.191
2021-09-03,203.772
2021-09-04,234.199
2021-09-05,191.564
2021-09-06,201.168
2021-09-07,250.282
2021-09-08,277.224
2021-09-09,181.817
2021-09-10,204.567
2021-09-11,290.528
2021-09-12,171.353
2021-09-13,183.718
2021-09-14,175.507
2021-09-15,168.124
2021-09-16,291.515
2021-09-17,258.061
2021-09-18,
2021-09-19,288.815
2021-09-20,190.604
2021-09-21,228.044
2021-09-22,168.511
2021-09-23,
2021-09-24,
2021-09-25,
2021-09-26,190.124
2021-09-27,196.915
2021-09-28,249.681
2021-09-29,261.6
2021-09-30,
2021-10-01,295.799
2021-10-02,272.204
2021-10-03,255.549
2021-10-04,229.987
2021-10-05,223.519
2021-10-06,
2021-10-07,207.85
2021-10-08,288.934
2021-10-09,204.104
2021-10-10,192.296
2021-10-11,266.632
2021-10-12,187.139
2021-10-13,216.357
2021-10-14,216.207
2021-10-15,253.475
2021-10-16,
2021-10-17,222.83
2021-10-18,
2021-10-19,275.794
2021-10-20,282.913
2021-10-21,
2021-10-22,191.471
2021-10-23,240.969
2021-10-24,152.078
2021-10-25,193.31
2021-10-26,244.397
2021-10-27,156.747
2021-10-28,
2021-10-29,
2021-10-30,199.179
2021-10-31,154.623
2021-11-01,272.352
2021-11-02,
2021-11-03,
2021-11-04,286.837
2021-11-05,
2021-11-06,
2021-11-07,165.437
2021-11-08,152.611
2021-11-09,211.532
2021-11-10,242.168
2021-11-11,
2021-11-12,173.563
2021-11-13,211.956
2021-11-14,227.824
2021-11-15,158.507
2021-11-16,218.069
2021-11-17,296.599
2021-11-18,
2021-11-19,210.851
2021-11-20,212.033
2021-11-21,157.926
2021-11-22,151.995
2021-11-23,
2021-11-24,226.923
2021-11-25,
2021-11-26,253.486
2021-11-27,
2021-11-28,282.65
2021-11-29,181.578
2021-11-30,
2021-12-01,155.833
2021-12-02,210.098
2021-12-03,298.993
2021-12-04,
2021-12-05,
2021-12-06,270.416
2021-12-07,
2021-12-08,
2021-12-09,
2021-12-10,177.493
2021-12-11,275.816
2021-12-12,291.629
2021-12-13,269.036
2021-12-14,254.317
2021-12-15,
2021-12-16,185.519
2021-12-17,154.902
2021-12-18,269.975
2021-12-19,
2021-12-20,150.343
2021-12-21,290.214
2021-12-22,
2021-12-23,241.705
2021-12-24,217.229
2021-12-25,159.317
2021-12-26,
2021-12-27,
2021-12-28,
2021-12-29,
2021-12-30,
2021-12-31,222.577
