value2,date
0.0,0
770.403,1
1633.6770000000001,2
1943.958,3
2157.521,4
2371.082521387292,5
2584.64256415448,6
2798.201128294168,7
3011.75821379896,8
3225.31382066146,9
3438.867948874272,10
3652.42059843,11
3865.9717693212488,12
4079.5214615406217,13
4293.069675080723,14
4506.616409934157,15
4720.161666093527,16
4933.705443551437,17
5147.247742300493,18
5360.788562333297,19
5574.327903642454,20
6143.0549036424545,21
6646.128903642455,22
6972.6839036424535,23
7703.493903642455,24
8592.958903642455,25
8869.119903642455,26
9145.276252783731,27
9421.42795104239,28
10395.764951042389,29
11115.472951042388,30
11375.759951042388,31
11719.988951042387,32
12599.632951042388,33
12869.635951042388,34
13673.115951042388,35
14351.489951042387,36
14449.540951042387,37
15180.370951042389,38
15753.46695104239,39
16128.68295104239,40
16640.22195104239,41
16870.528951042394,42
17095.119951042394,43
18066.976951042394,44
18341.340951042395,45
19023.531951042394,46
19862.092951042396,47
20683.978951042394,48
20815.91795104239,49
21343.91195104239,50
21871.907612305076,51
22399.904934838774,52
22927.903918651813,53
23455.904563752523,54
24423.587563752524,55
25249.058563752522,56
26074.546589307018,57
26900.05164050482,58
26950.91964050482,59
27354.07064050482,60
27875.51564050482,61
27979.933640504816,62
28903.19764050482,63
28977.350640504817,64
29296.22964050482,65
29615.0963424432,66
29933.950746254246,67
30252.79285187223,68
30571.62265923143,69
30890.440168266134,70
31289.013168266123,71
31566.671168266126,72
31906.457168266126,73
32239.188168266126,74
32390.114168266125,75
32484.424168266123,76
33045.56916826612,77
33793.610168266125,78
34541.67226123603,79
35289.75544728938,80
36037.859726539726,81
36785.98509910061,82
37534.13156508558,83
38076.66056508559,84
38932.438565085584,85
39339.64656508558,86
39746.84693353591,87
40154.039670394974,88
41067.44967039498,89
41509.61667039498,90
41951.77817313377,91
42393.934178580894,92
42965.46917858089,93
43556.775178580894,94
44159.87617858089,95
44762.986562612576,96
45366.10633072647,97
45969.235482973105,98
46712.8104829731,99
47340.125482973104,100
47776.455482973106,101
48212.77764842973,102
48649.09197929889,103
49085.39847553652,104
49521.697137098534,105
50503.778137098525,106
51268.98013709853,107
51845.956137098525,108
52367.727137098525,109
53348.71313709853,110
53509.77513709853,111
54049.833137098525,112
54346.212137098526,113
54594.77113709853,114
54843.29850364214,115
55091.794236552036,116
56044.34223655204,117
56156.307236552035,118
56204.06823655204,119
56251.772489843526,120
56299.419996108496,121
57081.950996108506,122
57636.491996108496,123
57761.409996108494,124
57886.27884847463,125
58011.098552930256,126
58578.58455293025,127
58595.766552930254,128
58763.51255293025,129
59309.93955293025,130
59856.371278598956,131
60402.80772996243,132
60949.24890704673,133
61495.69480987792,134
62259.62480987791,135
63023.58837405282,136
63787.585502591435,137
64780.403502591435,138
65030.93950259143,139
65281.43745929589,140
65531.8973724871,141
66338.8883724871,142
66729.8873724871,143
66783.2963724871,144
67667.4723724871,145
68551.70083263393,146
69435.98175322522,147
70320.31513455862,148
71204.70097693178,149
72089.13928064234,150
72973.63004598794,151
73097.17404598794,152
73939.23704598793,153
74781.34908327664,154
75623.5101581343,155
76465.72027084112,156
76768.81427084112,157
76826.39827084112,158
76904.03327084112,159
77068.63527084111,160
77156.64427084112,161
77345.10027084113,162
78111.79827084113,163
78545.75127084112,164
79201.35527084113,165
79856.98310662212,166
80512.63477832232,167
81168.3102860799,168
81824.00963003306,169
82479.73281032001,170
83135.47982707895,171
83791.25068044807,172
84447.04537056557,173
85102.86389756964,174
85758.70626159849,175
86414.57246279031,176
87070.46250128331,177
87726.37637721568,178
88382.31409072562,179
89038.27564195133,180
90031.43764195133,181
90687.16064195133,182
91640.41364195131,183
92185.65664195131,184
92753.54864195133,185
93744.84364195133,186
94736.22135815368,187
95727.68179104186,188
95919.22079104187,189
96110.69337260074,190
96302.09953531959,191
96792.01553531959,192
96873.05653531959,193
96954.0094290002,194
97034.87421583313,195
97595.40321583311,196
98197.71721583311,197
99045.81421583312,198
99580.11721583312,199
100114.4192920578,200
100648.72044449733,201
101550.27244449733,202
101702.90244449733,203
102109.92244449734,204
102751.80544449734,205
103247.11644449734,206
103299.36244449734,207
103308.67044449733,208
103922.58644449734,209
104536.51869743441,210
105150.46720340288,211
105787.7292034029,212
105820.37920340287,213
106729.91320340287,214
107031.90920340287,215
107924.36320340287,216
108064.74920340288,217
108412.25320340288,218
109131.82220340287,219
109781.83620340288,220
109982.65720340288,221
110849.24220340287,222
111815.79520340287,223
111996.39620340288,224
112765.46920340287,225
113607.13320340287,226
114392.42320340288,227
114671.23120340287,228
115156.98020340288,229
115649.14920340288,230
115862.05320340287,231
116074.8831710182,232
116287.63910579075,233
116879.81210579073,234
117471.9982263313,235
118064.19746748965,236
118656.40982934293,237
119248.63531196832,238
119893.25731196834,239
119961.17431196834,240
120481.71131196833,241
121216.34631196831,242
122056.01531196831,243
122108.14131196831,244
122985.47431196831,245
123862.88974469034,246
124740.38761064215,247
124929.29061064214,248
125118.10873415353,249
125306.84198064473,250
125495.4903495842,251
125684.05384044038,252
125872.53245268168,253
126060.92618577657,254
126249.23503919346,255
126437.4590124008,256
126625.59810486702,257
126813.65231606057,258
127065.30431606057,259
127316.88731041805,260
127568.40129870063,261
127835.71729870062,262
128102.96835698515,263
128370.15447314737,264
128637.27564678044,265
128904.33187747751,266
129171.32316483175,267
129438.24950843629,268
129705.1109078843,269
130574.49790788429,270
130740.08190788429,271
130969.5459078843,272
131533.72490788432,273
131912.7639078843,274
131923.2509078843,275
132091.6399078843,276
132559.46990788428,277
133528.79190788427,278
134498.23743257803,279
135467.8064827552,280
135839.3704827552,281
136210.89418087664,282
136582.37757686427,283
136953.82067046288,284
137325.22346141728,285
137635.0104614173,286
138499.1084614173,287
138657.73146141728,288
139306.81246141728,289
139745.18046141727,290
140508.8204614173,291
141082.9144614173,292
141332.8034614173,293
141823.2874614173,294
142279.3584614173,295
143190.85146141727,296
144019.69946141727,297
144145.9264614173,298
145016.67746141728,299
145759.41746141727,300
146502.22356387845,301
147245.09576923156,302
148162.53776923157,303
149080.09721948078,304
149997.7741207431,305
150429.8521207431,306
151084.3821207431,307
151584.3861207431,308
152571.0291207431,309
152821.5351207431,310
152886.4211207431,311
153029.47912074308,312
153683.20812074307,313
154547.67112074306,314
155412.23916793062,315
156276.91226299462,316
157135.00626299463,317
157540.69726299462,318
157799.40826299464,319
158591.16626299464,320
159383.0076056664,321
160174.93229155772,322
160829.64129155772,323
161281.9982915577,324
161335.7482915577,325
161745.2162915577,326
161888.20429155772,327
162203.2592915577,328
162426.06829155772,329
162648.7818032081,330
162871.3998258765,331
163590.5358258765,332
163844.8608258765,333
164099.09962699085,334
164353.25222864727,335
164641.03322864725,336
164928.7389606694,337
165216.36942421418,338
165231.3824242142,339
165246.23104181123,340
165260.91527591133,341
165485.88027591133,342
165710.7502663394,343
165935.5252465654,344
166160.2052159592,345
166384.79017389065,346
167093.04817389065,347
167801.3723230581,348
168509.76262184363,349
169254.46462184365,350
169502.7266218436,351
169818.26962184362,352
169926.30962184363,353
170812.6986218436,354
171154.77362184363,355
171678.9866218436,356
172307.2616218436,357
173183.52962184363,358
174059.92332147754,359
174936.44272160236,360
175813.0878230751,361
176689.85862675274,362
177618.84062675273,363
178547.96642373616,364
179477.23601868286,365
179989.24301868287,366
180860.02801868287,367
181730.9369163994,368
182601.96971267802,369
183473.1264083644,370
184344.40700430414,371
185217.15200430414,372
185744.8810043041,373
186272.6107545229,374
186800.34125496278,375
187328.07250562595,376
187855.80450651466,377
188383.5372576311,378
188911.2707589775,379
188935.5537589775,380
188959.6556008057,381
188983.57628321488,382
189488.92328321488,383
190051.5042832149,384
190614.1014199704,385
191176.7146935946,386
191197.7086935946,387
191218.51873109967,388
191239.14480483936,389
191637.20980483937,390
192184.40780483937,391
192920.51880483938,392
193656.7129064927,393
194392.99011038133,394
194615.86811038136,395
194838.63595140394,396
195061.29363268684,397
196036.6386326869,398
197012.1587575164,399
197987.85400840177,400
198963.7243865695,401
199939.76989324598,402
200915.99052965766,403
201892.38629703101,404
202868.95719659247,405
203808.86219659247,406
204506.53019659244,407
205204.2652285513,408
205902.06729293667,409
206599.93639021623,410
207297.87252085767,411
207995.87568532862,412
208693.94588409676,413
209392.08311762975,414
210090.28738639527,415
210788.55869086095,416
211486.8970314945,417
211888.4620314945,418
212623.6830314945,419
212650.4600314945,420
212677.0379185612,421
212703.41669127913,422
212729.59634823282,423
213331.06434823282,424
213932.56381908117,425
214534.09476099993,426
214612.63776099993,427
214691.00107764482,428
214769.18470965332,429
214847.1886557442,430
214925.01291463617,431
215414.9669146362,432
216264.9189146362,433
217092.67991463616,434
217123.47391463615,435
217154.06639396673,436
217184.45735118436,437
217214.64678484556,438
218174.0187848456,439
219133.57337366644,440
220093.31055262196,441
220948.93855262193,442
221804.70572788382,443
222660.61207940907,444
223081.38407940904,445
223132.85407940907,446
223321.02607940903,447
223509.05733414815,448
223696.94784260835,449
224666.92184260834,450
225192.29884260835,451
225881.34784260835,452
226570.46766325543,453
227259.65830506195,454
228228.06230506196,455
228622.70030506194,456
228997.35630506196,457
229084.22630506195,458
230018.12030506195,459
230277.40330506195,460
231132.86230506195,461
231740.08230506195,462
232221.68730506196,463
233005.28130506194,464
233369.49430506196,465
234293.48230506197,466
234629.49930506194,467
235373.16430506198,468
235590.85530506194,469
236538.65830506198,470
236943.399305062,471
237306.92530506197,472
237614.39730506204,473
237786.05630506203,474
237957.558387831,475
238128.90355220903,476
238153.53655220903,477
238166.89355220902,478
238695.89655220901,479
239539.25355220903,480
240479.46555220897,481
241308.99955220902,482
241856.67155220904,483
242417.54955220904,484
242858.417552209,485
243217.537552209,486
243901.96255220898,487
244586.46116404014,488
245271.03338824896,489
245278.74938824892,490
245949.06838824894,491
246619.4557771352,492
247289.9115554185,493
247601.0475554185,494
248452.44555541847,495
249303.99593652564,496
250155.69869988042,497
250177.66069988042,498
250199.39174068524,499
250220.89182056533,500
250495.69082056533,501
251249.51082056534,502
251810.19382056533,503
252697.66082056533,504
252732.94582056534,505
253065.20982056533,506
253584.00482056537,507
254581.6138205653,508
254845.64782056535,509
255109.56173905346,510
255373.35557512636,511
256252.35157512635,512
256916.91857512633,513
257692.33257512632,514
258302.00957512634,515
259088.66157512635,516
259881.5085751263,517
260838.1875751263,518
261795.07499578348,519
262752.1708386811,520
263267.7168386811,521
263769.9838386811,522
264075.13183868106,523
264461.00583868107,524
265062.59283868107,525
265116.50083868107,526
265170.1816506029,527
265223.63527271006,528
265276.861703266,529
265329.8609405341,530
265986.2829405341,531
266642.77156634,532
267299.326818464,533
267955.9486974183,534
268693.7836974183,535
269298.60569741833,536
269337.5336974183,537
269376.2233279508,538
269414.6745871806,539
270409.1965871806,540
271253.9435871806,541
272018.2465871806,542
272782.6697137381,543
273547.21296777896,544
273558.57196777896,545
273809.09596777894,546
274513.32196777896,547
274575.01896777895,548
274636.4852988945,549
274697.7209593372,550
275007.7009593372,551
275750.3669593372,552
276271.2549593372,553
276720.5699593372,554
277223.8729593372,555
277571.92995933717,556
277996.64795933716,557
278802.39395933715,558
279608.2862457603,559
280414.3248197523,560
281220.5096824591,561
282026.8408350265,562
282095.0958350265,563
282295.2928350265,564
282495.3267845082,565
282695.1976821988,566
282894.90552682563,567
283094.4503171161,568
283181.7773171161,569
283188.61131711607,570
284089.98631711607,571
284303.95531711605,572
284858.2463171161,573
285415.8713171161,574
285867.43831711606,575
286838.8763171161,576
287041.2413171161,577
287243.44355356717,578
287445.4830251936,579
287647.3597307198,580
287849.07366887,581
288050.6248383686,582
288252.0132379399,583
288453.2388663082,584
288654.3017221978,585
288855.201804333,586
289055.93911143823,587
289256.5136422377,588
289456.92539545574,589
289657.1743698167,590
289857.26056404493,591
290057.18397686473,592
290256.9446070004,593
290456.5424531762,594
290655.9775141166,595
290855.2497885458,596
291054.3592751882,597
291253.305972768,598
291452.08988000965,599
291650.7109956374,600
291849.1693183756,601
292047.4648469485,602
292245.5975800805,603
292443.56751649594,604
292641.3746549191,605
292839.01899407426,606
293036.5005326858,607
293233.819269478,608
293712.306269478,609
294177.214269478,610
294603.58626947796,611
295029.91634166637,612
295456.20448573114,613
295703.31848573114,614
295824.0154857311,615
295851.30148573115,616
295929.16448573116,617
296712.54648573115,618
297695.6954857311,619
298679.11207279016,620
299662.79624911555,621
300646.7480169146,622
301630.96737839456,623
302615.45433576277,624
303600.2088912265,625
304585.23104699305,626
305471.6580469931,627
305685.1950469931,628
305883.0280469931,629
306080.68806843105,630
306278.1751099126,631
307055.4731099126,632
307832.9239394951,633
308610.52759993536,634
309443.44159993535,635
310276.5395334007,636
311109.8214018619,637
312044.6104018619,638
312720.1464018619,639
313364.6574018619,640
314176.37240186194,641
314249.96840186196,642
314323.315217393,643
314396.4128464116,644
314469.2612868742,645
314541.8605367373,646
314614.2105939575,647
314686.31145649124,648
314758.163122295,649
314829.76558932534,650
315341.76858932537,651
316123.9305893254,652
317071.4255893254,653
317402.6255893254,654
318071.54058932536,655
318285.05358932534,656
318786.66858932533,657
319288.279933292,658
319789.88762121333,659
320291.49165307725,660
320632.97865307727,661
321318.67665307724,662
321626.0316530773,663
321933.26979314414,664
322240.3910723194,665
323016.3640723194,666
323972.5540723194,667
324589.1470723194,668
325549.6900723194,669
325909.46507231944,670
326460.3090723194,671
327081.61707231944,672
327682.86707231944,673
328310.31707231945,674
328528.38307231944,675
328801.7540723194,676
329074.9852580256,677
329348.0766282742,678
329980.76062827423,679
330170.79862827423,680
330177.21662827424,681
330183.3355132657,682
330189.1552807346,683
331177.4912807346,684
332166.11473895604,685
333155.0256578556,686
334144.22403989016,687
335019.5920398902,688
335884.70303989016,689
336132.98803989013,690
336427.3200398901,691
336762.03103989013,692
337140.8920398901,693
337351.3380398901,694
337562.5320398901,695
337773.545360445,696
337984.3780000265,697
338101.54800002644,698
338947.76600002643,699
339103.6440000265,700
339259.30776595033,701
339414.75729598093,702
339676.6932959809,703
339974.01829598093,704
340248.4392959809,705
341078.1412959809,706
341662.0952959809,707
342246.0970914268,708
342830.1466827523,709
343666.9986827524,710
344504.05356941686,711
345341.31134451565,712
346178.7720098188,713
347016.4355670964,714
347854.3020181185,715
348692.3713646551,716
349530.64360847627,717
350342.82060847624,718
350386.89660847624,719
350530.61660847627,720
350733.43260847626,721
351222.05760847626,722
352203.5506084762,723
353185.3375676014,724
354167.41848842223,725
354281.80648842227,726
354395.94712912163,727
354509.84040837956,728
354623.4863240553,729
354736.88487400813,730
354850.03605609736,731
354962.9398681822,732
355367.9488681822,733
355772.8935020505,734
356177.77376924397,735
356582.58966921957,736
357173.1966692196,737
357763.8563816515,738
358354.5688069979,739
358661.7598069979,740
358935.4938069979,741
359056.9118069979,742
359151.2748069979,743
359169.3848069979,744
359187.1851869313,745
359204.67594409606,746
359444.4159440961,747
359984.22994409606,748
360720.6659440961,749
361237.4329440961,750
361786.0729440961,751
362323.90694409603,752
362861.7630832333,753
363399.64136173297,754
363796.50636173296,755
364691.34736173303,756
364931.70836173295,757
365171.8999017439,758
365411.92198028945,759
365653.75798028946,760
365755.17798028945,761
366433.2889802894,762
366927.5029802894,763
367053.9179802894,764
367374.68598028936,765
367695.33707142173,766
368015.8712526774,767
368407.5422526774,768
369248.1832526774,769
369935.9202526774,770
370718.0542526774,771
371453.77025267744,772
371731.3722526774,773
372151.86025267746,774
372693.6332526774,775
373235.4327161608,776
373777.25864339876,777
374380.98664339876,778
374679.85764339875,779
375190.8226433988,780
375725.0996433988,781
376330.06764339877,782
376935.10374970536,783
377540.20796296577,784
378269.12696296576,785
378998.1956290294,786
379727.4139625403,787
380346.96396254026,788
381182.2339625403,789
381608.7659625403,790
381925.9929625403,791
381969.2369625403,792
382544.7589625403,793
382989.7109625403,794
383352.4289625403,795
384044.27896254027,796
384579.25296254025,797
385295.21396254026,798
386202.3809625403,799
386397.87696254026,800
386951.34396254027,801
387777.0389625403,802
388601.5049625403,803
389041.86596254027,804
389288.1849625403,805
389462.59396254027,806
390158.2719625403,807
391078.55596254027,808
391109.9119625403,809
391695.2289625403,810
392191.9189625403,811
392345.32796254026,812
393260.29796254024,813
393926.13096254016,814
394873.8279625402,815
395080.80396254023,816
395231.79496254015,817
395542.90096254024,818
396470.50896254025,819
397204.22996254027,820
397938.1071434155,821
398672.1405066344,822
398845.80450663436,823
399362.18650663435,824
399918.85450663435,825
400739.06650663435,826
401713.97050663433,827
402171.25150663435,828
402712.97350663436,829
403327.2325066344,830
404297.0235066344,831
404843.2155066344,832
405242.8715066344,833
406154.5305066344,834
406943.0415066344,835
407589.76050663437,836
408449.6495066344,837
409309.7817668391,838
410170.15728953615,839
410687.6552895362,840
410998.99728953623,841
411310.20337236015,842
411621.2735367537,843
411932.2077814627,844
412243.0061052328,845
412553.66850680986,846
412864.1949849396,847
413174.5855383678,848
413220.6215383678,849
413266.33876179217,850
413311.7372056727,851
413655.9452056727,852
414593.9352056727,853
414982.0002056727,854
415017.7632056727,855
415053.19972087356,856
415088.3097482275,857
415123.0932846865,858
415157.55032720265,859
416088.5413272026,860
416658.9763272026,861
417229.45876575843,862
417799.98864334926,863
418370.5659604541,864
418941.19071755215,865
419511.8629151224,866
420082.5825536441,867
420653.3496335962,868
421224.16415545787,869
421795.0261197082,870
422365.9355268263,871
422936.8923772913,872
423557.53237729135,873
424157.6803772913,874
424850.51037729136,875
425836.0933772913,876
426514.30137729127,877
427122.4143772913,878
427832.07537729136,879
428207.4703772913,880
428352.53637729137,881
428497.3452280547,882
428641.89692713995,883
428996.0789271399,884
429350.153358015,885
429704.1202187578,886
429842.9132187578,887
429981.44504235487,888
430119.71568706667,889
430257.72515041067,890
430395.4734299045,891
430902.09542990447,892
431150.4624299045,893
431398.64694835787,894
431646.6489835366,895
431894.4685337127,896
432142.105597158,897
432389.5601721447,898
432636.8322569446,899
432883.92184982984,900
433856.6598498299,901
434098.1868498299,902
434746.32984982984,903
435507.4298498298,904
436352.1658498298,905
436600.6818498298,906
436849.01237080025,907
437097.15741096425,908
437345.1169685449,909
437717.3029685448,910
437945.2949685449,911
438733.03596854483,912
439186.0279685449,913
439366.0979685449,914
439645.8099685449,915
440478.1059685449,916
441042.2469685449,917
441606.4327760626,918
442170.66339156695,919
442734.938815527,920
442756.623815527,921
442850.598815527,922
442944.2754611424,923
443037.6537494818,924
443338.6087494818,925
443591.1717494818,926
443843.5533000946,927
444095.75339957647,928
444405.61339957645,929
445257.7963995765,930
445467.0223995765,931
445949.6363995765,932
446432.2386572754,933
446914.8291726013,934
447397.40794548223,935
447879.9749758463,936
448362.53026362153,937
448412.1032636215,938
448742.2492636215,939
449325.8332636215,940
449452.4432636214,941
450153.60326362145,942
450854.91568095743,943
451556.3805171951,944
452257.9977739003,945
452959.7674526387,946
453394.9144526387,947
454227.5884526387,948
455060.5129411454,949
455893.6879207047,950
456755.68092070473,951
457617.94570122246,952
458480.4822650161,953
458965.4122650161,954
459345.3582650161,955
459725.21548359946,956
460104.9839199217,957
460166.56391992164,958
460417.8989199217,959
460490.4919199217,960
460946.8719199217,961
461070.73991992173,962
461474.05191992165,963
461877.29448450776,964
462280.46761303546,965
462660.2236130355,966
463039.8926210182,967
463419.47463616246,968
463798.9696576471,969
464178.377684651,970
464940.236684651,971
465702.296783329,972
466464.55798276863,973
466980.1079827687,974
467542.86598276865,975
468105.6742769303,976
468668.53286581347,977
469285.42986581346,978
469853.7218658135,979
470230.5618658135,980
470607.31072245433,981
470983.96843486023,982
471533.4254348602,983
472082.9225881657,984
472632.45989523456,985
473188.29789523454,986
473663.6038952345,987
474135.0828952345,988
474830.06489523454,989
475599.10289523454,990
476368.34848222474,991
477137.8016583719,992
477279.9066583719,993
478259.9896583719,994
479093.9746583719,995
479531.92665837187,996
480411.9946583719,997
481292.355576933,998
482173.00941710215,999
482204.96641710214,1000
482945.9354171021,1001
483736.1094171021,1002
484416.92741710215,1003
484593.1534171022,1004
485510.05241710215,1005
486366.00841710216,1006
486921.85041710216,1007
487671.03241710213,1008
488513.09041710215,1009
489503.73341710214,1010
489982.4804171021,1011
490005.2634171021,1012
490027.6770287021,1013
490049.72124812,1014
490071.3960715737,1015
490092.7014952812,1016
490174.16549528117,1017
490424.55149528116,1018
490480.71449528117,1019
490536.5355686722,1020
490592.01471195545,1021
491165.0677119554,1022
492127.57871195546,1023
492333.0667119555,1024
492427.67871195544,1025
492858.47071195545,1026
492956.1927119554,1027
493859.0727119554,1028
494124.9137119554,1029
494722.7997119555,1030
495249.1687119554,1031
495904.2297119554,1032
496296.32571195543,1033
497187.2557119555,1034
498078.49491900485,1035
498970.0433363938,1036
499361.38033639384,1037
500151.10833639384,1038
500532.03033639386,1039
501036.6493363938,1040
501327.0043363938,1041
501332.65233639383,1042
501647.8063363938,1043
502559.2103363938,1044
503138.71633639385,1045
503640.7663363939,1046
504142.82107663684,1047
504644.880557225,1048
504897.0115572251,1049
504928.581557225,1050
505600.191557225,1051
506271.94101139874,1052
506943.82992127666,1053
507411.2399212767,1054
507707.5169212767,1055
508003.63668997225,1056
508299.5992257536,1057
509144.0592257536,1058
509988.7957397365,1059
510833.8087706916,1060
511408.1587706916,1061
512215.2537706916,1062
513067.96677069156,1063
513372.1467706916,1064
513540.61777069164,1065
514412.0657706916,1066
514938.7717706916,1067
515228.06877069164,1068
515270.32177069166,1069
515526.3597706916,1070
516312.31177069165,1071
516968.04677069164,1072
517379.4187706916,1073
518022.0067706916,1074
518444.6737706916,1075
518867.28189372446,1076
519289.8311392102,1077
519712.32150656905,1078
520232.19450656907,1079
520634.9555065691,1080
520848.83850656915,1081
521084.2465065692,1082
521994.7735065692,1083
522952.7315065692,1084
523911.05980139435,1085
524869.7583950834,1086
525828.8272916749,1087
526625.2812916749,1088
527484.5742916749,1089
527827.7012916749,1090
528170.7031262808,1091
528513.579794182,1092
529248.0787941819,1093
529982.7675593967,1094
530717.6460919209,1095
530858.1700919209,1096
531060.0510919209,1097
531765.4700919209,1098
532376.679091921,1099
532987.9792050794,1100
533599.3704324285,1101
534210.852775001,1102
534822.4262338289,1103
535434.0908099448,1104
535743.9158099447,1105
536307.0628099447,1106
536870.2625640915,1107
537433.5150730044,1108
537946.5560730044,1109
538102.4000730044,1110
538960.5460730044,1111
539128.3560730044,1112
539243.5750730045,1113
539410.6290730045,1114
540246.3190730044,1115
540835.8860730045,1116
541156.9470730044,1117
542026.6390730045,1118
542155.3770730045,1119
542965.6390730045,1120
543060.7350730045,1121
543155.5029689887,1122
543249.9427573978,1123
543344.0544346721,1124
543437.8379972524,1125
543642.0949972523,1126
544611.1589972524,1127
545410.9209972523,1128
546210.9316420625,1129
547011.19093448,1130
547062.57293448,1131
547816.45793448,1132
548413.4269344801,1133
548961.89693448,1134
549077.64193448,1135
549535.7209344801,1136
549993.7693747162,1137
550451.7872549054,1138
551104.2292549055,1139
551756.8002237899,1140
552409.500163045,1141
553062.3290741575,1142
553715.2869586139,1143
554220.694958614,1144
554331.4419586139,1145
554501.535958614,1146
555415.329958614,1147
556138.415958614,1148
556931.3759586139,1149
557724.5809294186,1150
558518.0308738147,1151
559241.2518738147,1152
560049.6068738147,1153
560349.4998738148,1154
560656.7288738148,1155
561181.5888738148,1156
561510.0598738148,1157
561838.3912575986,1158
562166.583023649,1159
562494.6351704483,1160
562822.5476964796,1161
563150.3206002255,1162
563588.1276002255,1163
564088.1296002255,1164
564140.1206002255,1165
564721.0806002255,1166
564915.7486002254,1167
565161.2136002254,1168
565256.1416002254,1169
565307.9976002254,1170
565671.8226002253,1171
566035.5391989,1172
566399.1473950858,1173
567287.9403950857,1174
567289.3673950857,1175
568189.4763950858,1176
568572.8853950858,1177
568797.2193950858,1178
568904.7183950858,1179
569678.9283950857,1180
569707.6893950858,1181
570606.6023950857,1182
571007.7473950858,1183
571569.7023950857,1184
572131.714360081,1185
572693.7832907818,1186
573375.7062907817,1187
574057.7864493924,1188
574740.0237684648,1189
575422.41824985,1190
576104.9698953991,1191
576962.214895399,1192
577819.7631369212,1193
578677.6146234836,1194
579388.6626234836,1195
579685.8526234835,1196
580610.2006234835,1197
581588.1266234835,1198
582566.4566271234,1199
583545.1906390805,1200
584524.3286640317,1201
585055.7736640316,1202
585208.9506640317,1203
585732.2156640317,1204
586484.3826640317,1205
587151.8186640317,1206
588140.6966640317,1207
588785.6956640317,1208
589194.6496640317,1209
589664.6586640317,1210
590383.0456640316,1211
591101.6174056873,1212
591820.3738911673,1213
592657.4168911673,1214
592794.1178911673,1215
593368.6258911673,1216
593948.9848911674,1217
594241.8858911673,1218
594941.8098911673,1219
595502.7798911673,1220
596063.8009001919,1221
596624.8729188639,1222
597185.9959478062,1223
597747.1699876416,1224
598256.5969876416,1225
598766.0311211646,1226
599275.4723883234,1227
600241.8643883234,1228
600535.2403883234,1229
600828.4388597885,1230
601121.4598006741,1231
601414.303208936,1232
601685.168208936,1233
602400.268208936,1234
603115.5507119762,1235
603831.0157202207,1236
604751.4577202208,1237
605564.8297202208,1238
606038.1517202208,1239
606856.8227202208,1240
607675.7634413171,1241
608494.9738866948,1242
609330.8888866948,1243
610003.0018866948,1244
610675.2583946518,1245
611347.6584122675,1246
612020.2019412434,1247
612692.8889832811,1248
613542.4849832811,1249
613986.6799832811,1250
614962.5389832811,1251
615247.2659832811,1252
615531.8028962542,1253
615816.149719962,1254
616100.3064521659,1255
616920.059452166,1256
617437.873452166,1257
618081.891452166,1258
618516.856452166,1259
618951.759603417,1260
619386.6009051889,1261
619821.3803567518,1262
620256.0979573756,1263
621004.2029573756,1264
621141.6519573756,1265
621590.5179573756,1266
622129.8489573756,1267
622669.2077586475,1268
623208.5943615241,1269
624027.1553615241,1270
624115.789361524,1271
624653.909361524,1272
625176.261361524,1273
626128.372361524,1274
626891.279361524,1275
626996.1083615241,1276
627100.5888841625,1277
627204.7209252706,1278
627533.4489252706,1279
627862.0227061525,1280
628190.4422660721,1281
628235.0812660721,1282
628279.3208575419,1283
628323.1610356987,1284
628366.60179576,1285
628409.6431329431,1286
628452.2850424653,1287
628494.527519544,1288
628536.3705593966,1289
628903.6675593966,1290
629232.3795593966,1291
630014.8845593967,1292
630819.2115593967,1293
631314.2355593967,1294
631749.6785593966,1295
632640.0765593967,1296
633530.8109783474,1297
634421.8818203325,1298
634490.2318203325,1299
635400.3208203325,1300
636310.7638870996,1301
637221.5610249401,1302
638132.7122381607,1303
638460.9162381607,1304
639315.9042381607,1305
639647.5462381607,1306
639774.0762381607,1307
640353.9482381607,1308
640933.886688942,1309
641513.8915913306,1310
642489.1935913307,1311
643294.9795913306,1312
643573.7705913306,1313
644543.0025913306,1314
644685.0825913305,1315
644826.8447873956,1316
644968.289175657,1317
645228.523175657,1318
645981.543175657,1319
646734.78097163,1320
647488.2365662548,1321
648241.9099622101,1322
648407.0249622101,1323
648571.8427152495,1324
648736.3632177014,1325
649655.3722177014,1326
649876.5432177014,1327
649972.7282177014,1328
650068.5551816095,1329
650164.024105043,1330
651001.3241050431,1331
651528.2171050431,1332
652026.0431050431,1333
652878.4731050432,1334
653718.4111050431,1335
654228.7761050431,1336
654724.9301050431,1337
655221.0764889976,1338
655717.2152568251,1339
656696.0362568251,1340
657169.8672568251,1341
657628.7342568251,1342
658118.1592568251,1343
658800.7432568251,1344
659299.8642568252,1345
659798.9792147726,1346
660298.0881305994,1347
660608.4161305993,1348
661449.3561305993,1349
661739.7261305993,1350
662040.1331305993,1351
662720.4481305992,1352
663340.7971305993,1353
663677.7461305993,1354
663760.5521305993,1355
663886.1781305993,1356
663957.8861305993,1357
664602.0611305994,1358
665139.1451305994,1359
665312.4611305994,1360
665654.0131305994,1361
666277.3901305994,1362
666531.7991305994,1363
667349.1421305994,1364
667829.3581305994,1365
668309.5530610499,1366
668789.7269217041,1367
668966.0349217041,1368
669579.8669217041,1369
670513.6479217041,1370
671447.811114303,1371
672382.3565043202,1372
673126.8095043201,1373
673605.2675043201,1374
674472.3505043201,1375
675092.8335043201,1376
675878.2815043201,1377
676663.9786480545,1378
677449.9249386732,1379
678236.1203793255,1380
678936.8783793255,1381
679159.8213793255,1382
679685.7703793255,1383
680447.8233793254,1384
680921.2553793255,1385
681394.6577398424,1386
681868.0304605041,1387
682380.1774605041,1388
683266.1064605041,1389
683847.7364605041,1390
684429.433018286,1391
685011.1961346953,1392
685521.6031346953,1393
686463.9591346954,1394
687422.3091346953,1395
687576.6141346954,1396
688441.0111346954,1397
688938.8611346954,1398
689476.8601346953,1399
690183.3641346953,1400
690566.8821346953,1401
690950.288297708,1402
691333.5826223,1403
692180.2326223,1404
692636.8616223,1405
693093.4437377158,1406
693549.9789679389,1407
694440.339967939,1408
694907.472967939,1409
695156.027967939,1410
696007.8449679391,1411
696859.9692042843,1412
697712.4006809033,1413
697788.4196809033,1414
698496.9786809033,1415
699302.1256809033,1416
699728.4856809033,1417
700659.5266809033,1418
700735.3626809033,1419
701270.0666809033,1420
701698.4256809034,1421
701940.3126809034,1422
702455.8116809033,1423
702934.3246809033,1424
703436.1996809033,1425
704246.3726809033,1426
705028.6976809032,1427
705603.2496809033,1428
706061.0336809033,1429
706632.4926809033,1430
707204.0071908437,1431
707775.5772114292,1432
708347.2027433648,1433
708918.8837873553,1434
709490.6203441055,1435
710062.4124143204,1436
710634.2599987047,1437
711008.1339987046,1438
711875.6349987047,1439
712686.8489987047,1440
713022.2559987047,1441
713976.9129987047,1442
714872.3189987047,1443
715520.1669987047,1444
716168.1387694041,1445
716816.2343123973,1446
716894.1563123973,1447
717045.3213123974,1448
717522.3333123974,1449
717999.3155397831,1450
718476.2679941512,1451
719451.5569941512,1452
719499.0459941512,1453
719874.6869941511,1454
720250.2059110989,1455
720625.6027433774,1456
721000.8774893701,1457
721376.0301474598,1458
721751.0607160298,1459
722125.9691934632,1460
