value,first_value,date
268.188,268.188,2018-01-01
265.4133333333333,175.559,2018-01-02
262.63866666666667,240.429,2018-01-03
259.864,277.908,2018-01-04
257.08933333333334,225.705,2018-01-05
254.31466666666665,229.303,2018-01-06
251.54,155.866,2018-01-07
248.76533333333333,283.432,2018-01-08
245.99066666666667,197.844,2018-01-09
243.216,285.758,2018-01-10
240.44133333333332,177.581,2018-01-11
237.66666666666669,167.372,2018-01-12
234.892,228.962,2018-01-13
232.1173333333333,166.457,2018-01-14
229.34266666666667,206.121,2018-01-15
226.568,226.568,2018-01-16
226.212,226.212,2018-01-17
258.693,258.693,2018-01-18
210.607,210.607,2018-01-19
288.924,288.924,2018-01-20
224.231,224.231,2018-01-21
259.525,259.525,2018-01-22
298.188,298.188,2018-01-23
276.703,276.703,2018-01-24
168.757,168.757,2018-01-25
186.2576666666667,203.063,2018-01-26
203.75833333333333,277.253,2018-01-27
221.259,221.259,2018-01-28
279.685,279.685,2018-01-29
195.221,195.221,2018-01-30
208.535,208.535,2018-01-31
265.579,265.579,2018-02-01
158.189,158.189,2018-02-02
265.091,265.091,2018-02-03
237.56675,162.272,2018-02-04
210.0425,194.395,2018-02-05
182.51825,283.736,2018-02-06
154.994,154.994,2018-02-07
219.494,219.494,2018-02-08
167.946,167.946,2018-02-09
222.317,222.317,2018-02-10
268.282,268.282,2018-02-11
285.951,285.951,2018-02-12
298.867,298.867,2018-02-13
253.228,253.228,2018-02-14
234.523,234.523,2018-02-15
160.081,160.081,2018-02-16
177.663,177.663,2018-02-17
277.381,277.381,2018-02-18
219.931,219.931,2018-02-19
202.678,202.678,2018-02-20
189.114,189.114,2018-02-21
158.171,158.171,2018-02-22
218.3055,160.099,2018-02-23
278.44,278.44,2018-02-24
280.1193333333333,164.643,2018-02-25
281.7986666666667,257.426,2018-02-26
283.478,283.478,2018-02-27
223.516,223.516,2018-02-28
281.097,281.097,2018-03-01
232.462,232.462,2018-03-02
174.748,174.748,2018-03-03
275.791,275.791,2018-03-04
159.482,159.482,2018-03-05
254.366,254.366,2018-03-06
220.775,220.775,2018-03-07
270.901,270.901,2018-03-08
167.144,167.144,2018-03-09
282.426,282.426,2018-03-10
202.017,202.017,2018-03-11
201.41,201.41,2018-03-12
208.517,208.517,2018-03-13
150.721,150.721,2018-03-14
212.878,212.878,2018-03-15
296.672,296.672,2018-03-16
201.482,201.482,2018-03-17
254.85,254.85,2018-03-18
277.139,277.139,2018-03-19
194.334,194.334,2018-03-20
207.071,207.071,2018-03-21
169.264,169.264,2018-03-22
275.658,275.658,2018-03-23
267.92,267.92,2018-03-24
166.254,166.254,2018-03-25
294.215,294.215,2018-03-26
207.108,207.108,2018-03-27
193.894,193.894,2018-03-28
205.821,205.821,2018-03-29
169.229,169.229,2018-03-30
262.07,262.07,2018-03-31
199.086,199.086,2018-04-01
188.824,188.824,2018-04-02
191.818,215.035,2018-04-03
194.812,194.812,2018-04-04
178.7045,153.996,2018-04-05
162.597,162.597,2018-04-06
168.08800000000002,199.431,2018-04-07
173.579,173.579,2018-04-08
299.763,299.763,2018-04-09
282.075,282.075,2018-04-10
284.7045,245.333,2018-04-11
287.334,287.334,2018-04-12
290.13,238.148,2018-04-13
292.926,292.926,2018-04-14
257.877,257.877,2018-04-15
172.986,172.986,2018-04-16
255.6,255.6,2018-04-17
270.089,270.089,2018-04-18
251.026,251.026,2018-04-19
228.594,228.594,2018-04-20
247.126,247.126,2018-04-21
227.296,177.661,2018-04-22
207.466,207.466,2018-04-23
230.49,253.365,2018-04-24
253.514,253.514,2018-04-25
184.36,184.36,2018-04-26
256.967,256.967,2018-04-27
178.447,178.447,2018-04-28
248.658,248.658,2018-04-29
260.066,260.066,2018-04-30
199.564,199.564,2018-05-01
181.1345,204.042,2018-05-02
162.705,162.705,2018-05-03
229.4525,200.75,2018-05-04
296.2,296.2,2018-05-05
246.2725,295.876,2018-05-06
196.345,196.345,2018-05-07
168.711,168.711,2018-05-08
230.3365,276.253,2018-05-09
291.962,291.962,2018-05-10
251.445,166.436,2018-05-11
210.928,210.928,2018-05-12
173.763,173.763,2018-05-13
183.417,204.949,2018-05-14
193.071,190.415,2018-05-15
202.725,266.527,2018-05-16
212.379,237.095,2018-05-17
222.033,222.033,2018-05-18
259.6155,183.875,2018-05-19
297.198,297.198,2018-05-20
236.847,236.847,2018-05-21
208.726,208.726,2018-05-22
169.015,169.015,2018-05-23
219.638,161.805,2018-05-24
270.261,270.261,2018-05-25
292.948,292.948,2018-05-26
280.94100000000003,248.111,2018-05-27
268.934,268.934,2018-05-28
218.536,241.114,2018-05-29
168.138,168.138,2018-05-30
292.957,292.957,2018-05-31
251.909,251.909,2018-06-01
250.215,250.215,2018-06-02
161.209,161.209,2018-06-03
202.131,202.131,2018-06-04
225.368,228.97,2018-06-05
248.605,248.605,2018-06-06
163.001,163.001,2018-06-07
268.011,268.011,2018-06-08
218.853,193.23,2018-06-09
169.695,169.695,2018-06-10
230.802,230.802,2018-06-11
264.263,264.263,2018-06-12
178.256,178.256,2018-06-13
200.012,200.012,2018-06-14
297.557,297.557,2018-06-15
288.90075,194.15,2018-06-16
280.2445,244.313,2018-06-17
271.58825,222.711,2018-06-18
262.932,187.92,2018-06-19
254.27575,247.071,2018-06-20
245.6195,204.285,2018-06-21
236.96325,230.5,2018-06-22
228.307,245.488,2018-06-23
219.65075,209.469,2018-06-24
210.9945,295.441,2018-06-25
202.33825,198.629,2018-06-26
193.682,226.043,2018-06-27
185.02575,151.042,2018-06-28
176.3695,171.912,2018-06-29
167.71325,202.907,2018-06-30
159.057,159.057,2018-07-01
273.039,273.039,2018-07-02
174.962,174.962,2018-07-03
167.744,167.744,2018-07-04
281.298,281.298,2018-07-05
175.512,175.512,2018-07-06
233.63,233.63,2018-07-07
291.861,291.861,2018-07-08
220.862,220.862,2018-07-09
211.438,211.438,2018-07-10
220.784,220.784,2018-07-11
198.478,198.478,2018-07-12
215.809,215.809,2018-07-13
167.607,167.607,2018-07-14
299.449,299.449,2018-07-15
238.263,238.263,2018-07-16
169.04,169.04,2018-07-17
214.313,214.313,2018-07-18
211.394,209.112,2018-07-19
208.475,208.475,2018-07-20
236.9335,203.413,2018-07-21
265.392,265.392,2018-07-22
279.328,279.328,2018-07-23
166.562,166.562,2018-07-24
205.979,162.269,2018-07-25
245.396,245.396,2018-07-26
213.969,213.969,2018-07-27
255.809,255.809,2018-07-28
282.484,282.484,2018-07-29
239.6295,195.502,2018-07-30
196.775,196.775,2018-07-31
222.026,222.026,2018-08-01
153.407,153.407,2018-08-02
159.723,159.723,2018-08-03
170.695,221.911,2018-08-04
181.667,181.667,2018-08-05
177.369,177.369,2018-08-06
163.232,163.232,2018-08-07
218.857,218.857,2018-08-08
173.93,173.93,2018-08-09
266.905,266.905,2018-08-10
157.206,157.206,2018-08-11
218.243,248.672,2018-08-12
279.28,279.28,2018-08-13
276.68,276.68,2018-08-14
191.322,191.322,2018-08-15
245.1535,232.317,2018-08-16
298.985,298.985,2018-08-17
176.815,176.815,2018-08-18
152.945,152.945,2018-08-19
153.43,153.43,2018-08-20
288.863,288.863,2018-08-21
278.40075,185.069,2018-08-22
267.9385,208.42,2018-08-23
257.47625,203.487,2018-08-24
247.014,247.014,2018-08-25
201.07,201.07,2018-08-26
164.195,164.195,2018-08-27
194.90133333333333,246.84,2018-08-28
225.6076666666667,249.721,2018-08-29
256.314,256.314,2018-08-30
240.29700000000005,274.416,2018-08-31
224.28,224.28,2018-09-01
228.9505,181.45,2018-09-02
233.621,233.621,2018-09-03
190.794,190.794,2018-09-04
233.51300000000003,270.535,2018-09-05
276.232,276.232,2018-09-06
247.157,247.157,2018-09-07
261.949,224.892,2018-09-08
276.741,293.046,2018-09-09
291.533,291.533,2018-09-10
270.22950000000003,171.062,2018-09-11
248.926,248.926,2018-09-12
225.7025,225.973,2018-09-13
202.479,202.479,2018-09-14
157.122,157.122,2018-09-15
196.9985,218.024,2018-09-16
236.875,236.875,2018-09-17
289.812,289.812,2018-09-18
291.55133333333333,213.62,2018-09-19
293.29066666666665,184.289,2018-09-20
295.03,295.03,2018-09-21
151.579,151.579,2018-09-22
230.099,230.099,2018-09-23
184.367,184.367,2018-09-24
219.729,219.729,2018-09-25
295.585,295.585,2018-09-26
235.335,235.335,2018-09-27
170.746,170.746,2018-09-28
181.002,264.705,2018-09-29
191.258,191.258,2018-09-30
170.798,170.798,2018-10-01
209.7605,285.599,2018-10-02
248.723,248.723,2018-10-03
197.059,197.059,2018-10-04
192.014,195.024,2018-10-05
186.969,186.969,2018-10-06
177.388,248.337,2018-10-07
167.807,214.13,2018-10-08
158.226,158.226,2018-10-09
228.776,228.776,2018-10-10
161.443,161.443,2018-10-11
177.6735,262.593,2018-10-12
193.904,193.904,2018-10-13
195.721,195.721,2018-10-14
188.298,188.298,2018-10-15
194.7675,156.316,2018-10-16
201.237,201.237,2018-10-17
207.719,207.719,2018-10-18
185.38,185.38,2018-10-19
273.858,273.858,2018-10-20
284.7015,235.189,2018-10-21
295.545,295.545,2018-10-22
296.85850000000005,283.929,2018-10-23
298.172,298.172,2018-10-24
217.741,217.741,2018-10-25
279.237,279.237,2018-10-26
245.7493333333333,248.353,2018-10-27
212.26166666666663,162.3,2018-10-28
178.774,178.774,2018-10-29
217.149,217.149,2018-10-30
227.935,227.935,2018-10-31
251.00866666666667,183.618,2018-11-01
274.08233333333334,161.358,2018-11-02
297.156,297.156,2018-11-03
291.5315,260.867,2018-11-04
285.907,285.907,2018-11-05
269.015,269.015,2018-11-06
211.519,211.519,2018-11-07
215.02,279.164,2018-11-08
218.521,218.521,2018-11-09
213.508,213.508,2018-11-10
186.752,294.788,2018-11-11
159.996,159.996,2018-11-12
166.495,166.495,2018-11-13
229.558,229.558,2018-11-14
229.641,229.641,2018-11-15
152.638,152.638,2018-11-16
222.362,222.362,2018-11-17
275.259,275.259,2018-11-18
208.638,208.638,2018-11-19
260.822,260.822,2018-11-20
208.4525,196.179,2018-11-21
156.083,156.083,2018-11-22
234.276,234.276,2018-11-23
203.417,203.417,2018-11-24
268.087,268.087,2018-11-25
279.452,279.452,2018-11-26
234.571,234.571,2018-11-27
183.779,183.779,2018-11-28
254.104,254.104,2018-11-29
244.731,244.731,2018-11-30
210.135,210.135,2018-12-01
244.759,255.732,2018-12-02
279.383,279.383,2018-12-03
218.821,218.821,2018-12-04
205.406,205.406,2018-12-05
270.508,270.508,2018-12-06
241.848,241.848,2018-12-07
297.719,297.719,2018-12-08
282.041,282.041,2018-12-09
214.807,214.807,2018-12-10
192.276,258.796,2018-12-11
169.745,169.745,2018-12-12
221.185,221.185,2018-12-13
208.12,208.12,2018-12-14
207.669,207.669,2018-12-15
173.269,173.269,2018-12-16
167.125,167.125,2018-12-17
290.194,290.194,2018-12-18
298.957,298.957,2018-12-19
250.153,250.153,2018-12-20
179.303,179.303,2018-12-21
232.492,232.492,2018-12-22
188.031,188.031,2018-12-23
260.695,260.695,2018-12-24
247.578,247.578,2018-12-25
219.271,219.271,2018-12-26
291.001,291.001,2018-12-27
197.305,197.305,2018-12-28
211.4035,281.664,2018-12-29
225.502,225.502,2018-12-30
233.858,276.979,2018-12-31
242.214,242.214,2019-01-01
275.926,275.926,2019-01-02
220.782,245.711,2019-01-03
165.638,165.638,2019-01-04
175.153,175.153,2019-01-05
276.495,276.495,2019-01-06
273.446,292.328,2019-01-07
270.397,270.397,2019-01-08
248.0425,250.728,2019-01-09
225.688,225.688,2019-01-10
186.823,186.823,2019-01-11
168.007,168.007,2019-01-12
187.197,187.197,2019-01-13
159.103,159.103,2019-01-14
275.936,275.936,2019-01-15
291.763,291.763,2019-01-16
247.127,222.573,2019-01-17
202.491,202.491,2019-01-18
223.1375,244.863,2019-01-19
243.784,243.784,2019-01-20
264.819,264.819,2019-01-21
212.19,212.19,2019-01-22
275.715,275.715,2019-01-23
181.545,181.545,2019-01-24
263.761,263.761,2019-01-25
159.005,159.005,2019-01-26
211.733,214.662,2019-01-27
264.461,264.461,2019-01-28
197.878,197.878,2019-01-29
196.708,196.708,2019-01-30
241.257,241.257,2019-01-31
232.9075,208.773,2019-02-01
224.558,224.558,2019-02-02
189.535,189.535,2019-02-03
170.935,170.935,2019-02-04
220.194,188.326,2019-02-05
269.453,269.453,2019-02-06
229.293,229.293,2019-02-07
237.599,237.599,2019-02-08
208.146,208.146,2019-02-09
251.896,206.531,2019-02-10
295.646,295.646,2019-02-11
266.052,266.052,2019-02-12
257.3946,247.629,2019-02-13
248.73720000000003,250.036,2019-02-14
240.07980000000003,244.537,2019-02-15
231.4224,263.673,2019-02-16
222.765,220.476,2019-02-17
214.1076,217.73,2019-02-18
205.4502,161.276,2019-02-19
196.7928,177.906,2019-02-20
188.1354,227.635,2019-02-21
179.478,179.478,2019-02-22
219.462,219.462,2019-02-23
234.795,234.795,2019-02-24
252.363,252.363,2019-02-25
173.745,173.745,2019-02-26
201.143,201.143,2019-02-27
171.151,171.151,2019-02-28
194.767,194.767,2019-03-01
212.937,212.937,2019-03-02
246.396,246.396,2019-03-03
204.998,204.998,2019-03-04
239.503,239.503,2019-03-05
272.771,272.771,2019-03-06
281.716,159.57,2019-03-07
290.661,290.661,2019-03-08
286.174,286.174,2019-03-09
284.785,293.211,2019-03-10
283.396,208.927,2019-03-11
282.007,282.007,2019-03-12
213.409,213.409,2019-03-13
251.2215,197.334,2019-03-14
289.034,289.034,2019-03-15
251.61,251.61,2019-03-16
239.178,239.178,2019-03-17
187.112,187.112,2019-03-18
291.24,291.24,2019-03-19
171.792,171.792,2019-03-20
284.433,284.433,2019-03-21
248.11633333333333,169.1,2019-03-22
211.79966666666667,245.687,2019-03-23
175.483,175.483,2019-03-24
205.334,205.334,2019-03-25
200.651,200.651,2019-03-26
235.658,235.658,2019-03-27
231.585,231.585,2019-03-28
227.6785,254.636,2019-03-29
223.772,223.772,2019-03-30
281.508,281.508,2019-03-31
234.1065,298.848,2019-04-01
186.705,186.705,2019-04-02
153.935,153.935,2019-04-03
274.842,274.842,2019-04-04
269.548,269.548,2019-04-05
256.946,225.154,2019-04-06
244.344,244.344,2019-04-07
172.444,172.444,2019-04-08
168.96875,184.589,2019-04-09
165.49349999999998,273.25,2019-04-10
162.01825,273.479,2019-04-11
158.543,158.543,2019-04-12
198.879,198.879,2019-04-13
244.97,244.97,2019-04-14
237.131,237.131,2019-04-15
221.809,221.809,2019-04-16
194.189,194.189,2019-04-17
220.0625,241.411,2019-04-18
245.936,245.936,2019-04-19
271.851,253.9,2019-04-20
297.766,297.766,2019-04-21
254.802,254.802,2019-04-22
248.421,248.421,2019-04-23
246.422,246.422,2019-04-24
241.3765,283.306,2019-04-25
236.331,236.331,2019-04-26
271.2,271.2,2019-04-27
167.171,167.171,2019-04-28
236.702,236.702,2019-04-29
213.144,213.144,2019-04-30
166.94,166.94,2019-05-01
246.765,246.765,2019-05-02
211.95,211.95,2019-05-03
293.508,293.508,2019-05-04
159.786,159.786,2019-05-05
242.03,242.03,2019-05-06
291.362,291.362,2019-05-07
207.905,207.905,2019-05-08
184.774,184.774,2019-05-09
244.143,244.143,2019-05-10
205.131,205.131,2019-05-11
295.956,295.956,2019-05-12
162.906,162.906,2019-05-13
242.412,242.412,2019-05-14
272.669,272.669,2019-05-15
290.551,290.551,2019-05-16
276.858,282.571,2019-05-17
263.165,263.165,2019-05-18
230.065,230.065,2019-05-19
263.575,182.363,2019-05-20
297.085,297.085,2019-05-21
202.923,202.923,2019-05-22
253.646,253.646,2019-05-23
214.563,214.563,2019-05-24
206.104,252.299,2019-05-25
197.645,197.645,2019-05-26
197.283,197.283,2019-05-27
237.926,237.926,2019-05-28
168.578,168.578,2019-05-29
238.317,238.317,2019-05-30
252.246,252.246,2019-05-31
221.986,221.986,2019-06-01
273.174,273.174,2019-06-02
251.32,251.32,2019-06-03
246.267,151.061,2019-06-04
241.214,241.214,2019-06-05
226.12,211.946,2019-06-06
211.026,211.026,2019-06-07
226.392,226.392,2019-06-08
292.026,292.026,2019-06-09
254.0103333333333,172.765,2019-06-10
215.99466666666663,222.243,2019-06-11
177.979,177.979,2019-06-12
234.203,234.203,2019-06-13
206.068,206.068,2019-06-14
227.545,227.545,2019-06-15
250.051,250.051,2019-06-16
237.45,237.45,2019-06-17
191.951,191.951,2019-06-18
290.305,290.305,2019-06-19
155.263,155.263,2019-06-20
222.71,222.71,2019-06-21
230.582,230.582,2019-06-22
196.802,196.802,2019-06-23
243.576,243.576,2019-06-24
268.012,268.012,2019-06-25
279.26,279.26,2019-06-26
171.689,171.689,2019-06-27
236.067,236.067,2019-06-28
230.546,230.546,2019-06-29
191.441,181.94,2019-06-30
152.336,152.336,2019-07-01
282.645,282.645,2019-07-02
258.882,258.882,2019-07-03
260.836,260.836,2019-07-04
275.932,275.932,2019-07-05
215.637,215.637,2019-07-06
235.934,265.61,2019-07-07
256.231,256.231,2019-07-08
191.017,191.017,2019-07-09
296.137,296.137,2019-07-10
237.891,237.891,2019-07-11
152.835,152.835,2019-07-12
188.871,188.871,2019-07-13
184.94,184.94,2019-07-14
259.04,259.04,2019-07-15
223.387,223.387,2019-07-16
245.696,245.696,2019-07-17
286.076,286.076,2019-07-18
190.874,190.874,2019-07-19
199.475,199.475,2019-07-20
281.75,281.75,2019-07-21
247.178,282.549,2019-07-22
212.606,212.606,2019-07-23
269.898,269.898,2019-07-24
209.056,209.056,2019-07-25
253.33,253.33,2019-07-26
265.54,265.54,2019-07-27
173.557,173.557,2019-07-28
275.812,275.812,2019-07-29
271.986,271.986,2019-07-30
243.688,243.688,2019-07-31
198.897,198.897,2019-08-01
200.09340625,204.791,2019-08-02
201.2898125,252.617,2019-08-03
202.48621875,235.43,2019-08-04
203.682625,197.094,2019-08-05
204.87903125,236.16,2019-08-06
206.0754375,198.077,2019-08-07
207.27184375,232.208,2019-08-08
208.46825,160.56,2019-08-09
209.66465625,288.4,2019-08-10
210.8610625,212.538,2019-08-11
212.05746875,255.591,2019-08-12
213.253875,247.863,2019-08-13
214.45028125,265.19,2019-08-14
215.6466875,295.198,2019-08-15
216.84309375,170.758,2019-08-16
218.0395,208.286,2019-08-17
219.23590625,262.627,2019-08-18
220.4323125,182.159,2019-08-19
221.62871875,159.703,2019-08-20
222.825125,285.594,2019-08-21
224.02153125,299.263,2019-08-22
225.2179375,262.813,2019-08-23
226.41434375,190.828,2019-08-24
227.61075,250.685,2019-08-25
228.80715625,250.641,2019-08-26
230.0035625,279.125,2019-08-27
231.19996875,285.299,2019-08-28
232.396375,285.679,2019-08-29
233.59278125,281.172,2019-08-30
234.7891875,235.801,2019-08-31
235.98559375,220.539,2019-09-01
237.182,237.182,2019-09-02
235.61675,289.958,2019-09-03
234.0515,201.589,2019-09-04
232.48625,290.644,2019-09-05
230.921,230.921,2019-09-06
191.274,191.274,2019-09-07
254.188,254.188,2019-09-08
277.981,277.981,2019-09-09
228.5655,150.947,2019-09-10
179.15,179.15,2019-09-11
171.791,171.791,2019-09-12
167.787,167.787,2019-09-13
296.55,296.55,2019-09-14
275.873,275.873,2019-09-15
172.721,172.721,2019-09-16
187.862,187.862,2019-09-17
231.311,231.311,2019-09-18
231.907,157.464,2019-09-19
232.503,242.249,2019-09-20
233.099,244.376,2019-09-21
233.695,233.695,2019-09-22
253.32,253.32,2019-09-23
238.362,238.362,2019-09-24
242.519,242.519,2019-09-25
211.2315,239.279,2019-09-26
179.944,179.944,2019-09-27
175.4035,190.84,2019-09-28
170.863,170.863,2019-09-29
186.4953333333333,253.465,2019-09-30
202.12766666666667,172.725,2019-10-01
217.76,217.76,2019-10-02
216.076,216.076,2019-10-03
260.328,260.328,2019-10-04
263.24,263.24,2019-10-05
260.23,260.23,2019-10-06
256.429,293.353,2019-10-07
252.628,252.628,2019-10-08
210.371,260.179,2019-10-09
168.114,168.114,2019-10-10
229.615,229.615,2019-10-11
257.186,257.186,2019-10-12
196.068,196.068,2019-10-13
184.64,256.085,2019-10-14
173.212,173.212,2019-10-15
241.905,241.905,2019-10-16
195.457,195.457,2019-10-17
238.81,157.43,2019-10-18
282.163,282.163,2019-10-19
233.01,233.01,2019-10-20
293.065,293.065,2019-10-21
165.022,165.022,2019-10-22
214.933,214.933,2019-10-23
216.606,216.606,2019-10-24
177.527,177.527,2019-10-25
191.733,153.578,2019-10-26
205.939,205.939,2019-10-27
194.325,153.273,2019-10-28
182.711,249.293,2019-10-29
171.097,171.097,2019-10-30
177.102,296.871,2019-10-31
183.107,183.107,2019-11-01
192.4105,276.084,2019-11-02
201.714,201.714,2019-11-03
233.273,233.273,2019-11-04
199.09,199.09,2019-11-05
247.913,247.913,2019-11-06
283.948,283.948,2019-11-07
271.512,271.512,2019-11-08
193.06,193.06,2019-11-09
186.068,186.068,2019-11-10
244.623,244.623,2019-11-11
286.255,286.255,2019-11-12
298.266,298.266,2019-11-13
277.077,277.077,2019-11-14
227.05,227.05,2019-11-15
212.134,209.726,2019-11-16
197.218,197.218,2019-11-17
183.382,183.382,2019-11-18
163.593,163.593,2019-11-19
191.4845,233.854,2019-11-20
219.376,219.376,2019-11-21
211.011,211.011,2019-11-22
254.004,254.004,2019-11-23
206.17,206.17,2019-11-24
220.22,171.339,2019-11-25
234.27,234.27,2019-11-26
218.52,218.52,2019-11-27
229.803,154.325,2019-11-28
241.086,241.086,2019-11-29
213.849,213.849,2019-11-30
272.43,272.43,2019-12-01
218.6185,210.922,2019-12-02
164.807,164.807,2019-12-03
271.917,271.917,2019-12-04
255.567,255.567,2019-12-05
218.371,218.371,2019-12-06
217.781,217.781,2019-12-07
258.483,226.793,2019-12-08
299.185,299.185,2019-12-09
192.747,192.747,2019-12-10
165.448,165.448,2019-12-11
283.536,283.536,2019-12-12
282.66516666666666,187.38,2019-12-13
281.7943333333333,248.738,2019-12-14
280.9235,195.028,2019-12-15
280.05266666666665,277.525,2019-12-16
279.1818333333333,289.576,2019-12-17
278.311,278.311,2019-12-18
254.829,254.829,2019-12-19
234.8745,199.568,2019-12-20
214.92,214.92,2019-12-21
157.638,157.638,2019-12-22
260.367,260.367,2019-12-23
270.706,270.706,2019-12-24
225.00850000000003,280.559,2019-12-25
179.311,179.311,2019-12-26
257.224,257.224,2019-12-27
257.993,257.993,2019-12-28
232.496,232.496,2019-12-29
259.287,259.287,2019-12-30
264.248,295.408,2019-12-31
269.209,269.209,2020-01-01
278.402,278.402,2020-01-02
239.92,239.92,2020-01-03
273.434,273.434,2020-01-04
298.262,298.262,2020-01-05
256.666,283.86,2020-01-06
215.07,215.07,2020-01-07
291.183,291.183,2020-01-08
209.484,209.484,2020-01-09
255.671,255.671,2020-01-10
243.632,243.632,2020-01-11
188.444,188.444,2020-01-12
229.675,229.675,2020-01-13
208.964,208.964,2020-01-14
265.426,265.426,2020-01-15
247.2055,287.832,2020-01-16
228.985,228.985,2020-01-17
205.475,187.931,2020-01-18
181.965,181.965,2020-01-19
161.488,161.488,2020-01-20
299.807,299.807,2020-01-21
283.267,283.267,2020-01-22
260.738,260.738,2020-01-23
208.559,208.559,2020-01-24
201.249,201.249,2020-01-25
299.124,299.124,2020-01-26
156.04,156.04,2020-01-27
160.574,160.574,2020-01-28
185.455,237.298,2020-01-29
210.336,210.336,2020-01-30
225.88433333333333,252.083,2020-01-31
241.43266666666668,187.299,2020-02-01
256.981,256.981,2020-02-02
267.29650000000004,204.382,2020-02-03
277.612,277.612,2020-02-04
266.478,266.478,2020-02-05
266.208,217.752,2020-02-06
265.938,265.938,2020-02-07
263.34,263.34,2020-02-08
280.35799999999995,287.743,2020-02-09
297.376,297.376,2020-02-10
212.12,212.12,2020-02-11
173.842,173.842,2020-02-12
288.429,288.429,2020-02-13
241.955,155.223,2020-02-14
195.481,195.481,2020-02-15
210.21,210.21,2020-02-16
225.38933333333333,236.016,2020-02-17
240.56866666666667,186.755,2020-02-18
255.748,255.748,2020-02-19
152.097,152.097,2020-02-20
220.154,220.154,2020-02-21
191.369,248.162,2020-02-22
162.584,162.584,2020-02-23
214.935,214.935,2020-02-24
199.873,218.528,2020-02-25
184.811,184.811,2020-02-26
275.504,275.504,2020-02-27
204.456,204.456,2020-02-28
211.90475,220.752,2020-02-29
219.3535,185.037,2020-03-01
226.80225,162.746,2020-03-02
234.251,234.251,2020-03-03
272.024,272.024,2020-03-04
169.604,169.604,2020-03-05
246.592,246.592,2020-03-06
188.885,188.885,2020-03-07
269.59,269.59,2020-03-08
217.189,217.189,2020-03-09
252.864,182.097,2020-03-10
288.539,288.539,2020-03-11
289.118,289.118,2020-03-12
297.324,297.324,2020-03-13
272.293,272.293,2020-03-14
265.995,265.995,2020-03-15
151.61,151.61,2020-03-16
177.639,177.639,2020-03-17
195.14,195.14,2020-03-18
223.247,223.247,2020-03-19
222.012,189.726,2020-03-20
220.777,220.777,2020-03-21
195.489,213.162,2020-03-22
170.201,170.201,2020-03-23
296.12,296.12,2020-03-24
201.866,201.866,2020-03-25
186.598,199.489,2020-03-26
171.33,171.33,2020-03-27
201.224,201.224,2020-03-28
223.946,241.651,2020-03-29
246.668,246.668,2020-03-30
258.095,258.095,2020-03-31
247.043,247.043,2020-04-01
185.111,185.111,2020-04-02
217.7145,292.449,2020-04-03
250.318,250.318,2020-04-04
212.861,212.861,2020-04-05
165.993,165.993,2020-04-06
176.668,176.668,2020-04-07
220.793,220.793,2020-04-08
158.007,158.007,2020-04-09
266.506,266.506,2020-04-10
295.556,295.556,2020-04-11
199.955,199.955,2020-04-12
240.177,240.177,2020-04-13
235.358,235.358,2020-04-14
289.976,289.976,2020-04-15
235.415,235.415,2020-04-16
185.157,185.157,2020-04-17
290.195,290.195,2020-04-18
283.4753333333333,166.577,2020-04-19
276.7556666666667,151.252,2020-04-20
270.036,270.036,2020-04-21
207.739,207.739,2020-04-22
197.708,226.591,2020-04-23
187.677,187.677,2020-04-24
261.878,261.878,2020-04-25
298.526,298.526,2020-04-26
223.365,223.365,2020-04-27
257.659,257.659,2020-04-28
236.17975,263.601,2020-04-29
214.7005,198.468,2020-04-30
193.22125,216.487,2020-05-01
171.742,171.742,2020-05-02
212.777,212.777,2020-05-03
281.463,281.463,2020-05-04
189.645,189.645,2020-05-05
183.73266666666663,262.511,2020-05-06
177.82033333333334,232.304,2020-05-07
171.908,171.908,2020-05-08
204.878,222.374,2020-05-09
237.848,237.848,2020-05-10
243.507,243.507,2020-05-11
229.431,229.431,2020-05-12
238.81714285714287,200.276,2020-05-13
248.20328571428573,289.727,2020-05-14
257.5894285714286,169.998,2020-05-15
266.97557142857147,223.786,2020-05-16
276.3617142857143,224.906,2020-05-17
285.7478571428572,181.895,2020-05-18
295.134,295.134,2020-05-19
239.419,215.623,2020-05-20
183.704,183.704,2020-05-21
275.499,275.499,2020-05-22
192.333,192.333,2020-05-23
256.372,256.372,2020-05-24
274.963,274.963,2020-05-25
288.739,288.739,2020-05-26
244.964,244.964,2020-05-27
283.782,283.782,2020-05-28
269.411,181.321,2020-05-29
255.04,255.04,2020-05-30
194.655,194.655,2020-05-31
250.183,250.183,2020-06-01
240.541,240.541,2020-06-02
239.71,239.71,2020-06-03
289.011,289.011,2020-06-04
230.895,207.892,2020-06-05
172.779,172.779,2020-06-06
228.092,228.092,2020-06-07
224.6825,240.439,2020-06-08
221.273,221.273,2020-06-09
273.919,273.919,2020-06-10
275.705,275.705,2020-06-11
188.908,188.908,2020-06-12
197.57785714285717,156.085,2020-06-13
206.24771428571427,252.136,2020-06-14
214.91757142857145,294.554,2020-06-15
223.58742857142855,242.738,2020-06-16
232.25728571428573,237.372,2020-06-17
240.92714285714283,188.484,2020-06-18
249.597,249.597,2020-06-19
284.484,284.484,2020-06-20
222.787,222.787,2020-06-21
181.326,181.326,2020-06-22
177.974,177.974,2020-06-23
204.613,247.864,2020-06-24
231.252,231.252,2020-06-25
256.213,256.213,2020-06-26
246.617,246.617,2020-06-27
220.845,220.845,2020-06-28
262.05,262.05,2020-06-29
238.6925,289.569,2020-06-30
215.335,215.335,2020-07-01
272.937,272.937,2020-07-02
280.9306666666667,153.476,2020-07-03
288.9243333333333,245.299,2020-07-04
296.918,296.918,2020-07-05
231.238,231.238,2020-07-06
209.977,209.977,2020-07-07
214.468,155.363,2020-07-08
218.959,218.959,2020-07-09
220.264,220.264,2020-07-10
192.236,192.236,2020-07-11
230.8,249.775,2020-07-12
269.364,269.364,2020-07-13
171.058,171.058,2020-07-14
206.309,206.309,2020-07-15
228.7055,164.535,2020-07-16
251.102,251.102,2020-07-17
225.216,225.216,2020-07-18
192.582,192.582,2020-07-19
241.235,241.235,2020-07-20
252.209,252.209,2020-07-21
203.339,203.339,2020-07-22
175.178,175.178,2020-07-23
198.944,198.944,2020-07-24
262.603,262.603,2020-07-25
264.176,264.176,2020-07-26
197.213,197.213,2020-07-27
189.617,189.617,2020-07-28
275.744,275.744,2020-07-29
289.758,289.758,2020-07-30
231.71,190.169,2020-07-31
173.662,173.662,2020-08-01
176.42,176.42,2020-08-02
265.27,265.27,2020-08-03
285.2,285.2,2020-08-04
281.321,155.529,2020-08-05
277.442,277.442,2020-08-06
266.27750000000003,199.004,2020-08-07
255.113,249.086,2020-08-08
243.9485,221.143,2020-08-09
232.784,232.784,2020-08-10
161.168,161.168,2020-08-11
198.976,198.976,2020-08-12
260.358,260.358,2020-08-13
266.779,266.779,2020-08-14
237.175,237.175,2020-08-15
246.633,246.633,2020-08-16
237.4155,271.568,2020-08-17
228.198,228.198,2020-08-18
291.461,291.461,2020-08-19
157.473,157.473,2020-08-20
266.931,266.931,2020-08-21
269.75,269.75,2020-08-22
257.067,273.345,2020-08-23
244.384,244.384,2020-08-24
269.25,269.25,2020-08-25
293.196,293.196,2020-08-26
266.9585,197.102,2020-08-27
240.721,240.721,2020-08-28
223.047,223.047,2020-08-29
212.8785,237.379,2020-08-30
202.71,202.71,2020-08-31
156.015,156.015,2020-09-01
194.581,194.581,2020-09-02
181.121,181.121,2020-09-03
232.536,232.536,2020-09-04
242.06566666666663,223.383,2020-09-05
251.59533333333331,267.098,2020-09-06
261.125,261.125,2020-09-07
250.855,250.855,2020-09-08
224.407,249.878,2020-09-09
197.959,197.959,2020-09-10
212.379,212.379,2020-09-11
220.646,220.646,2020-09-12
161.045,161.045,2020-09-13
180.046,180.046,2020-09-14
279.318,279.318,2020-09-15
225.8005,220.424,2020-09-16
172.283,172.283,2020-09-17
191.522,191.522,2020-09-18
231.061,231.061,2020-09-19
219.3205,191.262,2020-09-20
207.58,207.58,2020-09-21
251.86,251.86,2020-09-22
224.697,224.697,2020-09-23
256.685,256.651,2020-09-24
288.673,288.673,2020-09-25
254.304,235.61,2020-09-26
219.935,237.033,2020-09-27
185.566,205.998,2020-09-28
151.197,151.197,2020-09-29
288.199,288.199,2020-09-30
255.238,255.238,2020-10-01
293.623,293.623,2020-10-02
289.55,289.55,2020-10-03
236.0345,221.403,2020-10-04
182.519,182.519,2020-10-05
212.579,212.579,2020-10-06
234.019,234.019,2020-10-07
246.092,246.092,2020-10-08
240.224,280.763,2020-10-09
234.356,234.356,2020-10-10
170.522,170.522,2020-10-11
234.109,234.109,2020-10-12
252.747,252.747,2020-10-13
289.013,289.013,2020-10-14
241.249,241.249,2020-10-15
249.051,153.09,2020-10-16
256.85299999999995,175.439,2020-10-17
264.655,264.655,2020-10-18
215.601,215.601,2020-10-19
274.879,274.879,2020-10-20
169.967,169.967,2020-10-21
222.884,222.884,2020-10-22
174.626,174.626,2020-10-23
220.101,220.101,2020-10-24
233.928,233.928,2020-10-25
280.07,280.07,2020-10-26
280.79650000000004,246.952,2020-10-27
281.523,281.523,2020-10-28
286.242,286.242,2020-10-29
221.97,221.97,2020-10-30
214.875,214.875,2020-10-31
214.827,214.827,2020-11-01
151.014,151.014,2020-11-02
189.6833333333333,167.311,2020-11-03
228.35266666666664,157.468,2020-11-04
267.022,267.022,2020-11-05
177.024,177.024,2020-11-06
194.622,292.407,2020-11-07
212.22,285.032,2020-11-08
229.818,229.818,2020-11-09
258.559,258.559,2020-11-10
235.593,235.593,2020-11-11
210.61,210.61,2020-11-12
183.309,183.309,2020-11-13
279.373,279.373,2020-11-14
251.261,251.261,2020-11-15
265.186,265.186,2020-11-16
276.2685,298.727,2020-11-17
287.351,287.351,2020-11-18
168.861,168.861,2020-11-19
163.1245,253.821,2020-11-20
157.388,157.388,2020-11-21
187.447,187.447,2020-11-22
288.222,288.222,2020-11-23
227.328,227.328,2020-11-24
221.12633333333332,232.201,2020-11-25
214.92466666666667,215.829,2020-11-26
208.723,208.723,2020-11-27
172.981,172.981,2020-11-28
214.294,165.214,2020-11-29
255.607,255.607,2020-11-30
194.569,194.569,2020-12-01
177.744,177.744,2020-12-02
179.88733333333334,275.08,2020-12-03
182.03066666666663,160.27,2020-12-04
184.174,184.174,2020-12-05
175.927,175.927,2020-12-06
183.687,183.687,2020-12-07
299.127,299.127,2020-12-08
278.123,278.123,2020-12-09
220.768,220.768,2020-12-10
276.229,276.229,2020-12-11
267.57,267.57,2020-12-12
259.354,259.354,2020-12-13
213.232,213.232,2020-12-14
249.601,249.601,2020-12-15
268.438,268.438,2020-12-16
273.346,273.346,2020-12-17
299.158,299.158,2020-12-18
155.241,155.241,2020-12-19
190.063,190.063,2020-12-20
179.738,179.738,2020-12-21
192.843,192.843,2020-12-22
180.25,180.25,2020-12-23
221.166,154.888,2020-12-24
262.082,262.082,2020-12-25
236.968,236.968,2020-12-26
200.65,200.706,2020-12-27
164.332,164.332,2020-12-28
177.941,177.941,2020-12-29
292.95,292.95,2020-12-30
269.661,269.661,2020-12-31
207.565,207.565,2021-01-01
179.652,198.106,2021-01-02
151.739,151.739,2021-01-03
202.535,173.388,2021-01-04
253.331,253.331,2021-01-05
196.488,196.488,2021-01-06
178.656,178.656,2021-01-07
250.917,250.917,2021-01-08
169.614,169.614,2021-01-09
285.842,285.842,2021-01-10
258.5345,183.039,2021-01-11
231.227,231.227,2021-01-12
195.907,195.907,2021-01-13
233.79,233.79,2021-01-14
248.261,248.261,2021-01-15
271.441,271.441,2021-01-16
258.018,258.018,2021-01-17
201.1,201.1,2021-01-18
165.213,165.213,2021-01-19
224.051,224.051,2021-01-20
193.855,193.855,2021-01-21
258.268,258.268,2021-01-22
292.223,292.223,2021-01-23
225.173,225.173,2021-01-24
168.611,168.611,2021-01-25
162.499,162.499,2021-01-26
233.826,233.826,2021-01-27
189.525,189.525,2021-01-28
269.907,269.907,2021-01-29
172.369,172.369,2021-01-30
220.069,220.069,2021-01-31
262.934,262.934,2021-02-01
266.958,266.958,2021-02-02
288.982,288.982,2021-02-03
175.308,175.308,2021-02-04
289.04,289.04,2021-02-05
209.849,209.849,2021-02-06
291.632,291.632,2021-02-07
268.066,268.066,2021-02-08
260.923,260.923,2021-02-09
240.76,240.76,2021-02-10
225.787,225.787,2021-02-11
184.366,184.366,2021-02-12
270.164,270.164,2021-02-13
258.838,258.838,2021-02-14
235.844,235.844,2021-02-15
266.638,266.638,2021-02-16
220.786,220.786,2021-02-17
191.441,236.523,2021-02-18
162.096,162.096,2021-02-19
183.101,226.061,2021-02-20
204.106,204.106,2021-02-21
195.447,195.447,2021-02-22
190.365,190.365,2021-02-23
176.628,176.628,2021-02-24
212.9643333333333,217.174,2021-02-25
249.30066666666664,269.601,2021-02-26
285.637,285.637,2021-02-27
223.7425,238.637,2021-02-28
161.848,161.848,2021-03-01
155.05,155.05,2021-03-02
158.686,158.686,2021-03-03
259.284,259.284,2021-03-04
235.279,235.279,2021-03-05
214.396,214.396,2021-03-06
279.159,279.159,2021-03-07
172.212,172.212,2021-03-08
174.343,174.343,2021-03-09
256.395,256.395,2021-03-10
298.115,298.115,2021-03-11
268.884,298.88,2021-03-12
239.653,288.46,2021-03-13
210.422,210.422,2021-03-14
223.981,223.981,2021-03-15
216.802,216.802,2021-03-16
267.375,267.375,2021-03-17
221.477,221.477,2021-03-18
239.67,239.67,2021-03-19
220.588,220.588,2021-03-20
189.838,189.838,2021-03-21
247.425,247.425,2021-03-22
270.319,270.319,2021-03-23
256.464,256.464,2021-03-24
236.247,236.247,2021-03-25
243.6895,296.454,2021-03-26
251.132,251.132,2021-03-27
294.363,294.363,2021-03-28
150.126,150.126,2021-03-29
188.73,188.73,2021-03-30
208.237,208.237,2021-03-31
238.205,238.205,2021-04-01
278.638,278.638,2021-04-02
228.548,228.548,2021-04-03
200.054,200.054,2021-04-04
226.437,226.437,2021-04-05
241.72,279.877,2021-04-06
257.003,257.003,2021-04-07
225.554,225.554,2021-04-08
227.775,152.562,2021-04-09
229.996,229.996,2021-04-10
151.605,151.605,2021-04-11
270.443,270.443,2021-04-12
194.329,194.329,2021-04-13
164.846,164.846,2021-04-14
214.125,214.125,2021-04-15
207.465,207.465,2021-04-16
185.763,283.6,2021-04-17
164.061,164.061,2021-04-18
184.541,184.541,2021-04-19
188.281,188.281,2021-04-20
265.607,265.607,2021-04-21
220.51,220.51,2021-04-22
221.041,221.041,2021-04-23
239.158,239.158,2021-04-24
236.0375,195.836,2021-04-25
232.917,232.917,2021-04-26
225.67,186.628,2021-04-27
218.423,210.68,2021-04-28
211.176,211.176,2021-04-29
216.667,268.092,2021-04-30
222.158,294.192,2021-05-01
227.649,227.649,2021-05-02
154.601,154.601,2021-05-03
174.468,174.468,2021-05-04
234.3715,164.976,2021-05-05
294.275,294.275,2021-05-06
266.231,266.231,2021-05-07
190.88,190.88,2021-05-08
243.685,243.685,2021-05-09
192.531,192.531,2021-05-10
258.862,258.862,2021-05-11
246.954,246.954,2021-05-12
199.368,193.869,2021-05-13
151.782,151.782,2021-05-14
190.734,207.635,2021-05-15
229.686,229.686,2021-05-16
257.741,194.0,2021-05-17
285.796,285.796,2021-05-18
246.42,246.42,2021-05-19
208.2295,249.478,2021-05-20
170.039,170.039,2021-05-21
177.29,177.29,2021-05-22
225.388,225.388,2021-05-23
215.867,215.867,2021-05-24
206.537,206.537,2021-05-25
211.986,211.986,2021-05-26
242.233,242.233,2021-05-27
252.835,198.307,2021-05-28
263.437,263.437,2021-05-29
180.606,180.606,2021-05-30
276.764,276.764,2021-05-31
199.275,199.275,2021-06-01
158.134,158.134,2021-06-02
206.19,206.19,2021-06-03
194.891,194.891,2021-06-04
178.104,178.104,2021-06-05
287.059,287.059,2021-06-06
258.546,258.546,2021-06-07
276.242,276.242,2021-06-08
285.72950000000003,215.808,2021-06-09
295.217,295.217,2021-06-10
272.846,190.474,2021-06-11
250.475,250.475,2021-06-12
189.113,189.113,2021-06-13
209.4625,175.479,2021-06-14
229.812,229.812,2021-06-15
253.742,253.742,2021-06-16
251.208,251.208,2021-06-17
214.431,214.431,2021-06-18
228.37,228.37,2021-06-19
152.912,152.912,2021-06-20
239.655,239.655,2021-06-21
297.506,297.506,2021-06-22
235.937,235.937,2021-06-23
233.887,233.887,2021-06-24
188.517,188.517,2021-06-25
173.274,173.274,2021-06-26
239.101,239.101,2021-06-27
201.047,201.047,2021-06-28
266.892,266.892,2021-06-29
276.641,276.641,2021-06-30
150.003,150.003,2021-07-01
216.891,216.891,2021-07-02
291.062,291.062,2021-07-03
257.849,257.849,2021-07-04
259.2726666666667,181.692,2021-07-05
260.6963333333333,163.356,2021-07-06
262.12,262.12,2021-07-07
217.831,210.783,2021-07-08
173.542,173.542,2021-07-09
277.812,277.812,2021-07-10
252.5875,293.478,2021-07-11
227.363,227.363,2021-07-12
204.9045,167.692,2021-07-13
182.446,182.446,2021-07-14
163.923,163.923,2021-07-15
280.718,280.718,2021-07-16
220.741,220.741,2021-07-17
277.424,277.424,2021-07-18
165.187,165.187,2021-07-19
165.069,165.069,2021-07-20
200.598,200.598,2021-07-21
196.008,152.354,2021-07-22
191.418,191.418,2021-07-23
200.422,200.422,2021-07-24
189.702,242.458,2021-07-25
178.982,178.982,2021-07-26
223.0555,223.144,2021-07-27
267.129,267.129,2021-07-28
234.61,288.41,2021-07-29
202.091,202.091,2021-07-30
247.07,247.07,2021-07-31
220.111,220.111,2021-08-01
212.397,292.712,2021-08-02
204.683,204.683,2021-08-03
213.455,213.455,2021-08-04
260.567,260.567,2021-08-05
239.181,239.181,2021-08-06
296.074,296.074,2021-08-07
229.8525,230.72,2021-08-08
163.631,163.631,2021-08-09
260.94,260.94,2021-08-10
233.567,233.567,2021-08-11
169.197,169.197,2021-08-12
272.416,272.416,2021-08-13
242.68,242.68,2021-08-14
156.676,156.676,2021-08-15
196.761,291.834,2021-08-16
236.846,236.846,2021-08-17
241.657,236.267,2021-08-18
246.468,228.436,2021-08-19
251.279,251.279,2021-08-20
225.696,225.696,2021-08-21
221.18066666666667,182.797,2021-08-22
216.6653333333333,181.725,2021-08-23
212.15,212.15,2021-08-24
235.00600000000003,180.847,2021-08-25
257.862,257.862,2021-08-26
244.655,244.655,2021-08-27
167.267,167.267,2021-08-28
210.239,210.239,2021-08-29
211.576,211.576,2021-08-30
238.388,238.388,2021-08-31
175.621,175.621,2021-09-01
254.191,254.191,2021-09-02
203.772,203.772,2021-09-03
234.199,234.199,2021-09-04
191.564,191.564,2021-09-05
201.168,201.168,2021-09-06
250.282,250.282,2021-09-07
277.224,277.224,2021-09-08
181.817,181.817,2021-09-09
204.567,204.567,2021-09-10
290.528,290.528,2021-09-11
171.353,171.353,2021-09-12
183.718,183.718,2021-09-13
175.507,175.507,2021-09-14
168.124,168.124,2021-09-15
291.515,291.515,2021-09-16
258.061,258.061,2021-09-17
273.438,259.811,2021-09-18
288.815,288.815,2021-09-19
190.604,190.604,2021-09-20
228.044,228.044,2021-09-21
168.511,168.511,2021-09-22
173.91424999999998,211.049,2021-09-23
179.3175,208.802,2021-09-24
184.72075,289.629,2021-09-25
190.124,190.124,2021-09-26
196.915,196.915,2021-09-27
249.681,249.681,2021-09-28
261.6,261.6,2021-09-29
278.6995,217.522,2021-09-30
295.799,295.799,2021-10-01
272.204,272.204,2021-10-02
255.549,255.549,2021-10-03
229.987,229.987,2021-10-04
223.519,223.519,2021-10-05
215.6845,252.593,2021-10-06
207.85,207.85,2021-10-07
288.934,288.934,2021-10-08
204.104,204.104,2021-10-09
192.296,192.296,2021-10-10
266.632,266.632,2021-10-11
187.139,187.139,2021-10-12
216.357,216.357,2021-10-13
216.207,216.207,2021-10-14
253.475,253.475,2021-10-15
238.1525,244.56,2021-10-16
222.83,222.83,2021-10-17
249.312,168.345,2021-10-18
275.794,275.794,2021-10-19
282.913,282.913,2021-10-20
237.192,208.901,2021-10-21
191.471,191.471,2021-10-22
240.969,240.969,2021-10-23
152.078,152.078,2021-10-24
193.31,193.31,2021-10-25
244.397,244.397,2021-10-26
156.747,156.747,2021-10-27
170.89100000000002,286.604,2021-10-28
185.035,285.921,2021-10-29
199.179,199.179,2021-10-30
154.623,154.623,2021-10-31
272.352,272.352,2021-11-01
277.1803333333333,235.092,2021-11-02
282.00866666666667,207.276,2021-11-03
286.837,286.837,2021-11-04
246.3703333333333,164.365,2021-11-05
205.90366666666665,217.428,2021-11-06
165.437,165.437,2021-11-07
152.611,152.611,2021-11-08
211.532,211.532,2021-11-09
242.168,242.168,2021-11-10
207.8655,257.309,2021-11-11
173.563,173.563,2021-11-12
211.956,211.956,2021-11-13
227.824,227.824,2021-11-14
158.507,158.507,2021-11-15
218.069,218.069,2021-11-16
296.599,296.599,2021-11-17
253.725,230.856,2021-11-18
210.851,210.851,2021-11-19
212.033,212.033,2021-11-20
157.926,157.926,2021-11-21
151.995,151.995,2021-11-22
189.459,152.16,2021-11-23
226.923,226.923,2021-11-24
240.2045,193.267,2021-11-25
253.486,253.486,2021-11-26
268.068,164.191,2021-11-27
282.65,282.65,2021-11-28
181.578,181.578,2021-11-29
168.7055,171.73,2021-11-30
155.833,155.833,2021-12-01
210.098,210.098,2021-12-02
298.993,298.993,2021-12-03
289.46733333333333,190.267,2021-12-04
279.94166666666666,242.734,2021-12-05
270.416,270.416,2021-12-06
247.18525,179.914,2021-12-07
223.9545,187.461,2021-12-08
200.72375,155.511,2021-12-09
177.493,177.493,2021-12-10
275.816,275.816,2021-12-11
291.629,291.629,2021-12-12
269.036,269.036,2021-12-13
254.317,254.317,2021-12-14
219.918,282.869,2021-12-15
185.519,185.519,2021-12-16
154.902,154.902,2021-12-17
269.975,269.975,2021-12-18
210.159,273.224,2021-12-19
150.343,150.343,2021-12-20
290.214,290.214,2021-12-21
265.9595,287.8,2021-12-22
241.705,241.705,2021-12-23
217.229,217.229,2021-12-24
159.317,159.317,2021-12-25
169.86033333333333,214.993,2021-12-26
180.40366666666668,194.278,2021-12-27
190.947,243.015,2021-12-28
201.49033333333333,161.54,2021-12-29
212.03366666666665,167.129,2021-12-30
222.577,222.577,2021-12-31
