date,value
2018-01-01,784.288
2018-01-02,883.721
2018-01-03,1663.9099999999999
2018-01-04,2183.542
2018-01-05,2647.909
2018-01-06,3060.072
2018-01-07,3626.385
2018-01-08,3821.907
2018-01-09,4344.966
2018-01-10,4708.207
2018-01-11,5164.212
2018-01-12,5235.352000000001
2018-01-13,5609.942000000001
2018-01-14,6356.322000000001
2018-01-15,7232.131000000001
2018-01-16,7335.383000000002
2018-01-17,8146.053000000002
2018-01-18,8158.720000000002
2018-01-19,8940.342000000002
2018-01-20,9229.775000000001
2018-01-21,9624.351000000002
2018-01-22,10498.959000000003
2018-01-23,10822.375000000002
2018-01-24,11261.125000000002
2018-01-25,11944.464000000002
2018-01-26,12919.247000000001
2018-01-27,13758.521
2018-01-28,13578.838
2018-01-29,13266.594
2018-01-30,12913.685
2018-01-31,12456.661
2018-02-01,12912.221
2018-02-02,13805.028
2018-02-03,14425.307
2018-02-04,14560.395
2018-02-05,14740.34
2018-02-06,15667.356
2018-02-07,16216.034
2018-02-08,17047.096
2018-02-09,17361.09
2018-02-10,17838.458
2018-02-11,17966.066
2018-02-12,18748.483
2018-02-13,19552.435
2018-02-14,20172.386000000002
2018-02-15,20666.462000000003
2018-02-16,21379.568000000003
2018-02-17,21733.394000000004
2018-02-18,22591.904000000002
2018-02-19,22904.377000000004
2018-02-20,23543.629000000004
2018-02-21,23828.043000000005
2018-02-22,24636.056000000004
2018-02-23,25584.800000000003
2018-02-24,25939.743000000002
2018-02-25,26643.844
2018-02-26,27374.712
2018-02-27,27843.574
2018-02-28,27979.004
2018-03-01,28281.774
2018-03-02,29110.266
2018-03-03,29938.586
2018-03-04,30018.838
2018-03-05,30554.532
2018-03-06,30948.214
2018-03-07,31646.501
2018-03-08,32156.426
2018-03-09,32866.767
2018-03-10,33134.813
2018-03-11,33315.826
2018-03-12,34076.542
2018-03-13,34446.692
2018-03-14,35011.016
2018-03-15,35992.044
2018-03-16,36894.608
2018-03-17,37233.898
2018-03-18,37581.119
2018-03-19,38287.012
2018-03-20,38455.931000000004
2018-03-21,39403.513000000006
2018-03-22,40325.416000000005
2018-03-23,40424.812000000005
2018-03-24,41130.77500000001
2018-03-25,41372.73200000001
2018-03-26,41814.70100000001
2018-03-27,42310.91400000001
2018-03-28,42962.49300000001
2018-03-29,43631.33000000001
2018-03-30,43693.55200000001
2018-03-31,44050.70500000001
2018-04-01,44244.12700000001
2018-04-02,44840.350000000006
2018-04-03,45632.92600000001
2018-04-04,46167.55900000001
2018-04-05,46168.810000000005
2018-04-06,46364.41500000001
2018-04-07,47014.85300000001
2018-04-08,47966.06900000001
2018-04-09,48908.35800000001
2018-04-10,49379.592000000004
2018-04-11,49876.48100000001
2018-04-12,50436.62100000001
2018-04-13,50513.918000000005
2018-04-14,51509.65700000001
2018-04-15,52019.78200000001
2018-04-16,52484.842000000004
2018-04-17,52774.366
2018-04-18,53163.681000000004
2018-04-19,54132.467000000004
2018-04-20,54478.331000000006
2018-04-21,55082.59300000001
2018-04-22,55299.047000000006
2018-04-23,56278.899000000005
2018-04-24,56499.96000000001
2018-04-25,57467.869000000006
2018-04-26,58320.41700000001
2018-04-27,59128.69800000001
2018-04-28,59445.818000000014
2018-04-29,59820.960000000014
2018-04-30,60006.044000000016
2018-05-01,60510.754000000015
2018-05-02,60871.532000000014
2018-05-03,61765.02400000001
2018-05-04,61854.40300000001
2018-05-05,62537.621000000014
2018-05-06,63353.34600000001
2018-05-07,63642.415000000015
2018-05-08,64175.70600000001
2018-05-09,65083.746000000014
2018-05-10,65522.46900000001
2018-05-11,66407.42300000001
2018-05-12,66427.145
2018-05-13,66721.642
2018-05-14,67182.28600000001
2018-05-15,68157.315
2018-05-16,68517.052
2018-05-17,68839.341
2018-05-18,69366.157
2018-05-19,69397.99900000001
2018-05-20,69790.41600000001
2018-05-21,70560.12100000001
2018-05-22,70750.90900000001
2018-05-23,71532.33500000002
2018-05-24,71890.24900000003
2018-05-25,72044.74700000003
2018-05-26,72680.64500000003
2018-05-27,73136.96300000003
2018-05-28,73862.54700000004
2018-05-29,73080.26600000003
2018-05-30,72223.89100000003
2018-05-31,71688.11700000003
2018-06-01,70851.55600000003
2018-06-02,70274.35200000003
2018-06-03,70291.14400000003
2018-06-04,70998.22500000003
2018-06-05,71001.20900000003
2018-06-06,71192.23200000003
2018-06-07,72085.10600000003
2018-06-08,73026.38700000003
2018-06-09,73329.83600000002
2018-06-10,73951.51000000002
2018-06-11,74204.21700000002
2018-06-12,74303.61200000002
2018-06-13,74876.13900000002
2018-06-14,75433.25000000003
2018-06-15,76131.82500000003
2018-06-16,76368.90400000002
2018-06-17,77063.01200000002
2018-06-18,77967.90600000002
2018-06-19,78179.48500000002
2018-06-20,78787.03100000002
2018-06-21,79146.79800000002
2018-06-22,80048.78700000003
2018-06-23,80614.49900000003
2018-06-24,81584.07300000002
2018-06-25,82016.45900000002
2018-06-26,82835.46500000001
2018-06-27,83567.251
2018-06-28,83720.553
2018-06-29,84119.847
2018-06-30,84715.753
2018-07-01,85203.417
2018-07-02,85638.236
2018-07-03,86471.304
2018-07-04,86642.634
2018-07-05,86798.407
2018-07-06,87334.224
2018-07-07,87762.79000000001
2018-07-08,87802.009
2018-07-09,87833.79800000001
2018-07-10,87916.16600000001
2018-07-11,88238.407
2018-07-12,89119.619
2018-07-13,89227.43100000001
2018-07-14,90071.07600000002
2018-07-15,90890.21900000001
2018-07-16,91620.79800000001
2018-07-17,92243.839
2018-07-18,93152.29800000001
2018-07-19,94143.907
2018-07-20,95017.724
2018-07-21,95326.984
2018-07-22,95970.81
2018-07-23,96747.49399999999
2018-07-24,97335.01599999999
2018-07-25,97690.98599999999
2018-07-26,98266.11799999999
2018-07-27,99035.58499999999
2018-07-28,99892.17899999999
2018-07-29,100349.76699999999
2018-07-30,100737.64499999999
2018-07-31,101362.858
2018-08-01,101925.46399999999
2018-08-02,102893.38699999999
2018-08-03,103564.38399999999
2018-08-04,103825.48999999999
2018-08-05,104821.22499999999
2018-08-06,105497.13699999999
2018-08-07,105701.93999999999
2018-08-08,105718.919
2018-08-09,106475.946
2018-08-10,106585.216
2018-08-11,106696.865
2018-08-12,106989.67
2018-08-13,107792.083
2018-08-14,108608.757
2018-08-15,109021.074
2018-08-16,109086.621
2018-08-17,110018.277
2018-08-18,110925.849
2018-08-19,111746.557
2018-08-20,111890.102
2018-08-21,111992.988
2018-08-22,112594.474
2018-08-23,113314.098
2018-08-24,113602.402
2018-08-25,113605.204
2018-08-26,113783.625
2018-08-27,113957.979
2018-08-28,113492.96
2018-08-29,112850.47600000001
2018-08-30,112276.89700000001
2018-08-31,112163.04500000001
2018-09-01,112381.34600000002
2018-09-02,113118.81800000001
2018-09-03,113997.97500000002
2018-09-04,114792.55300000001
2018-09-05,115301.41200000001
2018-09-06,115891.47600000001
2018-09-07,116688.24
2018-09-08,116702.10900000001
2018-09-09,117648.10200000001
2018-09-10,118137.604
2018-09-11,118403.686
2018-09-12,118407.105
2018-09-13,118521.359
2018-09-14,118661.019
2018-09-15,118966.42
2018-09-16,119485.271
2018-09-17,120303.303
2018-09-18,121119.105
2018-09-19,121148.98599999999
2018-09-20,121924.537
2018-09-21,122025.48
2018-09-22,122190.194
2018-09-23,122410.61
2018-09-24,122495.704
2018-09-25,123312.092
2018-09-26,123397.163
2018-09-27,123515.992
2018-09-28,123888.485
2018-09-29,123899.724
2018-09-30,124373.349
2018-10-01,124430.03
2018-10-02,124991.728
2018-10-03,125174.287
2018-10-04,125345.284
2018-10-05,125595.549
2018-10-06,126160.981
2018-10-07,126784.419
2018-10-08,127374.77699999999
2018-10-09,127751.26399999998
2018-10-10,128232.11599999998
2018-10-11,129166.71999999999
2018-10-12,129403.85199999998
2018-10-13,130028.01099999998
2018-10-14,130186.21599999999
2018-10-15,131070.57999999999
2018-10-16,131252.74
2018-10-17,131963.26499999998
2018-10-18,132412.552
2018-10-19,133161.346
2018-10-20,133931.58899999998
2018-10-21,133965.20099999997
2018-10-22,134139.62799999997
2018-10-23,134897.76599999997
2018-10-24,135350.20799999998
2018-10-25,136153.12499999997
2018-10-26,136424.55199999997
2018-10-27,137074.12399999995
2018-10-28,137121.13599999994
2018-10-29,137821.43299999993
2018-10-30,138515.61399999994
2018-10-31,138896.75399999996
2018-11-01,139079.21899999995
2018-11-02,139926.84999999995
2018-11-03,140412.48399999994
2018-11-04,140919.17199999993
2018-11-05,141639.64599999992
2018-11-06,142322.0249999999
2018-11-07,143194.1309999999
2018-11-08,143393.63799999992
2018-11-09,144232.2529999999
2018-11-10,145138.7189999999
2018-11-11,146049.32899999988
2018-11-12,147037.41599999988
2018-11-13,147418.1599999999
2018-11-14,147557.20999999988
2018-11-15,148178.2959999999
2018-11-16,148732.7919999999
2018-11-17,149407.7299999999
2018-11-18,150394.3009999999
2018-11-19,151167.2959999999
2018-11-20,151937.1189999999
2018-11-21,152755.8469999999
2018-11-22,153036.7839999999
2018-11-23,153057.4409999999
2018-11-24,153365.5639999999
2018-11-25,154024.6389999999
2018-11-26,154693.52399999992
2018-11-27,155514.44399999993
2018-11-28,155947.92299999992
2018-11-29,156483.77099999992
2018-11-30,156600.1849999999
2018-12-01,156767.4979999999
2018-12-02,157224.2899999999
2018-12-03,157846.1079999999
2018-12-04,158801.1999999999
2018-12-05,159728.0129999999
2018-12-06,160262.68799999988
2018-12-07,160919.22899999988
2018-12-08,161212.63899999988
2018-12-09,161803.71299999987
2018-12-10,161850.50099999987
2018-12-11,161890.61399999988
2018-12-12,162065.48899999988
2018-12-13,162980.46199999988
2018-12-14,163542.2029999999
2018-12-15,163925.7269999999
2018-12-16,164650.0879999999
2018-12-17,164823.6489999999
2018-12-18,165198.5209999999
2018-12-19,165597.4849999999
2018-12-20,165793.9899999999
2018-12-21,166765.1239999999
2018-12-22,166949.0579999999
2018-12-23,167277.9239999999
2018-12-24,168220.2199999999
2018-12-25,169201.6579999999
2018-12-26,169444.18399999992
2018-12-27,168940.77899999992
2018-12-28,168716.3639999999
2018-12-29,167786.6339999999
2018-12-30,167456.9689999999
2018-12-31,167373.02999999988
2019-01-01,167650.75299999988
2019-01-02,167726.38999999987
2019-01-03,168487.61299999987
2019-01-04,168596.59899999987
2019-01-05,169554.66099999988
2019-01-06,170305.84299999988
2019-01-07,170600.04799999986
2019-01-08,170926.67699999985
2019-01-09,171504.10399999985
2019-01-10,172214.04899999985
2019-01-11,172831.34899999984
2019-01-12,172891.19699999984
2019-01-13,173826.88499999983
2019-01-14,173831.95699999982
2019-01-15,173893.25799999983
2019-01-16,174710.52399999983
2019-01-17,175680.14099999983
2019-01-18,176461.57899999982
2019-01-19,177285.22099999982
2019-01-20,178003.0559999998
2019-01-21,178635.27499999982
2019-01-22,178894.0669999998
2019-01-23,179581.3419999998
2019-01-24,180561.9589999998
2019-01-25,180625.7279999998
2019-01-26,181589.0339999998
2019-01-27,181708.87299999982
2019-01-28,181687.42999999982
2019-01-29,180819.49199999982
2019-01-30,180719.82499999984
2019-01-31,180258.39699999982
2019-02-01,180816.32499999984
2019-02-02,181403.00799999983
2019-02-03,182334.52699999983
2019-02-04,182742.63099999982
2019-02-05,183219.72899999982
2019-02-06,183897.5309999998
2019-02-07,184218.10599999983
2019-02-08,184545.5609999998
2019-02-09,185499.14199999982
2019-02-10,186451.84599999982
2019-02-11,187132.87599999981
2019-02-12,187163.3579999998
2019-02-13,187647.8769999998
2019-02-14,187876.4039999998
2019-02-15,188827.14999999982
2019-02-16,189331.8929999998
2019-02-17,189519.3829999998
2019-02-18,190437.4579999998
2019-02-19,190833.3689999998
2019-02-20,191684.3779999998
2019-02-21,191785.64799999978
2019-02-22,191846.63499999978
2019-02-23,192215.85799999977
2019-02-24,193050.15899999978
2019-02-25,193059.5679999998
2019-02-26,193619.3849999998
2019-02-27,194523.34599999982
2019-02-28,195381.17199999982
2019-03-01,196209.2269999998
2019-03-02,196266.2189999998
2019-03-03,197170.6399999998
2019-03-04,197332.4959999998
2019-03-05,197657.45199999982
2019-03-06,198096.0429999998
2019-03-07,198434.0899999998
2019-03-08,199284.67499999978
2019-03-09,200064.05399999977
2019-03-10,201054.83999999976
2019-03-11,201838.68699999977
2019-03-12,201886.27099999978
2019-03-13,202234.07799999978
2019-03-14,202513.26399999976
2019-03-15,203282.14499999976
2019-03-16,203731.15899999975
2019-03-17,203890.51899999974
2019-03-18,204169.98599999974
2019-03-19,204264.14099999974
2019-03-20,204811.01699999973
2019-03-21,205189.90999999974
2019-03-22,205258.12799999974
2019-03-23,205282.57599999974
2019-03-24,206001.18799999973
2019-03-25,206750.16599999974
2019-03-26,206877.20399999974
2019-03-27,207280.25899999973
2019-03-28,207633.70199999973
2019-03-29,208058.12199999974
2019-03-30,208830.36799999975
2019-03-31,209338.19899999976
2019-04-01,210272.58899999977
2019-04-02,210682.4219999998
2019-04-03,211132.3909999998
2019-04-04,211364.7119999998
2019-04-05,212079.2799999998
2019-04-06,212791.1829999998
2019-04-07,213775.0439999998
2019-04-08,213908.9219999998
2019-04-09,214398.70499999978
2019-04-10,215101.9619999998
2019-04-11,215415.6329999998
2019-04-12,216238.3669999998
2019-04-13,216517.8179999998
2019-04-14,217042.6409999998
2019-04-15,217048.3439999998
2019-04-16,217219.5749999998
2019-04-17,217999.80799999982
2019-04-18,218678.76399999982
2019-04-19,218727.8029999998
2019-04-20,219450.13399999982
2019-04-21,219821.17099999983
2019-04-22,220177.52299999984
2019-04-23,220541.05299999984
2019-04-24,221191.18099999984
2019-04-25,221639.12199999983
2019-04-26,221800.28399999984
2019-04-27,222364.44599999985
2019-04-28,223260.28299999985
2019-04-29,224206.79899999985
2019-04-30,224888.96299999984
2019-05-01,225796.23699999985
2019-05-02,226699.80299999984
2019-05-03,227243.06499999983
2019-05-04,227829.05499999982
2019-05-05,228488.60399999982
2019-05-06,229200.82299999983
2019-05-07,230132.36399999983
2019-05-08,230337.59299999982
2019-05-09,231217.12199999983
2019-05-10,231470.78699999984
2019-05-11,232357.49699999983
2019-05-12,232470.56699999984
2019-05-13,233196.11899999983
2019-05-14,233713.93599999984
2019-05-15,234550.78599999985
2019-05-16,234614.28599999985
2019-05-17,234675.09999999986
2019-05-18,235003.23399999985
2019-05-19,235544.51499999984
2019-05-20,235746.93399999983
2019-05-21,236306.79699999985
2019-05-22,236866.21899999984
2019-05-23,237137.55699999983
2019-05-24,237480.76999999981
2019-05-25,238317.38899999982
2019-05-26,239032.42599999983
2019-05-27,239165.97599999982
2019-05-28,239178.2869999998
2019-05-29,239040.36999999982
2019-05-30,238890.28599999982
2019-05-31,238800.42399999982
2019-06-01,238498.41499999983
2019-06-02,238146.47399999984
2019-06-03,238303.97099999984
2019-06-04,238932.52099999983
2019-06-05,239226.31299999982
2019-06-06,240028.2299999998
2019-06-07,240559.0649999998
2019-06-08,241116.9389999998
2019-06-09,241150.14499999981
2019-06-10,241740.59499999983
2019-06-11,242735.3679999998
2019-06-12,242969.72599999982
2019-06-13,243701.70299999983
2019-06-14,244236.71999999983
2019-06-15,245019.90399999983
2019-06-16,245835.85299999983
2019-06-17,246069.71899999984
2019-06-18,246649.37499999983
2019-06-19,247360.96399999983
2019-06-20,248333.60399999985
2019-06-21,248969.10699999984
2019-06-22,249283.75899999985
2019-06-23,250064.34899999984
2019-06-24,250381.38899999985
2019-06-25,250474.98499999984
2019-06-26,251298.72999999984
2019-06-27,251539.94399999984
2019-06-28,252406.31299999985
2019-06-29,252865.30799999984
2019-06-30,253651.74199999985
2019-07-01,254222.65299999985
2019-07-02,254872.98499999984
2019-07-03,255454.30499999985
2019-07-04,255768.09699999983
2019-07-05,256535.08199999982
2019-07-06,257123.51299999983
2019-07-07,258026.43199999983
2019-07-08,258453.54799999984
2019-07-09,258763.81499999983
2019-07-10,259734.63199999984
2019-07-11,259856.30599999984
2019-07-12,260710.82799999983
2019-07-13,261264.67899999983
2019-07-14,261301.79599999983
2019-07-15,261889.34899999984
2019-07-16,262354.5929999998
2019-07-17,262753.4079999998
2019-07-18,263432.50999999983
2019-07-19,263489.58399999986
2019-07-20,264219.30699999986
2019-07-21,264914.1689999999
2019-07-22,265728.7289999999
2019-07-23,265944.5269999999
2019-07-24,266487.49099999986
2019-07-25,267098.60599999985
2019-07-26,267396.15699999983
2019-07-27,267830.1039999998
2019-07-28,268572.17799999984
2019-07-29,269533.98299999983
2019-07-30,270222.2779999998
2019-07-31,271015.4849999998
2019-08-01,271657.88499999983
2019-08-02,271748.0939999998
2019-08-03,272729.7029999998
2019-08-04,273389.7109999998
2019-08-05,273514.07699999976
2019-08-06,273818.1509999998
2019-08-07,274478.6549999998
2019-08-08,275429.81499999977
2019-08-09,275933.78999999975
2019-08-10,276651.85399999976
2019-08-11,277503.2869999998
2019-08-12,278276.1609999998
2019-08-13,278858.5089999998
2019-08-14,279508.29899999977
2019-08-15,280467.71299999976
2019-08-16,281186.52199999976
2019-08-17,282148.97899999976
2019-08-18,282755.50199999975
2019-08-19,282949.3409999997
2019-08-20,283133.6579999997
2019-08-21,283541.2769999997
2019-08-22,284362.5559999997
2019-08-23,284758.4949999997
2019-08-24,284997.98699999973
2019-08-25,285564.8149999997
2019-08-26,285649.1429999997
2019-08-27,286255.8239999997
2019-08-28,285911.47299999965
2019-08-29,285665.46599999967
2019-08-30,285536.77299999964
2019-08-31,285330.82799999963
2019-09-01,286279.52299999964
2019-09-02,286673.49499999965
2019-09-03,286872.76499999966
2019-09-04,287415.44499999966
2019-09-05,287526.21799999964
2019-09-06,288308.95599999966
2019-09-07,288702.37099999964
2019-09-08,289658.12099999964
2019-09-09,289910.96899999963
2019-09-10,290116.10999999964
2019-09-11,290185.5039999996
2019-09-12,291048.7049999996
2019-09-13,291866.9459999996
2019-09-14,292183.4449999996
2019-09-15,292323.4649999996
2019-09-16,293070.8009999996
2019-09-17,293776.32799999963
2019-09-18,293799.32799999963
2019-09-19,294201.85799999966
2019-09-20,294242.4209999997
2019-09-21,294530.8259999997
2019-09-22,294934.2629999997
2019-09-23,295545.3159999997
2019-09-24,296171.6059999997
2019-09-25,296577.8819999997
2019-09-26,297355.3389999997
2019-09-27,297380.0929999997
2019-09-28,298262.5089999997
2019-09-29,298419.6849999997
2019-09-30,298861.0149999997
2019-10-01,299153.1799999997
2019-10-02,299573.0639999997
2019-10-03,300259.2539999997
2019-10-04,300324.2509999997
2019-10-05,301282.0969999997
2019-10-06,302099.3199999997
2019-10-07,302876.9619999997
2019-10-08,302888.78599999973
2019-10-09,303754.0109999997
2019-10-10,304428.3069999997
2019-10-11,305004.50999999966
2019-10-12,305493.52199999965
2019-10-13,306110.8829999996
2019-10-14,306126.32099999965
2019-10-15,307046.95599999966
2019-10-16,307729.0349999997
2019-10-17,308715.4259999997
2019-10-18,309118.09699999966
2019-10-19,309343.8989999997
2019-10-20,309400.8659999997
2019-10-21,309636.2929999997
2019-10-22,309702.83499999973
2019-10-23,310299.58499999973
2019-10-24,310387.5259999997
2019-10-25,311312.5649999997
2019-10-26,312113.04099999974
2019-10-27,312501.00699999975
2019-10-28,312663.2539999997
2019-10-29,312761.3089999997
2019-10-30,312907.9089999997
2019-10-31,313730.3429999997
2019-11-01,314293.3189999997
2019-11-02,315243.4079999997
2019-11-03,315443.2719999997
2019-11-04,316048.6529999997
2019-11-05,316804.2999999997
2019-11-06,317218.5399999997
2019-11-07,317586.8869999997
2019-11-08,317983.5859999997
2019-11-09,318841.4019999997
2019-11-10,319718.27499999973
2019-11-11,320534.8459999997
2019-11-12,320788.0979999997
2019-11-13,321059.2929999997
2019-11-14,321828.3849999997
2019-11-15,321947.4279999997
2019-11-16,322400.01399999973
2019-11-17,323362.15499999974
2019-11-18,323753.34299999976
2019-11-19,324517.29999999976
2019-11-20,325218.08399999974
2019-11-21,325990.8299999997
2019-11-22,326385.2989999997
2019-11-23,326642.4619999997
2019-11-24,327368.43799999973
2019-11-25,327439.65899999975
2019-11-26,327866.0859999998
2019-11-27,327877.1539999998
2019-11-28,328218.1489999998
2019-11-29,328559.3349999998
2019-11-30,329286.6099999998
2019-12-01,329525.86299999984
2019-12-02,330463.30899999983
2019-12-03,330609.12399999984
2019-12-04,331486.15699999983
2019-12-05,331651.98099999985
2019-12-06,331696.48699999985
2019-12-07,332159.80299999984
2019-12-08,333115.2559999998
2019-12-09,333637.6059999998
2019-12-10,334127.6749999998
2019-12-11,335051.61799999984
2019-12-12,335613.64899999986
2019-12-13,335785.26999999984
2019-12-14,335801.7719999998
2019-12-15,336093.30899999983
2019-12-16,336219.15999999986
2019-12-17,336498.61199999985
2019-12-18,336701.57399999985
2019-12-19,337156.48099999985
2019-12-20,337748.8919999999
2019-12-21,338739.8649999999
2019-12-22,338988.07799999986
2019-12-23,339813.71999999986
2019-12-24,340235.85099999985
2019-12-25,341024.7939999999
2019-12-26,341738.2809999999
2019-12-27,341319.3679999999
2019-12-28,341141.3749999999
2019-12-29,340897.8099999999
2019-12-30,340335.8799999999
2019-12-31,339527.60499999986
2020-01-01,339900.0869999999
2020-01-02,340106.5869999999
2020-01-03,340164.3249999999
2020-01-04,340418.2709999999
2020-01-05,340686.5259999999
2020-01-06,341329.2889999999
2020-01-07,342266.8569999999
2020-01-08,342913.3689999999
2020-01-09,343420.2859999999
2020-01-10,343995.2909999999
2020-01-11,344845.95199999993
2020-01-12,345818.66199999995
2020-01-13,346175.03299999994
2020-01-14,346344.73199999996
2020-01-15,346713.73
2020-01-16,347107.392
2020-01-17,347411.062
2020-01-18,348019.35
2020-01-19,348453.114
2020-01-20,348750.172
2020-01-21,349118.129
2020-01-22,349124.40400000004
2020-01-23,349785.41800000006
2020-01-24,350133.71400000004
2020-01-25,351040.68000000005
2020-01-26,351146.98600000003
2020-01-27,351448.34500000003
2020-01-28,350646.69
2020-01-29,350561.149
2020-01-30,349638.65499999997
2020-01-31,349017.861
2020-02-01,349901.017
2020-02-02,350059.598
2020-02-03,350682.911
2020-02-04,350989.95900000003
2020-02-05,351367.63
2020-02-06,352246.272
2020-02-07,352935.278
2020-02-08,353275.58
2020-02-09,354225.45800000004
2020-02-10,354974.53
2020-02-11,355656.77200000006
2020-02-12,356333.55000000005
2020-02-13,356442.128
2020-02-14,356773.765
2020-02-15,356933.275
2020-02-16,357654.34500000003
2020-02-17,357710.591
2020-02-18,358351.09500000003
2020-02-19,358951.81000000006
2020-02-20,359308.481
2020-02-21,360250.98500000004
2020-02-22,360876.94200000004
2020-02-23,361752.46700000006
2020-02-24,362461.89200000005
2020-02-25,363214.59200000006
2020-02-26,363646.01200000005
2020-02-27,363946.39900000003
2020-02-28,364677.238
2020-02-29,365414.831
2020-03-01,365531.968
2020-03-02,365796.752
2020-03-03,366586.871
2020-03-04,366782.381
2020-03-05,367753.486
2020-03-06,368077.64499999996
2020-03-07,368433.144
2020-03-08,368902.47599999997
2020-03-09,369390.18499999994
2020-03-10,369509.81399999995
2020-03-11,369669.77999999997
2020-03-12,370242.899
2020-03-13,370467.842
2020-03-14,371387.606
2020-03-15,371484.37100000004
2020-03-16,371496.40400000004
2020-03-17,371922.00800000003
2020-03-18,372264.98400000005
2020-03-19,372690.9110000001
2020-03-20,373662.1490000001
2020-03-21,374231.59700000007
2020-03-22,375175.07100000005
2020-03-23,375594.4660000001
2020-03-24,376391.1060000001
2020-03-25,377158.8930000001
2020-03-26,377720.3050000001
2020-03-27,378410.0670000001
2020-03-28,379316.8700000001
2020-03-29,379508.6960000001
2020-03-30,380094.1430000001
2020-03-31,380451.0110000001
2020-04-01,381424.2620000001
2020-04-02,382231.4420000001
2020-04-03,383076.3520000001
2020-04-04,383844.0630000001
2020-04-05,383861.48300000007
2020-04-06,384263.95600000006
2020-04-07,384505.76200000005
2020-04-08,384995.818
2020-04-09,385606.77200000006
2020-04-10,385904.20800000004
2020-04-11,386279.53200000006
2020-04-12,386763.74000000005
2020-04-13,386861.19700000004
2020-04-14,387111.26900000003
2020-04-15,387352.525
2020-04-16,388206.28500000003
2020-04-17,388923.717
2020-04-18,389698.914
2020-04-19,390548.559
2020-04-20,390964.396
2020-04-21,391111.844
2020-04-22,392048.861
2020-04-23,392510.95499999996
2020-04-24,392894.958
2020-04-25,392990.34099999996
2020-04-26,393106.143
2020-04-27,393768.85199999996
2020-04-28,394591.72799999994
2020-04-29,394803.41099999996
2020-04-30,395358.78299999994
2020-05-01,395374.3229999999
2020-05-02,396137.6459999999
2020-05-03,396370.7149999999
2020-05-04,397103.1819999999
2020-05-05,397863.66899999994
2020-05-06,398596.44399999996
2020-05-07,399463.274
2020-05-08,400069.12799999997
2020-05-09,400111.936
2020-05-10,400454.217
2020-05-11,400707.453
2020-05-12,400969.984
2020-05-13,401056.567
2020-05-14,401348.142
2020-05-15,401484.469
2020-05-16,401914.35199999996
2020-05-17,402000.93299999996
2020-05-18,402026.08099999995
2020-05-19,402713.97899999993
2020-05-20,402970.04399999994
2020-05-21,402997.45699999994
2020-05-22,403485.1869999999
2020-05-23,403591.4109999999
2020-05-24,404179.2589999999
2020-05-25,404953.8779999999
2020-05-26,405031.2729999999
2020-05-27,405361.17999999993
2020-05-28,405271.97799999994
2020-05-29,404316.91299999994
2020-05-30,403919.08499999996
2020-05-31,403240.80999999994
2020-06-01,402701.52599999995
2020-06-02,403067.76699999993
2020-06-03,403670.62399999995
2020-06-04,404579.741
2020-06-05,404802.523
2020-06-06,405428.333
2020-06-07,406006.065
2020-06-08,406549.325
2020-06-09,407088.166
2020-06-10,407916.222
2020-06-11,408833.08400000003
2020-06-12,408889.36000000004
2020-06-13,409373.87100000004
2020-06-14,409497.661
2020-06-15,409975.555
2020-06-16,410263.148
2020-06-17,410865.736
2020-06-18,411779.573
2020-06-19,412597.421
2020-06-20,413131.826
2020-06-21,413880.79
2020-06-22,414724.665
2020-06-23,415299.654
2020-06-24,415424.59599999996
2020-06-25,416054.51599999995
2020-06-26,416383.03899999993
2020-06-27,417069.45599999995
2020-06-28,417809.08499999996
2020-06-29,418542.507
2020-06-30,418590.75399999996
2020-07-01,418843.73799999995
2020-07-02,419613.12399999995
2020-07-03,420014.415
2020-07-04,420947.771
2020-07-05,421346.868
2020-07-06,421770.0
2020-07-07,422022.525
2020-07-08,422955.677
2020-07-09,423135.147
2020-07-10,423718.203
2020-07-11,424691.37799999997
2020-07-12,425409.44899999996
2020-07-13,426309.90199999994
2020-07-14,426482.02799999993
2020-07-15,427304.8829999999
2020-07-16,427530.88699999993
2020-07-17,428295.92799999996
2020-07-18,428892.67699999997
2020-07-19,428997.70999999996
2020-07-20,429003.16
2020-07-21,429315.57899999997
2020-07-22,430182.15599999996
2020-07-23,430695.486
2020-07-24,431338.872
2020-07-25,431534.76499999996
2020-07-26,432018.7839999999
2020-07-27,432214.50099999993
2020-07-28,432500.1589999999
2020-07-29,433371.3949999999
2020-07-30,433762.2529999999
2020-07-31,434373.84899999993
2020-08-01,435294.0349999999
2020-08-02,435586.1939999999
2020-08-03,435882.5919999999
2020-08-04,436130.6709999999
2020-08-05,436388.10399999993
2020-08-06,437237.54799999995
2020-08-07,437258.57099999994
2020-08-08,437313.20199999993
2020-08-09,437517.91699999996
2020-08-10,438358.40099999995
2020-08-11,438635.3219999999
2020-08-12,439029.0569999999
2020-08-13,439712.2049999999
2020-08-14,439865.5239999999
2020-08-15,439953.16899999994
2020-08-16,440064.08099999995
2020-08-17,440097.73699999996
2020-08-18,440816.50299999997
2020-08-19,441091.37
2020-08-20,441671.313
2020-08-21,442369.744
2020-08-22,442468.656
2020-08-23,443272.995
2020-08-24,444033.294
2020-08-25,444685.048
2020-08-26,445671.681
2020-08-27,445234.46499999997
2020-08-28,445223.04699999996
2020-08-29,444946.46199999994
2020-08-30,444564.87299999996
2020-08-31,444731.20699999994
2020-09-01,445498.81599999993
2020-09-02,445848.99399999995
2020-09-03,446764.01199999993
2020-09-04,446843.93899999995
2020-09-05,447092.55399999995
2020-09-06,447667.10299999994
2020-09-07,448257.66799999995
2020-09-08,448463.83799999993
2020-09-09,448966.37499999994
2020-09-10,449548.47799999994
2020-09-11,449556.80199999997
2020-09-12,450494.795
2020-09-13,451126.876
2020-09-14,451162.279
2020-09-15,451695.36799999996
2020-09-16,452665.432
2020-09-17,453658.40499999997
2020-09-18,454469.30799999996
2020-09-19,454725.58699999994
2020-09-20,455403.30999999994
2020-09-21,455743.69399999996
2020-09-22,456416.235
2020-09-23,456543.499
2020-09-24,457413.498
2020-09-25,457649.987
2020-09-26,458129.026
2020-09-27,458882.53500000003
2020-09-28,459460.57200000004
2020-09-29,459553.57500000007
2020-09-30,459652.9040000001
2020-10-01,460233.6270000001
2020-10-02,460710.6670000001
2020-10-03,461566.4330000001
2020-10-04,462062.5790000001
2020-10-05,462303.23800000007
2020-10-06,462533.64700000006
2020-10-07,463475.53
2020-10-08,463755.14
2020-10-09,464300.711
2020-10-10,464456.55100000004
2020-10-11,464641.977
2020-10-12,465253.815
2020-10-13,465396.99
2020-10-14,465451.589
2020-10-15,466006.855
2020-10-16,466363.26999999996
2020-10-17,467004.32099999994
2020-10-18,467842.09799999994
2020-10-19,468051.69999999995
2020-10-20,468536.7569999999
2020-10-21,468565.64699999994
2020-10-22,469513.4209999999
2020-10-23,470162.3029999999
2020-10-24,470615.7749999999
2020-10-25,470815.3229999999
2020-10-26,471813.9689999999
2020-10-27,472739.3219999999
2020-10-28,473513.6879999999
2020-10-29,474316.2319999999
2020-10-30,474844.4379999999
2020-10-31,475116.1189999999
2020-11-01,475874.5379999999
2020-11-02,476451.7039999999
2020-11-03,476702.9099999999
2020-11-04,476727.4989999999
2020-11-05,476739.7069999999
2020-11-06,477168.8539999999
2020-11-07,478125.00199999986
2020-11-08,478931.4029999999
2020-11-09,479435.9519999999
2020-11-10,480086.63199999987
2020-11-11,480466.8149999999
2020-11-12,481063.2219999999
2020-11-13,481811.1129999999
2020-11-14,482367.44699999987
2020-11-15,483262.43799999985
2020-11-16,483919.6419999999
2020-11-17,484156.2479999999
2020-11-18,485132.5019999999
2020-11-19,485511.3839999999
2020-11-20,485985.8419999999
2020-11-21,486035.00699999987
2020-11-22,486106.2339999999
2020-11-23,486643.0139999999
2020-11-24,487336.1279999999
2020-11-25,487782.3099999999
2020-11-26,487869.5879999999
2020-11-27,487872.68199999986
2020-11-28,488679.59999999986
2020-11-29,489462.8909999999
2020-11-30,489828.09399999987
2020-12-01,490746.99199999985
2020-12-02,490752.86799999984
2020-12-03,490832.62699999986
2020-12-04,491207.17099999986
2020-12-05,491836.36699999985
2020-12-06,492496.1149999999
2020-12-07,493360.5989999999
2020-12-08,494031.1629999999
2020-12-09,494805.8359999999
2020-12-10,495227.90899999987
2020-12-11,496097.13299999986
2020-12-12,497038.22199999983
2020-12-13,497381.08399999986
2020-12-14,497422.9779999998
2020-12-15,498344.8969999998
2020-12-16,498423.5339999998
2020-12-17,499017.2279999998
2020-12-18,499622.0869999998
2020-12-19,500527.5379999998
2020-12-20,501152.4349999998
2020-12-21,501806.36799999984
2020-12-22,502563.42299999984
2020-12-23,503450.7679999998
2020-12-24,503496.7479999998
2020-12-25,503734.0279999998
2020-12-26,503014.0439999998
2020-12-27,502347.19999999984
2020-12-28,501782.36799999984
2020-12-29,501730.92299999984
2020-12-30,501623.0769999998
2020-12-31,501904.55799999984
2021-01-01,502239.0119999999
2021-01-02,502525.3309999999
2021-01-03,503440.2809999999
2021-01-04,503848.3109999999
2021-01-05,504039.96099999995
2021-01-06,504130.82999999996
2021-01-07,504899.49399999995
2021-01-08,505034.42299999995
2021-01-09,505584.823
2021-01-10,505680.11299999995
2021-01-11,505908.51099999994
2021-01-12,506364.45499999996
2021-01-13,507013.93299999996
2021-01-14,507039.72
2021-01-15,507308.371
2021-01-16,508277.30199999997
2021-01-17,508936.251
2021-01-18,509665.353
2021-01-19,509956.197
2021-01-20,510153.131
2021-01-21,510966.988
2021-01-22,511623.202
2021-01-23,512322.107
2021-01-24,512831.905
2021-01-25,513754.59400000004
2021-01-26,514517.87700000004
2021-01-27,514034.38800000004
2021-01-28,513371.97400000005
2021-01-29,512828.36000000004
2021-01-30,511998.04500000004
2021-01-31,512816.12500000006
2021-02-01,513702.06600000005
2021-02-02,513855.88600000006
2021-02-03,514657.39300000004
2021-02-04,515172.37600000005
2021-02-05,515908.981
2021-02-06,516858.82200000004
2021-02-07,517181.753
2021-02-08,518156.20200000005
2021-02-09,519145.08300000004
2021-02-10,519971.493
2021-02-11,520331.835
2021-02-12,521301.39800000004
2021-02-13,521468.0150000001
2021-02-14,521639.1380000001
2021-02-15,522231.0920000001
2021-02-16,522663.10200000013
2021-02-17,522664.5330000001
2021-02-18,523173.4750000001
2021-02-19,523282.1400000001
2021-02-20,524056.40900000004
2021-02-21,524859.7710000001
2021-02-22,525829.795
2021-02-23,526265.525
2021-02-24,526730.924
2021-02-25,526752.742
2021-02-26,527590.027
2021-02-27,528208.759
2021-02-28,528911.1259999999
2021-03-01,528969.4389999999
2021-03-02,529242.5589999999
2021-03-03,529969.1119999998
2021-03-04,530780.6299999999
2021-03-05,531093.2889999999
2021-03-06,532033.0129999999
2021-03-07,532414.019
2021-03-08,533143.3369999999
2021-03-09,534089.5539999999
2021-03-10,534567.6989999999
2021-03-11,534746.2629999999
2021-03-12,535176.5179999999
2021-03-13,535564.9319999999
2021-03-14,535899.168
2021-03-15,536006.948
2021-03-16,536022.053
2021-03-17,536089.188
2021-03-18,536963.12
2021-03-19,537045.44
2021-03-20,537856.1449999999
2021-03-21,538692.4219999999
2021-03-22,538849.1479999999
2021-03-23,539254.516
2021-03-24,540098.598
2021-03-25,540163.072
2021-03-26,540704.542
2021-03-27,541281.649
2021-03-28,541439.605
2021-03-29,541985.635
2021-03-30,542610.8150000001
2021-03-31,542973.2840000001
2021-04-01,543320.1280000001
2021-04-02,543333.4260000001
2021-04-03,543506.6200000001
2021-04-04,543887.658
2021-04-05,544023.7000000001
2021-04-06,544960.4040000001
2021-04-07,545860.3610000001
2021-04-08,546698.1040000002
2021-04-09,547272.3700000001
2021-04-10,547426.2270000001
2021-04-11,548307.8230000001
2021-04-12,549079.9890000001
2021-04-13,549499.4010000001
2021-04-14,549665.099
2021-04-15,550185.138
2021-04-16,550523.893
2021-04-17,551370.604
2021-04-18,552157.4450000001
2021-04-19,552408.454
2021-04-20,553301.622
2021-04-21,554175.103
2021-04-22,555011.962
2021-04-23,556007.099
2021-04-24,556673.5850000001
2021-04-25,557531.903
2021-04-26,557788.403
2021-04-27,557846.2080000001
2021-04-28,558807.5780000001
2021-04-29,559558.68
2021-04-30,560078.662
2021-05-01,560842.111
2021-05-02,561562.03
2021-05-03,562179.814
2021-05-04,563022.414
2021-05-05,563144.163
2021-05-06,563787.0099999999
2021-05-07,564040.0669999999
2021-05-08,564158.754
2021-05-09,564946.7609999999
2021-05-10,565789.1499999999
2021-05-11,565832.8449999999
2021-05-12,566693.0639999999
2021-05-13,567484.9249999999
2021-05-14,567762.573
2021-05-15,568192.0059999999
2021-05-16,568480.8979999999
2021-05-17,568647.9029999999
2021-05-18,569358.137
2021-05-19,569405.335
2021-05-20,569564.134
2021-05-21,570486.7019999999
2021-05-22,571006.3089999999
2021-05-23,571725.8839999998
2021-05-24,572569.0919999998
2021-05-25,573511.0969999998
2021-05-26,574242.9829999999
2021-05-27,574610.0459999999
2021-05-28,574051.9639999998
2021-05-29,573300.9139999998
2021-05-30,573162.3789999997
2021-05-31,572813.4069999998
2021-06-01,572321.8669999997
2021-06-02,572859.0319999998
2021-06-03,573766.1679999998
2021-06-04,573920.2219999998
2021-06-05,574608.2269999998
2021-06-06,575032.8769999999
2021-06-07,575502.0399999998
2021-06-08,575712.6259999998
2021-06-09,575958.6359999998
2021-06-10,576522.7549999998
2021-06-11,576989.6919999998
2021-06-12,577612.9709999998
2021-06-13,577665.6839999998
2021-06-14,578366.3599999998
2021-06-15,578989.5979999998
2021-06-16,579151.9619999997
2021-06-17,579953.2279999997
2021-06-18,580644.5299999997
2021-06-19,581256.6359999997
2021-06-20,581765.4009999997
2021-06-21,582749.8549999997
2021-06-22,583149.9189999998
2021-06-23,583830.2629999998
2021-06-24,584195.9269999998
2021-06-25,584674.7629999998
2021-06-26,584686.6649999998
2021-06-27,584712.0869999998
2021-06-28,585370.3019999998
2021-06-29,585542.3039999998
2021-06-30,586138.4369999998
2021-07-01,586425.7599999998
2021-07-02,586648.0659999998
2021-07-03,587576.7169999997
2021-07-04,587878.9009999997
2021-07-05,588639.8049999997
2021-07-06,589470.1539999997
2021-07-07,590047.0559999997
2021-07-08,590050.4119999998
2021-07-09,590213.7819999998
2021-07-10,590328.6669999998
2021-07-11,590522.5659999998
2021-07-12,590911.0639999998
2021-07-13,590969.2069999998
2021-07-14,591314.0099999998
2021-07-15,591366.8069999998
2021-07-16,591806.8559999998
2021-07-17,591975.8249999998
2021-07-18,592560.7319999998
2021-07-19,592608.1979999999
2021-07-20,593128.5519999999
2021-07-21,593660.315
2021-07-22,593681.367
2021-07-23,593810.1749999999
2021-07-24,594016.139
2021-07-25,594763.699
2021-07-26,595041.1610000001
2021-07-27,595328.3740000001
2021-07-28,595868.43
2021-07-29,595959.067
2021-07-30,596612.648
2021-07-31,596629.4400000001
2021-08-01,597319.6860000001
2021-08-02,598073.6460000001
2021-08-03,598243.0360000001
2021-08-04,598456.359
2021-08-05,598658.461
2021-08-06,599597.083
2021-08-07,599598.565
2021-08-08,600300.3069999999
2021-08-09,600407.7259999999
2021-08-10,601029.3039999999
2021-08-11,601250.2169999998
2021-08-12,601394.7699999998
2021-08-13,601505.8759999998
2021-08-14,602174.8729999998
2021-08-15,603058.8049999998
2021-08-16,603694.4369999998
2021-08-17,604044.6389999999
2021-08-18,604577.0919999998
2021-08-19,605305.4289999999
2021-08-20,605880.2539999998
2021-08-21,606724.4299999998
2021-08-22,607126.2359999998
2021-08-23,607482.8829999998
2021-08-24,608343.5209999998
2021-08-25,608850.9479999999
2021-08-26,608947.6909999999
2021-08-27,608523.0259999998
2021-08-28,607528.7659999998
2021-08-29,607464.8089999998
2021-08-30,606720.8329999998
2021-08-31,607185.3459999998
2021-09-01,607691.4819999998
2021-09-02,608244.4579999999
2021-09-03,608283.8799999999
2021-09-04,609104.8919999999
2021-09-05,609175.6369999999
2021-09-06,609229.3589999998
2021-09-07,610225.2389999998
2021-09-08,611157.9529999999
2021-09-09,611569.6019999998
2021-09-10,611743.2819999999
2021-09-11,612594.3619999998
2021-09-12,612632.1149999999
2021-09-13,612922.0939999999
2021-09-14,613371.2699999999
2021-09-15,614191.4509999999
2021-09-16,614857.2339999999
2021-09-17,615055.8999999999
2021-09-18,615125.3809999999
2021-09-19,615985.083
2021-09-20,616137.953
2021-09-21,616928.392
2021-09-22,617372.2069999999
2021-09-23,617890.1529999999
2021-09-24,618694.043
2021-09-25,619598.887
2021-09-26,620391.3859999999
2021-09-27,620395.5269999999
2021-09-28,620509.6619999999
2021-09-29,620910.7319999998
2021-09-30,621258.8179999999
2021-10-01,621635.1109999998
2021-10-02,622477.6829999998
2021-10-03,623142.4769999998
2021-10-04,623956.9329999998
2021-10-05,624911.8329999999
2021-10-06,625056.2099999998
2021-10-07,625787.9819999998
2021-10-08,626509.2149999999
2021-10-09,627209.0849999998
2021-10-10,627746.9489999998
2021-10-11,627831.0029999998
2021-10-12,628410.2719999998
2021-10-13,628933.1799999998
2021-10-14,629258.5189999999
2021-10-15,629562.0629999998
2021-10-16,630445.2129999999
2021-10-17,630947.9319999999
2021-10-18,631880.298
2021-10-19,632029.874
2021-10-20,632482.836
2021-10-21,633200.072
2021-10-22,633672.2570000001
2021-10-23,634199.6390000001
2021-10-24,634362.0310000001
2021-10-25,634744.082
2021-10-26,635224.635
2021-10-27,635414.306
2021-10-28,635566.9689999999
2021-10-29,636407.1209999999
2021-10-30,636982.916
2021-10-31,637894.325
2021-11-01,637991.833
2021-11-02,638506.396
2021-11-03,638762.9959999999
2021-11-04,639647.9679999999
2021-11-05,640451.8089999999
2021-11-06,640809.5959999999
2021-11-07,641638.3749999999
2021-11-08,642281.9219999999
2021-11-09,642788.4779999999
2021-11-10,643005.8749999999
2021-11-11,643023.5719999999
2021-11-12,643074.1989999999
2021-11-13,643275.9239999999
2021-11-14,643317.3719999999
2021-11-15,643888.2859999998
2021-11-16,644558.5749999998
2021-11-17,644865.3059999999
2021-11-18,645730.5009999998
2021-11-19,646626.7349999999
2021-11-20,646924.1959999999
2021-11-21,647553.8269999999
2021-11-22,648030.5219999999
2021-11-23,648820.8589999999
2021-11-24,649323.7529999999
2021-11-25,650052.8879999999
2021-11-26,650543.899
2021-11-27,651033.7679999999
2021-11-28,651140.0659999999
2021-11-29,651259.0199999999
2021-11-30,651272.7299999999
2021-12-01,652076.4699999999
2021-12-02,652130.1229999999
2021-12-03,652161.3479999999
2021-12-04,652357.5839999999
2021-12-05,652618.8829999999
2021-12-06,653477.205
2021-12-07,653524.2969999999
2021-12-08,654459.6909999999
2021-12-09,654900.9799999999
2021-12-10,655081.9799999999
2021-12-11,655233.6929999999
2021-12-12,655741.7469999999
2021-12-13,656342.3979999998
2021-12-14,656808.7509999998
2021-12-15,657553.7829999998
2021-12-16,658489.2359999998
2021-12-17,658707.7409999998
2021-12-18,658750.6109999998
2021-12-19,659410.3899999998
2021-12-20,659912.6569999998
2021-12-21,660803.9809999998
2021-12-22,661434.3369999998
2021-12-23,661940.8039999998
2021-12-24,662037.4209999997
2021-12-25,662105.5519999998
2021-12-26,662784.3069999998
2021-12-27,662453.0669999998
2021-12-28,661973.3869999998
2021-12-29,661186.7009999998
2021-12-30,660686.5239999997
2021-12-31,659746.6939999998
