date,value
2018-01-01,85.255
2018-01-02,511.723
2018-01-03,1160.409
2018-01-04,1164.441
2018-01-05,2130.326
2018-01-06,2208.373
2018-01-07,2315.208
2018-01-08,3192.5150000000003
2018-01-09,
2018-01-10,
2018-01-11,5248.942999999999
2018-01-12,6169.047999999999
2018-01-13,6995.802999999999
2018-01-14,
2018-01-15,8681.304999999998
2018-01-16,9055.344
2018-01-17,9916.948999999999
2018-01-18,10676.746
2018-01-19,11224.096
2018-01-20,
2018-01-21,
2018-01-22,
2018-01-23,
2018-01-24,
2018-01-25,
2018-01-26,
2018-01-27,
2018-01-28,
2018-01-29,16721.802
2018-01-30,17235.087
2018-01-31,17445.933
2018-02-01,18140.083000000002
2018-02-02,18926.927000000003
2018-02-03,
2018-02-04,19665.682000000004
2018-02-05,20373.753000000004
2018-02-06,20506.003000000004
2018-02-07,20674.929000000004
2018-02-08,20767.258000000005
2018-02-09,
2018-02-10,21491.709000000006
2018-02-11,22388.801000000007
2018-02-12,23028.34400000001
2018-02-13,23914.234000000008
2018-02-14,24243.801000000007
2018-02-15,24615.384000000005
2018-02-16,25164.637000000006
2018-02-17,25387.173000000006
2018-02-18,25658.073000000008
2018-02-19,25931.626000000007
2018-02-20,26269.59600000001
2018-02-21,26352.272000000008
2018-02-22,27020.074000000008
2018-02-23,27808.88200000001
2018-02-24,27863.97300000001
2018-02-25,28126.84500000001
2018-02-26,28864.63900000001
2018-02-27,29538.13500000001
2018-02-28,30481.62100000001
2018-03-01,31082.08100000001
2018-03-02,31922.03500000001
2018-03-03,32733.31500000001
2018-03-04,32823.066000000006
2018-03-05,33796.422000000006
2018-03-06,34771.674000000006
2018-03-07,35630.15700000001
2018-03-08,36491.65600000001
2018-03-09,37296.57500000001
2018-03-10,38050.13400000001
2018-03-11,38338.03000000001
2018-03-12,38894.13600000001
2018-03-13,
2018-03-14,
2018-03-15,40151.288000000015
2018-03-16,41042.881000000016
2018-03-17,41081.746000000014
2018-03-18,41595.943000000014
2018-03-19,42291.739000000016
2018-03-20,42338.86100000002
2018-03-21,42917.48200000002
2018-03-22,43796.758000000016
2018-03-23,
2018-03-24,44896.820000000014
2018-03-25,45230.77600000001
2018-03-26,
2018-03-27,46503.35500000002
2018-03-28,46846.235000000015
2018-03-29,47264.47400000002
2018-03-30,47918.81000000002
2018-03-31,
2018-04-01,49532.28500000002
2018-04-02,50231.27000000002
2018-04-03,
2018-04-04,51000.23000000002
2018-04-05,51282.125000000015
2018-04-06,51327.90500000001
2018-04-07,
2018-04-08,52188.754000000015
2018-04-09,
2018-04-10,53242.44400000001
2018-04-11,54009.42500000001
2018-04-12,54027.67200000001
2018-04-13,54477.46700000001
2018-04-14,
2018-04-15,56114.731000000014
2018-04-16,56667.02600000001
2018-04-17,
2018-04-18,58154.95600000001
2018-04-19,59143.21900000001
2018-04-20,59304.557000000015
2018-04-21,59961.18900000001
2018-04-22,60499.33300000001
2018-04-23,61336.665000000015
2018-04-24,62277.705000000016
2018-04-25,
2018-04-26,
2018-04-27,62538.92500000002
2018-04-28,63522.87800000002
2018-04-29,64054.17300000002
2018-04-30,64931.195000000014
2018-05-01,65200.65200000002
2018-05-02,65724.89700000001
2018-05-03,66403.23200000002
2018-05-04,66947.25200000002
2018-05-05,67619.52000000002
2018-05-06,68260.39300000003
2018-05-07,68556.54900000003
2018-05-08,69332.42500000003
2018-05-09,
2018-05-10,70648.50600000004
2018-05-11,70687.99300000003
2018-05-12,71025.04500000003
2018-05-13,71056.38700000003
2018-05-14,
2018-05-15,72875.49800000002
2018-05-16,73051.68300000002
2018-05-17,
2018-05-18,73605.79000000001
2018-05-19,73657.29900000001
2018-05-20,
2018-05-21,74745.63900000002
2018-05-22,
2018-05-23,75776.76400000002
2018-05-24,76460.51000000002
2018-05-25,77194.74700000002
2018-05-26,78115.99900000001
2018-05-27,78872.24700000002
2018-05-28,
2018-05-29,
2018-05-30,80599.86000000002
2018-05-31,81173.59900000002
2018-06-01,
2018-06-02,82582.07600000002
2018-06-03,82747.52200000001
2018-06-04,83222.45400000001
2018-06-05,83313.30200000001
2018-06-06,83671.74600000001
2018-06-07,84149.65300000002
2018-06-08,84342.04400000002
2018-06-09,85121.73700000002
2018-06-10,
2018-06-11,85759.74500000002
2018-06-12,
2018-06-13,86855.04800000002
2018-06-14,
2018-06-15,87809.14100000002
2018-06-16,
2018-06-17,
2018-06-18,
2018-06-19,
2018-06-20,
2018-06-21,
2018-06-22,
2018-06-23,
2018-06-24,
2018-06-25,
2018-06-26,
2018-06-27,
2018-06-28,
2018-06-29,
2018-06-30,97747.471
2018-07-01,
2018-07-02,98002.584
2018-07-03,
2018-07-04,98875.66900000001
2018-07-05,99288.34400000001
2018-07-06,
2018-07-07,100658.172
2018-07-08,101028.765
2018-07-09,101839.295
2018-07-10,102211.146
2018-07-11,103168.85399999999
2018-07-12,104133.22499999999
2018-07-13,104172.355
2018-07-14,104608.61499999999
2018-07-15,104817.09
2018-07-16,105755.421
2018-07-17,105988.808
2018-07-18,106303.17
2018-07-19,106352.584
2018-07-20,106365.041
2018-07-21,106656.38399999999
2018-07-22,107242.412
2018-07-23,107287.68
2018-07-24,107942.795
2018-07-25,
2018-07-26,108163.528
2018-07-27,108695.072
2018-07-28,
2018-07-29,110264.765
2018-07-30,111100.793
2018-07-31,
2018-08-01,112665.44
2018-08-02,112703.637
2018-08-03,112804.36600000001
2018-08-04,112821.96200000001
2018-08-05,113294.57500000001
2018-08-06,113746.67300000001
2018-08-07,114605.47200000001
2018-08-08,
2018-08-09,
2018-08-10,
2018-08-11,117743.736
2018-08-12,
2018-08-13,118887.00300000001
2018-08-14,119317.23400000001
2018-08-15,119619.47600000001
2018-08-16,120176.172
2018-08-17,120258.88200000001
2018-08-18,121193.82300000002
2018-08-19,121193.96600000001
2018-08-20,121284.22300000001
2018-08-21,121786.26000000001
2018-08-22,121888.93400000001
2018-08-23,122114.44700000001
2018-08-24,122570.07800000001
2018-08-25,122782.79400000001
2018-08-26,122837.76900000001
2018-08-27,123315.80000000002
2018-08-28,124014.16700000002
2018-08-29,124377.86400000002
2018-08-30,124948.59400000001
2018-08-31,
2018-09-01,126315.49200000001
2018-09-02,126344.46900000001
2018-09-03,
2018-09-04,127579.88700000002
2018-09-05,128069.48500000002
2018-09-06,128704.93000000002
2018-09-07,
2018-09-08,129489.26200000003
2018-09-09,
2018-09-10,
2018-09-11,131904.10400000005
2018-09-12,132669.54000000004
2018-09-13,133550.96500000003
2018-09-14,133777.71200000003
2018-09-15,134315.42300000004
2018-09-16,134661.20900000003
2018-09-17,
2018-09-18,135649.07000000004
2018-09-19,136005.36900000004
2018-09-20,136501.14400000003
2018-09-21,136973.30800000002
2018-09-22,137681.94000000003
2018-09-23,138285.12700000004
2018-09-24,
2018-09-25,
2018-09-26,139800.61700000006
2018-09-27,140466.09000000005
2018-09-28,140772.37100000004
2018-09-29,141275.16900000005
2018-09-30,142067.99400000006
2018-10-01,142787.34100000007
2018-10-02,143090.44500000007
2018-10-03,143709.71000000008
2018-10-04,144184.46300000008
2018-10-05,145157.01400000008
2018-10-06,145572.18000000008
2018-10-07,145928.26800000007
2018-10-08,146180.88500000007
2018-10-09,146226.99800000008
2018-10-10,146462.20500000007
2018-10-11,146717.64600000007
2018-10-12,147271.61100000006
2018-10-13,148079.89500000008
2018-10-14,148112.58900000007
2018-10-15,148658.75300000006
2018-10-16,149641.85400000005
2018-10-17,150126.08300000004
2018-10-18,150933.03300000005
2018-10-19,150976.16400000005
2018-10-20,151810.05300000004
2018-10-21,152714.99300000005
2018-10-22,153492.38300000006
2018-10-23,153933.02200000006
2018-10-24,154107.16800000006
2018-10-25,154498.16000000006
2018-10-26,154700.29000000007
2018-10-27,154757.10700000008
2018-10-28,155010.46800000008
2018-10-29,155026.74000000008
2018-10-30,155335.36600000007
2018-10-31,155479.32700000008
2018-11-01,
2018-11-02,156756.51200000008
2018-11-03,157037.37700000007
2018-11-04,157819.80900000007
2018-11-05,158703.81500000006
2018-11-06,158794.96200000006
2018-11-07,159005.81200000006
2018-11-08,
2018-11-09,160001.49800000005
2018-11-10,160178.44100000005
2018-11-11,160835.74600000004
2018-11-12,161135.29800000004
2018-11-13,161140.69200000004
2018-11-14,161711.00400000004
2018-11-15,161828.95500000005
2018-11-16,162468.69700000004
2018-11-17,162799.54900000006
2018-11-18,162836.87100000004
2018-11-19,163592.32700000005
2018-11-20,164546.99900000004
2018-11-21,164758.31300000005
2018-11-22,
2018-11-23,165810.37000000005
2018-11-24,166492.05300000004
2018-11-25,166828.19100000005
2018-11-26,167422.16300000006
2018-11-27,168246.97200000007
2018-11-28,168362.87700000007
2018-11-29,169254.01800000007
2018-11-30,170111.92900000006
2018-12-01,170747.83700000006
2018-12-02,171458.86600000007
2018-12-03,172123.55300000007
2018-12-04,
2018-12-05,
2018-12-06,173811.44300000006
2018-12-07,174413.60600000006
2018-12-08,174452.60400000005
2018-12-09,174680.71700000006
2018-12-10,
2018-12-11,175631.14200000008
2018-12-12,176430.93100000007
2018-12-13,176622.92400000006
2018-12-14,177165.32200000004
2018-12-15,177941.40900000004
2018-12-16,
2018-12-17,178716.59200000003
2018-12-18,179583.30900000004
2018-12-19,179784.54000000004
2018-12-20,
2018-12-21,181649.64200000002
2018-12-22,182552.60400000002
2018-12-23,182885.518
2018-12-24,183598.91400000002
2018-12-25,183791.90600000002
2018-12-26,184533.23900000003
2018-12-27,184832.14400000003
2018-12-28,184874.14500000002
2018-12-29,
2018-12-30,185854.30900000004
2018-12-31,186259.37300000005
2019-01-01,187008.97300000006
2019-01-02,187979.54600000006
2019-01-03,188582.53500000006
2019-01-04,189532.84500000006
2019-01-05,
2019-01-06,190667.08700000006
2019-01-07,190853.99700000006
2019-01-08,191674.99300000007
2019-01-09,192265.91700000007
2019-01-10,193065.57900000009
2019-01-11,193644.5750000001
2019-01-12,193941.9920000001
2019-01-13,
2019-01-14,
2019-01-15,195500.18900000007
2019-01-16,195825.2230000001
2019-01-17,196055.90800000008
2019-01-18,196813.74500000008
2019-01-19,197190.5110000001
2019-01-20,197362.37800000008
2019-01-21,
2019-01-22,197618.59600000008
2019-01-23,198435.9320000001
2019-01-24,
2019-01-25,
2019-01-26,200557.2030000001
2019-01-27,
2019-01-28,202100.8660000001
2019-01-29,203066.3450000001
2019-01-30,203456.3230000001
2019-01-31,203934.9720000001
2019-02-01,204124.3360000001
2019-02-02,204684.7140000001
2019-02-03,204789.7460000001
2019-02-04,
2019-02-05,205248.0400000001
2019-02-06,205856.0910000001
2019-02-07,205959.8130000001
2019-02-08,206380.6810000001
2019-02-09,207090.6060000001
2019-02-10,207746.4750000001
2019-02-11,207919.2420000001
2019-02-12,208359.74500000008
2019-02-13,
2019-02-14,
2019-02-15,
2019-02-16,
2019-02-17,
2019-02-18,
2019-02-19,
2019-02-20,
2019-02-21,
2019-02-22,212289.12300000008
2019-02-23,
2019-02-24,214074.60900000005
2019-02-25,214111.63500000007
2019-02-26,214629.80900000007
2019-02-27,214994.90000000005
2019-02-28,
2019-03-01,215523.45200000005
2019-03-02,215962.62800000006
2019-03-03,216805.43800000005
2019-03-04,217336.05000000005
2019-03-05,217890.51900000006
2019-03-06,218106.48100000006
2019-03-07,218521.16400000005
2019-03-08,219518.60500000004
2019-03-09,220181.34500000003
2019-03-10,
2019-03-11,221384.78600000005
2019-03-12,221433.27300000004
2019-03-13,
2019-03-14,222941.61400000003
2019-03-15,223353.55100000004
2019-03-16,224250.85600000003
2019-03-17,
2019-03-18,225112.39
2019-03-19,225750.497
2019-03-20,
2019-03-21,226697.51200000002
2019-03-22,227281.19000000003
2019-03-23,
2019-03-24,228783.35000000003
2019-03-25,229762.82200000004
2019-03-26,229985.50300000006
2019-03-27,230369.10800000007
2019-03-28,230818.20100000006
2019-03-29,231463.45300000007
2019-03-30,231663.81500000006
2019-03-31,231683.16000000006
2019-04-01,232519.63500000007
2019-04-02,
2019-04-03,
2019-04-04,233568.98100000006
2019-04-05,233578.61600000007
2019-04-06,233658.85400000008
2019-04-07,233898.7550000001
2019-04-08,233964.9120000001
2019-04-09,234829.4620000001
2019-04-10,235336.0570000001
2019-04-11,236220.0450000001
2019-04-12,236482.6270000001
2019-04-13,237472.8900000001
2019-04-14,238329.2710000001
2019-04-15,238721.6980000001
2019-04-16,238751.9020000001
2019-04-17,239660.9750000001
2019-04-18,239671.3120000001
2019-04-19,239844.0370000001
2019-04-20,240737.5160000001
2019-04-21,241726.5810000001
2019-04-22,242353.04700000008
2019-04-23,
2019-04-24,
2019-04-25,243665.66500000007
2019-04-26,244098.71100000007
2019-04-27,
2019-04-28,244497.24800000008
2019-04-29,244509.9750000001
2019-04-30,245237.5270000001
2019-05-01,245789.1520000001
2019-05-02,245882.7010000001
2019-05-03,
2019-05-04,246890.77300000007
2019-05-05,246943.58900000007
2019-05-06,
2019-05-07,247877.32700000008
2019-05-08,248556.77600000007
2019-05-09,249121.73300000007
2019-05-10,249436.28500000006
2019-05-11,
2019-05-12,250480.15600000008
2019-05-13,251194.34400000007
2019-05-14,251535.43000000008
2019-05-15,252268.93400000007
2019-05-16,252313.53100000008
2019-05-17,
2019-05-18,253982.51700000005
2019-05-19,254948.27300000004
2019-05-20,255561.81900000005
2019-05-21,256132.14200000005
2019-05-22,256913.75200000004
2019-05-23,
2019-05-24,258795.60500000004
2019-05-25,259779.27700000003
2019-05-26,260022.76400000002
2019-05-27,260295.928
2019-05-28,260364.03600000002
2019-05-29,
2019-05-30,261009.56700000004
2019-05-31,261541.97300000003
2019-06-01,261738.87400000004
2019-06-02,
2019-06-03,262702.498
2019-06-04,
2019-06-05,263374.28500000003
2019-06-06,264327.45
2019-06-07,264432.462
2019-06-08,265363.246
2019-06-09,
2019-06-10,265732.199
2019-06-11,265893.575
2019-06-12,266045.53
2019-06-13,266770.988
2019-06-14,267228.188
2019-06-15,
2019-06-16,268259.463
2019-06-17,269155.553
2019-06-18,269923.216
2019-06-19,
2019-06-20,270946.53700000007
2019-06-21,
2019-06-22,272176.42000000004
2019-06-23,272973.00500000006
2019-06-24,273267.14300000004
2019-06-25,273330.24100000004
2019-06-26,274126.922
2019-06-27,274479.832
2019-06-28,275400.115
2019-06-29,275620.93799999997
2019-06-30,
2019-07-01,276755.93799999997
2019-07-02,277560.307
2019-07-03,277794.96599999996
2019-07-04,
2019-07-05,278486.098
2019-07-06,279258.651
2019-07-07,279291.912
2019-07-08,279916.137
2019-07-09,280043.10099999997
2019-07-10,280688.85099999997
2019-07-11,280986.85299999994
2019-07-12,281762.8879999999
2019-07-13,
2019-07-14,282979.4819999999
2019-07-15,283902.8789999999
2019-07-16,284672.3009999999
2019-07-17,
2019-07-18,285945.66399999993
2019-07-19,286209.88999999996
2019-07-20,287112.43799999997
2019-07-21,287774.437
2019-07-22,
2019-07-23,288415.937
2019-07-24,288771.914
2019-07-25,288982.133
2019-07-26,289589.692
2019-07-27,289916.828
2019-07-28,290787.43899999995
2019-07-29,291286.95699999994
2019-07-30,291706.1649999999
2019-07-31,291979.7309999999
2019-08-01,292920.7979999999
2019-08-02,
2019-08-03,
2019-08-04,
2019-08-05,
2019-08-06,
2019-08-07,
2019-08-08,
2019-08-09,
2019-08-10,
2019-08-11,
2019-08-12,
2019-08-13,
2019-08-14,
2019-08-15,
2019-08-16,
2019-08-17,
2019-08-18,
2019-08-19,
2019-08-20,
2019-08-21,
2019-08-22,
2019-08-23,
2019-08-24,
2019-08-25,
2019-08-26,
2019-08-27,
2019-08-28,
2019-08-29,
2019-08-30,
2019-08-31,
2019-09-01,310971.419
2019-09-02,
2019-09-03,312320.91500000004
2019-09-04,312841.50500000006
2019-09-05,312966.3230000001
2019-09-06,
2019-09-07,
2019-09-08,
2019-09-09,314816.4250000001
2019-09-10,315581.9730000001
2019-09-11,315873.9630000001
2019-09-12,316847.2080000001
2019-09-13,317413.0180000001
2019-09-14,317674.9570000001
2019-09-15,317960.0590000001
2019-09-16,318170.0000000001
2019-09-17,318258.0940000001
2019-09-18,319172.9450000001
2019-09-19,320094.2410000001
2019-09-20,321086.7650000001
2019-09-21,321937.26700000005
2019-09-22,322644.161
2019-09-23,323143.51900000003
2019-09-24,324038.06000000006
2019-09-25,324043.27200000006
2019-09-26,
2019-09-27,
2019-09-28,325557.26800000004
2019-09-29,325798.44800000003
2019-09-30,325906.831
2019-10-01,326151.303
2019-10-02,
2019-10-03,327264.993
2019-10-04,328070.211
2019-10-05,
2019-10-06,329503.833
2019-10-07,
2019-10-08,330348.094
2019-10-09,330663.638
2019-10-10,331032.13899999997
2019-10-11,331321.432
2019-10-12,331670.159
2019-10-13,332290.801
2019-10-14,332716.032
2019-10-15,332765.115
2019-10-16,333233.067
2019-10-17,
2019-10-18,333963.735
2019-10-19,334112.817
2019-10-20,334806.61299999995
2019-10-21,335567.00999999995
2019-10-22,335845.92799999996
2019-10-23,
2019-10-24,335987.534
2019-10-25,
2019-10-26,337369.012
2019-10-27,338272.881
2019-10-28,339241.799
2019-10-29,
2019-10-30,340477.948
2019-10-31,340590.12299999996
2019-11-01,341284.241
2019-11-02,341317.883
2019-11-03,341949.696
2019-11-04,342157.6
2019-11-05,
2019-11-06,343071.086
2019-11-07,
2019-11-08,344145.12
2019-11-09,344713.394
2019-11-10,345543.45999999996
2019-11-11,345865.148
2019-11-12,346662.056
2019-11-13,347112.44999999995
2019-11-14,347161.69499999995
2019-11-15,347773.6649999999
2019-11-16,348705.86499999993
2019-11-17,348922.6169999999
2019-11-18,349109.7859999999
2019-11-19,349505.4849999999
2019-11-20,349896.0349999999
2019-11-21,350385.7439999999
2019-11-22,351226.3499999999
2019-11-23,
2019-11-24,352371.5859999999
2019-11-25,352482.1569999999
2019-11-26,353263.24099999986
2019-11-27,354197.6089999999
2019-11-28,354493.6259999999
2019-11-29,354854.27299999987
2019-11-30,354877.29099999985
2019-12-01,355492.42099999986
2019-12-02,
2019-12-03,
2019-12-04,357744.74199999985
2019-12-05,357784.1519999998
2019-12-06,
2019-12-07,
2019-12-08,359292.9579999998
2019-12-09,359709.1719999998
2019-12-10,360055.8769999998
2019-12-11,360633.0869999998
2019-12-12,361050.7399999998
2019-12-13,
2019-12-14,
2019-12-15,
2019-12-16,
2019-12-17,
2019-12-18,365110.54599999986
2019-12-19,365704.99199999985
2019-12-20,366189.26499999984
2019-12-21,366876.30599999987
2019-12-22,367504.17099999986
2019-12-23,367979.50799999986
2019-12-24,
2019-12-25,369112.80099999986
2019-12-26,369948.3799999999
2019-12-27,370869.8959999999
2019-12-28,371392.2159999999
2019-12-29,371747.4619999999
2019-12-30,
2019-12-31,373064.2999999999
2020-01-01,
2020-01-02,
2020-01-03,374433.6709999999
2020-01-04,375165.09899999993
2020-01-05,376050.4469999999
2020-01-06,376589.04799999995
2020-01-07,377478.78299999994
2020-01-08,377819.79699999996
2020-01-09,378374.551
2020-01-10,378689.839
2020-01-11,378849.637
2020-01-12,379278.859
2020-01-13,379365.103
2020-01-14,379593.001
2020-01-15,380137.02499999997
2020-01-16,381024.54899999994
2020-01-17,381221.47699999996
2020-01-18,
2020-01-19,382541.11399999994
2020-01-20,383436.15799999994
2020-01-21,384366.28699999995
2020-01-22,
2020-01-23,386186.31899999996
2020-01-24,
2020-01-25,386614.551
2020-01-26,386812.279
2020-01-27,386972.23
2020-01-28,387243.877
2020-01-29,387769.30299999996
2020-01-30,388422.877
2020-01-31,389231.85
2020-02-01,389520.926
2020-02-02,390460.26999999996
2020-02-03,391012.796
2020-02-04,391561.86699999997
2020-02-05,392520.43299999996
2020-02-06,393276.06499999994
2020-02-07,
2020-02-08,393759.045
2020-02-09,394605.056
2020-02-10,
2020-02-11,395592.405
2020-02-12,
2020-02-13,395790.575
2020-02-14,395865.47500000003
2020-02-15,395892.38700000005
2020-02-16,
2020-02-17,396185.48500000004
2020-02-18,397146.56100000005
2020-02-19,
2020-02-20,
2020-02-21,398646.62500000006
2020-02-22,399617.02700000006
2020-02-23,399817.0580000001
2020-02-24,
2020-02-25,400941.9960000001
2020-02-26,401712.1490000001
2020-02-27,402667.4130000001
2020-02-28,403028.9780000001
2020-02-29,
2020-03-01,404043.80600000016
2020-03-02,404189.4620000002
2020-03-03,404199.70700000017
2020-03-04,404220.72600000014
2020-03-05,405045.72100000014
2020-03-06,405962.17000000016
2020-03-07,
2020-03-08,406922.25100000016
2020-03-09,407038.56700000016
2020-03-10,407901.2820000002
2020-03-11,408707.3780000002
2020-03-12,408824.2480000002
2020-03-13,409541.1350000002
2020-03-14,410034.40300000017
2020-03-15,
2020-03-16,
2020-03-17,411598.38200000016
2020-03-18,411837.7880000002
2020-03-19,412239.26800000016
2020-03-20,412276.99300000013
2020-03-21,412400.41100000014
2020-03-22,
2020-03-23,
2020-03-24,
2020-03-25,414872.18500000006
2020-03-26,415224.9600000001
2020-03-27,
2020-03-28,415616.89700000006
2020-03-29,416598.97300000006
2020-03-30,416854.4440000001
2020-03-31,417588.29300000006
2020-04-01,418337.80000000005
2020-04-02,418602.36900000006
2020-04-03,418715.3520000001
2020-04-04,419360.2420000001
2020-04-05,419725.3240000001
2020-04-06,
2020-04-07,420623.6940000001
2020-04-08,420662.3350000001
2020-04-09,421182.2310000001
2020-04-10,421961.8650000001
2020-04-11,422210.5710000001
2020-04-12,422650.8990000001
2020-04-13,423216.6560000001
2020-04-14,423247.5460000001
2020-04-15,423774.7450000001
2020-04-16,
2020-04-17,425338.98300000007
2020-04-18,
2020-04-19,426092.29900000006
2020-04-20,426358.7920000001
2020-04-21,426439.54400000005
2020-04-22,427221.97500000003
2020-04-23,427868.992
2020-04-24,
2020-04-25,429777.37500000006
2020-04-26,430369.76300000004
2020-04-27,
2020-04-28,431699.179
2020-04-29,431787.389
2020-04-30,431867.923
2020-05-01,432345.414
2020-05-02,
2020-05-03,432883.877
2020-05-04,
2020-05-05,434104.432
2020-05-06,434423.685
2020-05-07,
2020-05-08,435089.857
2020-05-09,435315.989
2020-05-10,435505.053
2020-05-11,435996.439
2020-05-12,
2020-05-13,
2020-05-14,
2020-05-15,
2020-05-16,
2020-05-17,
2020-05-18,
2020-05-19,440058.713
2020-05-20,440994.784
2020-05-21,441335.119
2020-05-22,442134.811
2020-05-23,442943.81799999997
2020-05-24,443880.11399999994
2020-05-25,
2020-05-26,444030.23299999995
2020-05-27,
2020-05-28,444401.432
2020-05-29,445372.80199999997
2020-05-30,
2020-05-31,446400.5889999999
2020-06-01,447218.2369999999
2020-06-02,447756.1019999999
2020-06-03,447860.9439999999
2020-06-04,448083.0189999999
2020-06-05,
2020-06-06,449518.4219999999
2020-06-07,450243.1439999999
2020-06-08,451026.6939999999
2020-06-09,451121.1889999999
2020-06-10,451156.7699999999
2020-06-11,452072.1959999999
2020-06-12,452852.14399999985
2020-06-13,
2020-06-14,
2020-06-15,
2020-06-16,
2020-06-17,
2020-06-18,
2020-06-19,454899.48799999984
2020-06-20,455581.84399999987
2020-06-21,455937.39499999984
2020-06-22,455989.17799999984
2020-06-23,456380.2719999998
2020-06-24,457354.5109999998
2020-06-25,458074.32899999985
2020-06-26,458661.3759999999
2020-06-27,
2020-06-28,459698.5329999999
2020-06-29,459904.4979999999
2020-06-30,
2020-07-01,461393.2409999999
2020-07-02,
2020-07-03,462635.42199999996
2020-07-04,463418.29
2020-07-05,
2020-07-06,
2020-07-07,465652.14499999996
2020-07-08,
2020-07-09,466135.31899999996
2020-07-10,466821.659
2020-07-11,467444.234
2020-07-12,468004.801
2020-07-13,468865.55299999996
2020-07-14,469546.31499999994
2020-07-15,
2020-07-16,470887.80499999993
2020-07-17,471341.7359999999
2020-07-18,471583.64699999994
2020-07-19,471685.39499999996
2020-07-20,
2020-07-21,
2020-07-22,472860.66799999995
2020-07-23,473090.05399999995
2020-07-24,473649.54899999994
2020-07-25,474393.0399999999
2020-07-26,474584.6009999999
2020-07-27,475501.9069999999
2020-07-28,475972.2329999999
2020-07-29,
2020-07-30,477596.5289999999
2020-07-31,478205.4589999999
2020-08-01,478550.4599999999
2020-08-02,
2020-08-03,
2020-08-04,480719.4299999999
2020-08-05,
2020-08-06,481367.54599999986
2020-08-07,481474.83999999985
2020-08-08,482128.20999999985
2020-08-09,482642.37099999987
2020-08-10,
2020-08-11,
2020-08-12,484300.30899999983
2020-08-13,
2020-08-14,485791.83399999986
2020-08-15,486560.59999999986
2020-08-16,
2020-08-17,487136.9079999999
2020-08-18,487656.1469999999
2020-08-19,487932.81199999986
2020-08-20,
2020-08-21,488765.51999999984
2020-08-22,489066.0269999998
2020-08-23,489869.58599999984
2020-08-24,
2020-08-25,491072.01499999984
2020-08-26,491719.0879999998
2020-08-27,492317.6309999998
2020-08-28,493223.7519999998
2020-08-29,
2020-08-30,493635.1549999998
2020-08-31,
2020-09-01,494531.5299999998
2020-09-02,
2020-09-03,
2020-09-04,495700.6059999998
2020-09-05,496657.2099999998
2020-09-06,
2020-09-07,
2020-09-08,498421.1959999998
2020-09-09,498601.3099999998
2020-09-10,499595.78699999984
2020-09-11,499803.81399999984
2020-09-12,
2020-09-13,501003.4019999998
2020-09-14,
2020-09-15,501963.4969999998
2020-09-16,501964.7839999998
2020-09-17,502037.5909999998
2020-09-18,502316.3519999998
2020-09-19,502462.7909999998
2020-09-20,
2020-09-21,
2020-09-22,504159.0749999998
2020-09-23,504837.1019999998
2020-09-24,505211.38599999977
2020-09-25,506020.9159999998
2020-09-26,506516.4309999998
2020-09-27,506597.0819999998
2020-09-28,506987.3709999998
2020-09-29,
2020-09-30,507675.5609999998
2020-10-01,
2020-10-02,509377.0539999998
2020-10-03,510089.51999999984
2020-10-04,
2020-10-05,510670.34499999986
2020-10-06,510799.94199999986
2020-10-07,511140.1309999999
2020-10-08,511848.5549999999
2020-10-09,
2020-10-10,512968.4769999999
2020-10-11,513642.2489999999
2020-10-12,
2020-10-13,514752.7699999999
2020-10-14,515564.4529999999
2020-10-15,516547.46199999994
2020-10-16,
2020-10-17,
2020-10-18,517533.65499999997
2020-10-19,518234.71699999995
2020-10-20,518349.93299999996
2020-10-21,
2020-10-22,519949.80199999997
2020-10-23,520872.13599999994
2020-10-24,521232.1599999999
2020-10-25,521440.4699999999
2020-10-26,
2020-10-27,522166.93899999995
2020-10-28,
2020-10-29,523163.34799999994
2020-10-30,
2020-10-31,523763.1229999999
2020-11-01,524254.9659999999
2020-11-02,524937.9139999999
2020-11-03,525457.7099999998
2020-11-04,525752.6319999999
2020-11-05,525790.2859999998
2020-11-06,526627.2979999998
2020-11-07,527281.9939999998
2020-11-08,527709.2029999999
2020-11-09,528653.3409999999
2020-11-10,529195.1909999999
2020-11-11,529892.7999999999
2020-11-12,530801.0689999999
2020-11-13,531102.7969999999
2020-11-14,531118.1169999999
2020-11-15,531786.0069999999
2020-11-16,532460.7989999999
2020-11-17,533093.0249999999
2020-11-18,
2020-11-19,
2020-11-20,533909.781
2020-11-21,
2020-11-22,
2020-11-23,534964.554
2020-11-24,535296.43
2020-11-25,535596.8250000001
2020-11-26,536220.2270000001
2020-11-27,536591.118
2020-11-28,536949.828
2020-11-29,
2020-11-30,538416.6799999999
2020-12-01,538941.453
2020-12-02,539850.988
2020-12-03,540106.265
2020-12-04,540657.855
2020-12-05,
2020-12-06,541481.573
2020-12-07,542214.579
2020-12-08,542547.495
2020-12-09,543342.559
2020-12-10,543712.476
2020-12-11,543901.734
2020-12-12,544342.317
2020-12-13,544794.562
2020-12-14,545270.7740000001
2020-12-15,546044.6600000001
2020-12-16,
2020-12-17,547907.0890000002
2020-12-18,
2020-12-19,549021.4800000001
2020-12-20,549940.7110000001
2020-12-21,550495.7190000002
2020-12-22,550740.6900000002
2020-12-23,
2020-12-24,551931.7040000001
2020-12-25,552350.3860000002
2020-12-26,553237.8410000001
2020-12-27,553884.5560000001
2020-12-28,
2020-12-29,
2020-12-30,
2020-12-31,556083.346
2021-01-01,557076.4400000001
2021-01-02,557885.8700000001
2021-01-03,558342.2940000001
2021-01-04,558422.4060000001
2021-01-05,
2021-01-06,559853.908
2021-01-07,559869.216
2021-01-08,
2021-01-09,561397.91
2021-01-10,
2021-01-11,562880.948
2021-01-12,563117.585
2021-01-13,563826.73
2021-01-14,563827.2999999999
2021-01-15,563992.009
2021-01-16,564901.0469999999
2021-01-17,
2021-01-18,
2021-01-19,566752.8339999999
2021-01-20,566974.5739999999
2021-01-21,567750.1049999999
2021-01-22,568665.6109999999
2021-01-23,568932.629
2021-01-24,
2021-01-25,570093.4489999999
2021-01-26,
2021-01-27,570505.2769999999
2021-01-28,571103.2849999999
2021-01-29,571780.7409999999
2021-01-30,572457.6839999999
2021-01-31,572462.1329999999
2021-02-01,572490.2479999999
2021-02-02,573186.9319999999
2021-02-03,573897.9239999999
2021-02-04,574705.5679999999
2021-02-05,574919.0279999998
2021-02-06,
2021-02-07,575850.3869999998
2021-02-08,
2021-02-09,576485.0689999998
2021-02-10,576775.5059999998
2021-02-11,
2021-02-12,577436.0159999998
2021-02-13,577843.5609999999
2021-02-14,578075.5039999998
2021-02-15,579003.3179999999
2021-02-16,579165.5959999999
2021-02-17,579573.8489999999
2021-02-18,580419.8209999999
2021-02-19,581245.9549999998
2021-02-20,581264.3189999998
2021-02-21,582228.8409999998
2021-02-22,582244.2529999998
2021-02-23,582676.6129999998
2021-02-24,583034.0859999998
2021-02-25,583833.5749999997
2021-02-26,584810.6309999997
2021-02-27,584909.9179999997
2021-02-28,
2021-03-01,586090.0919999997
2021-03-02,586715.3939999997
2021-03-03,586857.3549999997
2021-03-04,586989.0909999998
2021-03-05,
2021-03-06,
2021-03-07,588734.1609999998
2021-03-08,589563.3279999999
2021-03-09,590122.7939999999
2021-03-10,
2021-03-11,590989.6099999999
2021-03-12,591274.9519999998
2021-03-13,591478.2709999998
2021-03-14,592145.1699999998
2021-03-15,593054.8979999998
2021-03-16,
2021-03-17,594263.8079999998
2021-03-18,595196.4029999998
2021-03-19,595980.0399999998
2021-03-20,
2021-03-21,596467.9519999998
2021-03-22,
2021-03-23,597493.3229999999
2021-03-24,597931.1299999999
2021-03-25,
2021-03-26,599512.941
2021-03-27,600106.389
2021-03-28,
2021-03-29,
2021-03-30,601138.579
2021-03-31,601401.408
2021-04-01,601509.096
2021-04-02,601690.621
2021-04-03,602576.893
2021-04-04,603500.2250000001
2021-04-05,603661.1350000001
2021-04-06,604187.8930000002
2021-04-07,604486.2920000001
2021-04-08,604499.2380000001
2021-04-09,
2021-04-10,605126.5350000001
2021-04-11,605495.7880000002
2021-04-12,605984.1590000002
2021-04-13,606968.0510000002
2021-04-14,607110.4250000002
2021-04-15,607122.5630000002
2021-04-16,607348.5200000003
2021-04-17,607567.3680000002
2021-04-18,608406.3420000003
2021-04-19,609203.3490000003
2021-04-20,610086.5020000003
2021-04-21,610945.3360000004
2021-04-22,611478.9510000004
2021-04-23,611520.2750000004
2021-04-24,611948.3740000004
2021-04-25,612127.9110000004
2021-04-26,612421.5530000004
2021-04-27,613193.7660000004
2021-04-28,
2021-04-29,
2021-04-30,614778.7910000003
2021-05-01,615182.6520000004
2021-05-02,615798.5310000003
2021-05-03,
2021-05-04,617032.0770000003
2021-05-05,
2021-05-06,617803.3380000002
2021-05-07,
2021-05-08,619185.7620000002
2021-05-09,619931.0490000002
2021-05-10,620690.5540000002
2021-05-11,621672.8700000002
2021-05-12,622550.6180000002
2021-05-13,622897.9950000002
2021-05-14,623044.0750000002
2021-05-15,623047.9880000001
2021-05-16,623436.6450000001
2021-05-17,
2021-05-18,
2021-05-19,626015.2500000002
2021-05-20,
2021-05-21,
2021-05-22,627681.2960000003
2021-05-23,628155.8630000004
2021-05-24,628955.1150000003
2021-05-25,
2021-05-26,
2021-05-27,630275.7910000003
2021-05-28,
2021-05-29,
2021-05-30,
2021-05-31,630785.5310000003
2021-06-01,631111.2750000003
2021-06-02,631950.3200000003
2021-06-03,632803.5930000003
2021-06-04,
2021-06-05,633022.2600000004
2021-06-06,
2021-06-07,634551.3740000004
2021-06-08,634982.8690000004
2021-06-09,635866.7860000004
2021-06-10,635903.1610000004
2021-06-11,
2021-06-12,637694.0860000004
2021-06-13,
2021-06-14,638798.9900000003
2021-06-15,639028.1030000004
2021-06-16,639301.0670000004
2021-06-17,639771.4540000004
2021-06-18,
2021-06-19,639823.9070000004
2021-06-20,
2021-06-21,640879.5580000004
2021-06-22,641006.2340000004
2021-06-23,641968.7340000004
2021-06-24,642476.1510000004
2021-06-25,
2021-06-26,642968.5920000004
2021-06-27,643609.9100000004
2021-06-28,643976.6150000003
2021-06-29,
2021-06-30,
2021-07-01,645532.3020000004
2021-07-02,
2021-07-03,646169.0250000004
2021-07-04,647097.0910000004
2021-07-05,647344.5860000004
2021-07-06,648184.2640000003
2021-07-07,
2021-07-08,649089.4640000003
2021-07-09,649493.2340000003
2021-07-10,649809.2600000002
2021-07-11,650720.5270000002
2021-07-12,651319.2910000002
2021-07-13,652188.8010000002
2021-07-14,652368.4500000002
2021-07-15,652848.4390000001
2021-07-16,653102.0090000001
2021-07-17,653315.9170000001
2021-07-18,
2021-07-19,
2021-07-20,
2021-07-21,654911.7820000001
2021-07-22,655799.1910000001
2021-07-23,656304.9850000001
2021-07-24,656658.1940000001
2021-07-25,656728.8160000001
2021-07-26,657280.0410000001
2021-07-27,658174.1560000001
2021-07-28,658458.763
2021-07-29,658562.5920000001
2021-07-30,659323.545
2021-07-31,659666.111
2021-08-01,660021.243
2021-08-02,660165.742
2021-08-03,660746.129
2021-08-04,660844.536
2021-08-05,661706.8219999999
2021-08-06,
2021-08-07,
2021-08-08,662990.524
2021-08-09,663983.938
2021-08-10,664223.412
2021-08-11,664283.852
2021-08-12,664783.11
2021-08-13,665678.177
2021-08-14,665745.866
2021-08-15,665832.41
2021-08-16,666502.7860000001
2021-08-17,667394.329
2021-08-18,
2021-08-19,668422.912
2021-08-20,668935.477
2021-08-21,669452.6719999999
2021-08-22,669727.5549999999
2021-08-23,670266.8829999999
2021-08-24,670643.1359999999
2021-08-25,670910.3119999999
2021-08-26,671752.195
2021-08-27,672460.874
2021-08-28,672508.9789999999
2021-08-29,672713.938
2021-08-30,673436.596
2021-08-31,673820.011
2021-09-01,674345.957
2021-09-02,674663.9500000001
2021-09-03,
2021-09-04,675982.2400000001
2021-09-05,676237.3530000001
2021-09-06,677113.1590000001
2021-09-07,677625.3440000002
2021-09-08,678492.0410000002
2021-09-09,678521.7540000002
2021-09-10,678940.8920000002
2021-09-11,679154.2670000002
2021-09-12,679818.3740000002
2021-09-13,680628.3970000002
2021-09-14,681419.3680000002
2021-09-15,681588.8010000002
2021-09-16,
2021-09-17,682623.5370000002
2021-09-18,683171.9950000002
2021-09-19,684077.5090000002
2021-09-20,684352.0920000002
2021-09-21,684854.6900000002
2021-09-22,685318.2690000002
2021-09-23,685791.5760000002
2021-09-24,686764.7760000002
2021-09-25,
2021-09-26,687922.4870000002
2021-09-27,688257.6430000002
2021-09-28,689255.9570000002
2021-09-29,689954.4430000002
2021-09-30,690329.6600000001
2021-10-01,690821.9140000001
2021-10-02,691260.5620000002
2021-10-03,692148.9400000002
2021-10-04,692335.2710000002
2021-10-05,692614.4940000002
2021-10-06,692953.3240000001
2021-10-07,
2021-10-08,693873.4180000001
2021-10-09,694409.062
2021-10-10,695001.1780000001
2021-10-11,695903.4560000001
2021-10-12,696309.3010000001
2021-10-13,696984.1820000001
2021-10-14,
2021-10-15,698039.6450000001
2021-10-16,
2021-10-17,699251.9500000001
2021-10-18,699520.699
2021-10-19,700132.1410000001
2021-10-20,700156.155
2021-10-21,700797.1070000001
2021-10-22,
2021-10-23,
2021-10-24,701219.4670000001
2021-10-25,701324.7420000001
2021-10-26,702182.3410000001
2021-10-27,
2021-10-28,703908.0020000001
2021-10-29,704065.136
2021-10-30,704487.927
2021-10-31,705437.265
2021-11-01,
2021-11-02,705717.9260000001
2021-11-03,706529.7470000001
2021-11-04,
2021-11-05,707883.6120000001
2021-11-06,708094.9170000001
2021-11-07,708951.5410000001
2021-11-08,709060.9610000001
2021-11-09,709478.7950000002
2021-11-10,709891.1670000001
2021-11-11,709982.5970000002
2021-11-12,710548.5120000002
2021-11-13,711226.5890000003
2021-11-14,711381.0530000003
2021-11-15,711719.9260000003
2021-11-16,712445.1930000003
2021-11-17,
2021-11-18,713501.6130000004
2021-11-19,
2021-11-20,714732.0230000004
2021-11-21,715291.9710000004
2021-11-22,716217.8490000004
2021-11-23,716700.9900000003
2021-11-24,716824.1870000004
2021-11-25,717263.0040000004
2021-11-26,717592.7800000004
2021-11-27,718447.2820000004
2021-11-28,
2021-11-29,719959.3620000004
2021-11-30,720861.1470000005
2021-12-01,721045.6730000004
2021-12-02,721805.1690000005
2021-12-03,722678.7490000004
2021-12-04,723112.0860000005
2021-12-05,
2021-12-06,724493.2660000004
2021-12-07,724739.3700000005
2021-12-08,725336.3450000004
2021-12-09,726178.4980000005
2021-12-10,
2021-12-11,727471.0130000004
2021-12-12,727832.7880000004
2021-12-13,
2021-12-14,729246.9610000005
2021-12-15,
2021-12-16,729644.6450000005
2021-12-17,729906.6140000005
2021-12-18,730741.1960000006
2021-12-19,731169.9390000006
2021-12-20,732063.0930000006
2021-12-21,732548.9290000006
2021-12-22,733073.6120000005
2021-12-23,
2021-12-24,
2021-12-25,
2021-12-26,
2021-12-27,
2021-12-28,
2021-12-29,736614.2710000006
2021-12-30,737228.9420000006
2021-12-31,737536.0090000007
