<?xml version="1.0" encoding="utf-8"?>
<!-- Generator: Adobe Illustrator 23.0.2, SVG Export Plug-In . SVG Version: 6.00 Build 0)  -->
<svg version="1.1" id="Layer_1" xmlns="http://www.w3.org/2000/svg" xmlns:xlink="http://www.w3.org/1999/xlink" x="0px" y="0px"
	 viewBox="0 0 14.17 14.17" style="enable-background:new 0 0 14.17 14.17;" xml:space="preserve">
<style type="text/css">
	.st0{fill:#ffffff;}
	.st1{fill:#ffffff;}
</style>
<polygon class="st0" points="10.63,0 7.09,0 7.09,3.54 10.63,7.09 14.17,7.09 14.17,3.54 "/>
<polygon class="st0" points="10.63,7.09 7.09,7.09 7.09,10.63 10.63,14.17 14.17,14.17 14.17,10.63 "/>
<polygon class="st1" points="3.54,7.09 0,7.09 0,10.63 3.54,14.17 7.09,14.17 7.09,10.63 "/>
</svg>
