<?xml version="1.0"?>
<dumps>
  <platform name="Native" char_bit="8" short_bit="16" int_bit="32" long_bit="64" long_long_bit="64" pointer_bit="64"/>
  <rawtokens>
    <file index="0" name="main.cpp"/>
    <tok fileIndex="0" linenr="1" str="//#include &quot;stdafx.h&quot;"/>
    <tok fileIndex="0" linenr="2" str="#"/>
    <tok fileIndex="0" linenr="2" str="include"/>
    <tok fileIndex="0" linenr="2" str="&lt;stdlib.h&gt;"/>
    <tok fileIndex="0" linenr="3" str="//#include &lt;time.h&gt;"/>
    <tok fileIndex="0" linenr="5" str="/*************************************************************/"/>
    <tok fileIndex="0" linenr="6" str="// Physical Constants"/>
    <tok fileIndex="0" linenr="7" str="#"/>
    <tok fileIndex="0" linenr="7" str="define"/>
    <tok fileIndex="0" linenr="7" str="SOL"/>
    <tok fileIndex="0" linenr="7" str="("/>
    <tok fileIndex="0" linenr="7" str="2.99792458e8"/>
    <tok fileIndex="0" linenr="7" str=")"/>
    <tok fileIndex="0" linenr="7" str="// Speed of Light"/>
    <tok fileIndex="0" linenr="8" str="/*************************************************************/"/>
    <tok fileIndex="0" linenr="10" str="/*************************************************************/"/>
    <tok fileIndex="0" linenr="11" str="// Setting Parameters (Define)"/>
    <tok fileIndex="0" linenr="12" str="#"/>
    <tok fileIndex="0" linenr="12" str="define"/>
    <tok fileIndex="0" linenr="12" str="TESTVAL"/>
    <tok fileIndex="0" linenr="12" str="("/>
    <tok fileIndex="0" linenr="12" str="10"/>
    <tok fileIndex="0" linenr="12" str=")"/>
    <tok fileIndex="0" linenr="13" str="#"/>
    <tok fileIndex="0" linenr="13" str="define"/>
    <tok fileIndex="0" linenr="13" str="MAX_SV"/>
    <tok fileIndex="0" linenr="13" str="("/>
    <tok fileIndex="0" linenr="13" str="12"/>
    <tok fileIndex="0" linenr="13" str=")"/>
    <tok fileIndex="0" linenr="14" str="/*************************************************************/"/>
    <tok fileIndex="0" linenr="16" str="int"/>
    <tok fileIndex="0" linenr="16" str="main"/>
    <tok fileIndex="0" linenr="16" str="("/>
    <tok fileIndex="0" linenr="16" str=")"/>
    <tok fileIndex="0" linenr="17" str="{"/>
    <tok fileIndex="0" linenr="18" str="char"/>
    <tok fileIndex="0" linenr="18" str="BoundsCheck"/>
    <tok fileIndex="0" linenr="18" str="["/>
    <tok fileIndex="0" linenr="18" str="TESTVAL"/>
    <tok fileIndex="0" linenr="18" str="]"/>
    <tok fileIndex="0" linenr="18" str=";"/>
    <tok fileIndex="0" linenr="21" str="// Bounds Check Example"/>
    <tok fileIndex="0" linenr="22" str="for"/>
    <tok fileIndex="0" linenr="22" str="("/>
    <tok fileIndex="0" linenr="22" str="idx"/>
    <tok fileIndex="0" linenr="22" str="="/>
    <tok fileIndex="0" linenr="22" str="0"/>
    <tok fileIndex="0" linenr="22" str=";"/>
    <tok fileIndex="0" linenr="22" str="idx"/>
    <tok fileIndex="0" linenr="22" str="&lt;"/>
    <tok fileIndex="0" linenr="22" str="TESTVAL"/>
    <tok fileIndex="0" linenr="22" str=";"/>
    <tok fileIndex="0" linenr="22" str="idx"/>
    <tok fileIndex="0" linenr="22" str="++"/>
    <tok fileIndex="0" linenr="22" str=")"/>
    <tok fileIndex="0" linenr="23" str="{"/>
    <tok fileIndex="0" linenr="24" str="BoundsCheck"/>
    <tok fileIndex="0" linenr="24" str="["/>
    <tok fileIndex="0" linenr="24" str="idx"/>
    <tok fileIndex="0" linenr="24" str="]"/>
    <tok fileIndex="0" linenr="24" str="="/>
    <tok fileIndex="0" linenr="24" str="idx"/>
    <tok fileIndex="0" linenr="24" str=";"/>
    <tok fileIndex="0" linenr="25" str="}"/>
    <tok fileIndex="0" linenr="26" str="BoundsCheck"/>
    <tok fileIndex="0" linenr="26" str="["/>
    <tok fileIndex="0" linenr="26" str="TESTVAL"/>
    <tok fileIndex="0" linenr="26" str="+"/>
    <tok fileIndex="0" linenr="26" str="1"/>
    <tok fileIndex="0" linenr="26" str="]"/>
    <tok fileIndex="0" linenr="26" str="="/>
    <tok fileIndex="0" linenr="26" str="1"/>
    <tok fileIndex="0" linenr="26" str=";"/>
    <tok fileIndex="0" linenr="28" str="// Created Rule Check"/>
    <tok fileIndex="0" linenr="29" str="if"/>
    <tok fileIndex="0" linenr="29" str="("/>
    <tok fileIndex="0" linenr="29" str="p"/>
    <tok fileIndex="0" linenr="29" str=")"/>
    <tok fileIndex="0" linenr="30" str="free"/>
    <tok fileIndex="0" linenr="30" str="("/>
    <tok fileIndex="0" linenr="30" str="p"/>
    <tok fileIndex="0" linenr="30" str=")"/>
    <tok fileIndex="0" linenr="30" str=";"/>
    <tok fileIndex="0" linenr="31" str="//"/>
    <tok fileIndex="0" linenr="32" str="printf"/>
    <tok fileIndex="0" linenr="32" str="("/>
    <tok fileIndex="0" linenr="32" str="&quot;Hello World&quot;"/>
    <tok fileIndex="0" linenr="32" str=")"/>
    <tok fileIndex="0" linenr="32" str=";"/>
    <tok fileIndex="0" linenr="34" str="return"/>
    <tok fileIndex="0" linenr="34" str="0"/>
    <tok fileIndex="0" linenr="34" str=";"/>
    <tok fileIndex="0" linenr="35" str="}"/>
    <tok fileIndex="0" linenr="36" str="////////////////////////////////////////////////"/>
    <tok fileIndex="0" linenr="37" str="// Created Rule Check"/>
    <tok fileIndex="0" linenr="38" str="void"/>
    <tok fileIndex="0" linenr="38" str="f"/>
    <tok fileIndex="0" linenr="38" str="("/>
    <tok fileIndex="0" linenr="38" str=")"/>
    <tok fileIndex="0" linenr="39" str="{"/>
    <tok fileIndex="0" linenr="40" str="if"/>
    <tok fileIndex="0" linenr="40" str="("/>
    <tok fileIndex="0" linenr="40" str="p"/>
    <tok fileIndex="0" linenr="40" str=")"/>
    <tok fileIndex="0" linenr="41" str="free"/>
    <tok fileIndex="0" linenr="41" str="("/>
    <tok fileIndex="0" linenr="41" str="p"/>
    <tok fileIndex="0" linenr="41" str=")"/>
    <tok fileIndex="0" linenr="41" str=";"/>
    <tok fileIndex="0" linenr="42" str="}"/>
    <tok fileIndex="0" linenr="43" str="////////////////////////////////////////////////"/>
    <tok fileIndex="0" linenr="45" str="////////////////////////////////////////////////"/>
    <tok fileIndex="0" linenr="46" str="// Memory Leak Example"/>
    <tok fileIndex="0" linenr="47" str="void"/>
    <tok fileIndex="0" linenr="47" str="MemoryLeakTest"/>
    <tok fileIndex="0" linenr="47" str="("/>
    <tok fileIndex="0" linenr="47" str="int"/>
    <tok fileIndex="0" linenr="47" str="operand"/>
    <tok fileIndex="0" linenr="47" str=")"/>
    <tok fileIndex="0" linenr="48" str="{"/>
    <tok fileIndex="0" linenr="49" str="void"/>
    <tok fileIndex="0" linenr="49" str="*"/>
    <tok fileIndex="0" linenr="49" str="temp"/>
    <tok fileIndex="0" linenr="49" str="="/>
    <tok fileIndex="0" linenr="49" str="CreateFred"/>
    <tok fileIndex="0" linenr="49" str="("/>
    <tok fileIndex="0" linenr="49" str=")"/>
    <tok fileIndex="0" linenr="49" str=";"/>
    <tok fileIndex="0" linenr="50" str="if"/>
    <tok fileIndex="0" linenr="50" str="("/>
    <tok fileIndex="0" linenr="50" str="operand"/>
    <tok fileIndex="0" linenr="50" str="=="/>
    <tok fileIndex="0" linenr="50" str="1"/>
    <tok fileIndex="0" linenr="50" str=")"/>
    <tok fileIndex="0" linenr="51" str="{"/>
    <tok fileIndex="0" linenr="52" str="return"/>
    <tok fileIndex="0" linenr="52" str=";"/>
    <tok fileIndex="0" linenr="53" str="}"/>
    <tok fileIndex="0" linenr="54" str="DestroyFred"/>
    <tok fileIndex="0" linenr="54" str="("/>
    <tok fileIndex="0" linenr="54" str="temp"/>
    <tok fileIndex="0" linenr="54" str=")"/>
    <tok fileIndex="0" linenr="54" str=";"/>
    <tok fileIndex="0" linenr="55" str="}"/>
    <tok fileIndex="0" linenr="57" str="void"/>
    <tok fileIndex="0" linenr="57" str="*"/>
    <tok fileIndex="0" linenr="57" str="CreateFred"/>
    <tok fileIndex="0" linenr="57" str="("/>
    <tok fileIndex="0" linenr="57" str=")"/>
    <tok fileIndex="0" linenr="58" str="{"/>
    <tok fileIndex="0" linenr="59" str="return"/>
    <tok fileIndex="0" linenr="59" str="malloc"/>
    <tok fileIndex="0" linenr="59" str="("/>
    <tok fileIndex="0" linenr="59" str="100"/>
    <tok fileIndex="0" linenr="59" str=")"/>
    <tok fileIndex="0" linenr="59" str=";"/>
    <tok fileIndex="0" linenr="60" str="}"/>
    <tok fileIndex="0" linenr="62" str="void"/>
    <tok fileIndex="0" linenr="62" str="DestroyFred"/>
    <tok fileIndex="0" linenr="62" str="("/>
    <tok fileIndex="0" linenr="62" str="void"/>
    <tok fileIndex="0" linenr="62" str="*"/>
    <tok fileIndex="0" linenr="62" str="operand"/>
    <tok fileIndex="0" linenr="62" str=")"/>
    <tok fileIndex="0" linenr="63" str="{"/>
    <tok fileIndex="0" linenr="64" str="free"/>
    <tok fileIndex="0" linenr="64" str="("/>
    <tok fileIndex="0" linenr="64" str="operand"/>
    <tok fileIndex="0" linenr="64" str=")"/>
    <tok fileIndex="0" linenr="64" str=";"/>
    <tok fileIndex="0" linenr="65" str="}"/>
    <tok fileIndex="0" linenr="66" str="////////////////////////////////////////////////"/>
  </rawtokens>
<dump cfg="">
  <directivelist>
    <directive file="main.cpp" linenr="2" str="#include &lt;stdlib.h&gt;"/>
    <directive file="main.cpp" linenr="7" str="#define SOL ( 2.99792458e8)"/>
    <directive file="main.cpp" linenr="12" str="#define TESTVAL (10)"/>
    <directive file="main.cpp" linenr="13" str="#define MAX_SV (12)"/>
  </directivelist>
  <tokenlist>
    <token id="0x7fffe970d490" file="main.cpp" linenr="16" str="int" scope="0x7fffe9710280" type="name"/>
    <token id="0x7fffe970d3e0" file="main.cpp" linenr="16" str="main" scope="0x7fffe9710280" type="name" function="0x7fffe9707ee0" astParent="0x7fffe970d330"/>
    <token id="0x7fffe970d330" file="main.cpp" linenr="16" str="(" scope="0x7fffe9710280" link="0x7fffe97080b0" astOperand1="0x7fffe970d3e0" valueType-type="int" valueType-sign="signed"/>
    <token id="0x7fffe97080b0" file="main.cpp" linenr="16" str=")" scope="0x7fffe9710280" link="0x7fffe970d330"/>
    <token id="0x7fffe9708160" file="main.cpp" linenr="17" str="{" scope="0x7fffe97103f0" link="0x7fffe970acc0"/>
    <token id="0x7fffe9708210" file="main.cpp" linenr="18" str="char" scope="0x7fffe97103f0" type="name"/>
    <token id="0x7fffe97082c0" file="main.cpp" linenr="18" str="BoundsCheck" scope="0x7fffe97103f0" type="name" varId="1" variable="0x7fffe97110e0" astParent="0x7fffe9708370" valueType-type="char" valueType-sign="signed" valueType-pointer="1"/>
    <token id="0x7fffe9708370" file="main.cpp" linenr="18" str="[" scope="0x7fffe97103f0" link="0x7fffe9708580" astOperand1="0x7fffe97082c0" astOperand2="0x7fffe9708420" valueType-type="char" valueType-sign="signed" valueType-pointer="1"/>
    <token id="0x7fffe9708420" file="main.cpp" linenr="18" str="10" scope="0x7fffe97103f0" type="number" isInt="True" values="0x7fffe96fe5c0" astParent="0x7fffe9708370" valueType-type="int" valueType-sign="signed"/>
    <token id="0x7fffe9708580" file="main.cpp" linenr="18" str="]" scope="0x7fffe97103f0" link="0x7fffe9708370"/>
    <token id="0x7fffe97086e0" file="main.cpp" linenr="18" str=";" scope="0x7fffe97103f0"/>
    <token id="0x7fffe9708790" file="main.cpp" linenr="22" str="for" scope="0x7fffe97103f0" type="name" astParent="0x7fffe9708920"/>
    <token id="0x7fffe9708920" file="main.cpp" linenr="22" str="(" scope="0x7fffe97103f0" link="0x7fffe9709210" astOperand1="0x7fffe9708790" astOperand2="0x7fffe9708be0"/>
    <token id="0x7fffe97089d0" file="main.cpp" linenr="22" str="idx" scope="0x7fffe97103f0" type="name" astParent="0x7fffe9708a80"/>
    <token id="0x7fffe9708a80" file="main.cpp" linenr="22" str="=" scope="0x7fffe97103f0" type="op" isAssignmentOp="True" astParent="0x7fffe9708be0" astOperand1="0x7fffe97089d0" astOperand2="0x7fffe9708b30"/>
    <token id="0x7fffe9708b30" file="main.cpp" linenr="22" str="0" scope="0x7fffe97103f0" type="number" isInt="True" values="0x7fffe96faed0" astParent="0x7fffe9708a80" valueType-type="int" valueType-sign="signed"/>
    <token id="0x7fffe9708be0" file="main.cpp" linenr="22" str=";" scope="0x7fffe97103f0" astParent="0x7fffe9708920" astOperand1="0x7fffe9708a80" astOperand2="0x7fffe9708f50"/>
    <token id="0x7fffe9708c90" file="main.cpp" linenr="22" str="idx" scope="0x7fffe97103f0" type="name" astParent="0x7fffe9708d40"/>
    <token id="0x7fffe9708d40" file="main.cpp" linenr="22" str="&lt;" scope="0x7fffe97103f0" type="op" isComparisonOp="True" astParent="0x7fffe9708f50" astOperand1="0x7fffe9708c90" astOperand2="0x7fffe9708df0" valueType-type="bool"/>
    <token id="0x7fffe9708df0" file="main.cpp" linenr="22" str="10" scope="0x7fffe97103f0" type="number" isInt="True" values="0x7fffe96fe5a0" astParent="0x7fffe9708d40" valueType-type="int" valueType-sign="signed"/>
    <token id="0x7fffe9708f50" file="main.cpp" linenr="22" str=";" scope="0x7fffe97103f0" astParent="0x7fffe9708be0" astOperand1="0x7fffe9708d40" astOperand2="0x7fffe9709160"/>
    <token id="0x7fffe97090b0" file="main.cpp" linenr="22" str="idx" scope="0x7fffe97103f0" type="name" astParent="0x7fffe9709160"/>
    <token id="0x7fffe9709160" file="main.cpp" linenr="22" str="++" scope="0x7fffe97103f0" type="op" astParent="0x7fffe9708f50" astOperand1="0x7fffe97090b0"/>
    <token id="0x7fffe9709210" file="main.cpp" linenr="22" str=")" scope="0x7fffe97103f0" link="0x7fffe9708920"/>
    <token id="0x7fffe97092c0" file="main.cpp" linenr="23" str="{" scope="0x7fffe9710560" link="0x7fffe97098d0"/>
    <token id="0x7fffe9709370" file="main.cpp" linenr="24" str="BoundsCheck" scope="0x7fffe9710560" type="name" varId="1" variable="0x7fffe97110e0" astParent="0x7fffe97094b0" valueType-type="char" valueType-sign="signed" valueType-pointer="1"/>
    <token id="0x7fffe97094b0" file="main.cpp" linenr="24" str="[" scope="0x7fffe9710560" link="0x7fffe9709610" astParent="0x7fffe97096c0" astOperand1="0x7fffe9709370" astOperand2="0x7fffe9709560" valueType-type="char" valueType-sign="signed"/>
    <token id="0x7fffe9709560" file="main.cpp" linenr="24" str="idx" scope="0x7fffe9710560" type="name" astParent="0x7fffe97094b0"/>
    <token id="0x7fffe9709610" file="main.cpp" linenr="24" str="]" scope="0x7fffe9710560" link="0x7fffe97094b0"/>
    <token id="0x7fffe97096c0" file="main.cpp" linenr="24" str="=" scope="0x7fffe9710560" type="op" isAssignmentOp="True" astOperand1="0x7fffe97094b0" astOperand2="0x7fffe9709770" valueType-type="char" valueType-sign="signed"/>
    <token id="0x7fffe9709770" file="main.cpp" linenr="24" str="idx" scope="0x7fffe9710560" type="name" astParent="0x7fffe97096c0"/>
    <token id="0x7fffe9709820" file="main.cpp" linenr="24" str=";" scope="0x7fffe9710560"/>
    <token id="0x7fffe97098d0" file="main.cpp" linenr="25" str="}" scope="0x7fffe9710560" link="0x7fffe97092c0"/>
    <token id="0x7fffe9709980" file="main.cpp" linenr="26" str="BoundsCheck" scope="0x7fffe97103f0" type="name" varId="1" variable="0x7fffe97110e0" astParent="0x7fffe9709a30" valueType-type="char" valueType-sign="signed" valueType-pointer="1"/>
    <token id="0x7fffe9709a30" file="main.cpp" linenr="26" str="[" scope="0x7fffe97103f0" link="0x7fffe9709e50" astParent="0x7fffe9709f00" astOperand1="0x7fffe9709980" astOperand2="0x7fffe9709ae0" valueType-type="char" valueType-sign="signed"/>
    <token id="0x7fffe9709ae0" file="main.cpp" linenr="26" str="11" scope="0x7fffe97103f0" type="number" isInt="True" values="0x7fffe96fe030" astParent="0x7fffe9709a30" valueType-type="int" valueType-sign="signed"/>
    <token id="0x7fffe9709e50" file="main.cpp" linenr="26" str="]" scope="0x7fffe97103f0" link="0x7fffe9709a30"/>
    <token id="0x7fffe9709f00" file="main.cpp" linenr="26" str="=" scope="0x7fffe97103f0" type="op" isAssignmentOp="True" astOperand1="0x7fffe9709a30" astOperand2="0x7fffe9709fb0" valueType-type="char" valueType-sign="signed"/>
    <token id="0x7fffe9709fb0" file="main.cpp" linenr="26" str="1" scope="0x7fffe97103f0" type="number" isInt="True" values="0x7fffe96fe920" astParent="0x7fffe9709f00" valueType-type="int" valueType-sign="signed"/>
    <token id="0x7fffe970a060" file="main.cpp" linenr="26" str=";" scope="0x7fffe97103f0"/>
    <token id="0x7fffe970a110" file="main.cpp" linenr="29" str="if" scope="0x7fffe97103f0" type="name" astParent="0x7fffe970a1c0"/>
    <token id="0x7fffe970a1c0" file="main.cpp" linenr="29" str="(" scope="0x7fffe97103f0" link="0x7fffe970a320" astOperand1="0x7fffe970a110" astOperand2="0x7fffe970a270"/>
    <token id="0x7fffe970a270" file="main.cpp" linenr="29" str="p" scope="0x7fffe97103f0" type="name" astParent="0x7fffe970a1c0"/>
    <token id="0x7fffe970a320" file="main.cpp" linenr="29" str=")" scope="0x7fffe97103f0" link="0x7fffe970a1c0"/>
    <token id="0x7fffe970e670" file="main.cpp" linenr="29" str="{" scope="0x7fffe97106d0" link="0x7fffe970e720"/>
    <token id="0x7fffe970a3d0" file="main.cpp" linenr="30" str="free" scope="0x7fffe97106d0" type="name" astParent="0x7fffe970a480"/>
    <token id="0x7fffe970a480" file="main.cpp" linenr="30" str="(" scope="0x7fffe97106d0" link="0x7fffe970a5e0" astOperand1="0x7fffe970a3d0" astOperand2="0x7fffe970a530"/>
    <token id="0x7fffe970a530" file="main.cpp" linenr="30" str="p" scope="0x7fffe97106d0" type="name" astParent="0x7fffe970a480"/>
    <token id="0x7fffe970a5e0" file="main.cpp" linenr="30" str=")" scope="0x7fffe97106d0" link="0x7fffe970a480"/>
    <token id="0x7fffe970a690" file="main.cpp" linenr="30" str=";" scope="0x7fffe97106d0"/>
    <token id="0x7fffe970e720" file="main.cpp" linenr="30" str="}" scope="0x7fffe97106d0" link="0x7fffe970e670"/>
    <token id="0x7fffe970a740" file="main.cpp" linenr="32" str="printf" scope="0x7fffe97103f0" type="name" astParent="0x7fffe970a7f0"/>
    <token id="0x7fffe970a7f0" file="main.cpp" linenr="32" str="(" scope="0x7fffe97103f0" link="0x7fffe970a950" astOperand1="0x7fffe970a740" astOperand2="0x7fffe970a8a0" valueType-type="int" valueType-sign="signed"/>
    <token id="0x7fffe970a8a0" file="main.cpp" linenr="32" str="&quot;Hello World&quot;" scope="0x7fffe97103f0" type="string" strlen="11" values="0x7fffe96fe130" astParent="0x7fffe970a7f0" valueType-type="char" valueType-pointer="1" valueType-constness="1"/>
    <token id="0x7fffe970a950" file="main.cpp" linenr="32" str=")" scope="0x7fffe97103f0" link="0x7fffe970a7f0"/>
    <token id="0x7fffe970aa00" file="main.cpp" linenr="32" str=";" scope="0x7fffe97103f0"/>
    <token id="0x7fffe970aab0" file="main.cpp" linenr="34" str="return" scope="0x7fffe97103f0" type="name" astOperand1="0x7fffe970ab60"/>
    <token id="0x7fffe970ab60" file="main.cpp" linenr="34" str="0" scope="0x7fffe97103f0" type="number" isInt="True" values="0x7fffe96fead0" astParent="0x7fffe970aab0" valueType-type="int" valueType-sign="signed"/>
    <token id="0x7fffe970ac10" file="main.cpp" linenr="34" str=";" scope="0x7fffe97103f0"/>
    <token id="0x7fffe970acc0" file="main.cpp" linenr="35" str="}" scope="0x7fffe97103f0" link="0x7fffe9708160"/>
    <token id="0x7fffe970ad70" file="main.cpp" linenr="38" str="void" scope="0x7fffe9710280" type="name"/>
    <token id="0x7fffe970ae20" file="main.cpp" linenr="38" str="f" scope="0x7fffe9710280" type="name" function="0x7fffe9707e40" astParent="0x7fffe970aed0"/>
    <token id="0x7fffe970aed0" file="main.cpp" linenr="38" str="(" scope="0x7fffe9710280" link="0x7fffe970af80" astOperand1="0x7fffe970ae20" valueType-type="void"/>
    <token id="0x7fffe970af80" file="main.cpp" linenr="38" str=")" scope="0x7fffe9710280" link="0x7fffe970aed0"/>
    <token id="0x7fffe970b030" file="main.cpp" linenr="39" str="{" scope="0x7fffe9710840" link="0x7fffe970b710"/>
    <token id="0x7fffe970b0e0" file="main.cpp" linenr="40" str="if" scope="0x7fffe9710840" type="name" astParent="0x7fffe970b190"/>
    <token id="0x7fffe970b190" file="main.cpp" linenr="40" str="(" scope="0x7fffe9710840" link="0x7fffe970b2f0" astOperand1="0x7fffe970b0e0" astOperand2="0x7fffe970b240"/>
    <token id="0x7fffe970b240" file="main.cpp" linenr="40" str="p" scope="0x7fffe9710840" type="name" astParent="0x7fffe970b190"/>
    <token id="0x7fffe970b2f0" file="main.cpp" linenr="40" str=")" scope="0x7fffe9710840" link="0x7fffe970b190"/>
    <token id="0x7fffe970e7d0" file="main.cpp" linenr="40" str="{" scope="0x7fffe97109b0" link="0x7fffe970e880"/>
    <token id="0x7fffe970b3a0" file="main.cpp" linenr="41" str="free" scope="0x7fffe97109b0" type="name" astParent="0x7fffe970b450"/>
    <token id="0x7fffe970b450" file="main.cpp" linenr="41" str="(" scope="0x7fffe97109b0" link="0x7fffe970b5b0" astOperand1="0x7fffe970b3a0" astOperand2="0x7fffe970b500"/>
    <token id="0x7fffe970b500" file="main.cpp" linenr="41" str="p" scope="0x7fffe97109b0" type="name" astParent="0x7fffe970b450"/>
    <token id="0x7fffe970b5b0" file="main.cpp" linenr="41" str=")" scope="0x7fffe97109b0" link="0x7fffe970b450"/>
    <token id="0x7fffe970b660" file="main.cpp" linenr="41" str=";" scope="0x7fffe97109b0"/>
    <token id="0x7fffe970e880" file="main.cpp" linenr="41" str="}" scope="0x7fffe97109b0" link="0x7fffe970e7d0"/>
    <token id="0x7fffe970b710" file="main.cpp" linenr="42" str="}" scope="0x7fffe9710840" link="0x7fffe970b030"/>
    <token id="0x7fffe970b7c0" file="main.cpp" linenr="47" str="void" scope="0x7fffe9710280" type="name"/>
    <token id="0x7fffe970b870" file="main.cpp" linenr="47" str="MemoryLeakTest" scope="0x7fffe9710280" type="name" function="0x7fffe9707da0" astParent="0x7fffe970b920"/>
    <token id="0x7fffe970b920" file="main.cpp" linenr="47" str="(" scope="0x7fffe9710280" link="0x7fffe970bb30" astOperand1="0x7fffe970b870" astOperand2="0x7fffe970ba80" valueType-type="void"/>
    <token id="0x7fffe970b9d0" file="main.cpp" linenr="47" str="int" scope="0x7fffe9710280" type="name"/>
    <token id="0x7fffe970ba80" file="main.cpp" linenr="47" str="operand" scope="0x7fffe9710280" type="name" varId="2" variable="0x7fffe97111c0" astParent="0x7fffe970b920" valueType-type="int" valueType-sign="signed"/>
    <token id="0x7fffe970bb30" file="main.cpp" linenr="47" str=")" scope="0x7fffe9710280" link="0x7fffe970b920"/>
    <token id="0x7fffe970bbe0" file="main.cpp" linenr="48" str="{" scope="0x7fffe9710b20" link="0x7fffe970cc60"/>
    <token id="0x7fffe970bc90" file="main.cpp" linenr="49" str="void" scope="0x7fffe9710b20" type="name" astParent="0x7fffe970bd40"/>
    <token id="0x7fffe970bd40" file="main.cpp" linenr="49" str="*" scope="0x7fffe9710b20" type="op" isArithmeticalOp="True" astOperand1="0x7fffe970bc90" astOperand2="0x7fffe970bdf0"/>
    <token id="0x7fffe970bdf0" file="main.cpp" linenr="49" str="temp" scope="0x7fffe9710b20" type="name" varId="3" variable="0x7fffe9711150" astParent="0x7fffe970bd40" valueType-type="void" valueType-pointer="1"/>
    <token id="0x7fffe970bea0" file="main.cpp" linenr="49" str=";" scope="0x7fffe9710b20"/>
    <token id="0x7fffe970e930" file="main.cpp" linenr="49" str="temp" scope="0x7fffe9710b20" type="name" varId="3" variable="0x7fffe9711150" astParent="0x7fffe970e9e0" valueType-type="void" valueType-pointer="1"/>
    <token id="0x7fffe970e9e0" file="main.cpp" linenr="49" str="=" scope="0x7fffe9710b20" type="op" isAssignmentOp="True" astOperand1="0x7fffe970e930" astOperand2="0x7fffe970c000" valueType-type="void" valueType-pointer="1"/>
    <token id="0x7fffe970bf50" file="main.cpp" linenr="49" str="CreateFred" scope="0x7fffe9710b20" type="name" function="0x7fffe96fc6c0" astParent="0x7fffe970c000"/>
    <token id="0x7fffe970c000" file="main.cpp" linenr="49" str="(" scope="0x7fffe9710b20" link="0x7fffe970c0b0" astParent="0x7fffe970e9e0" astOperand1="0x7fffe970bf50" valueType-type="void" valueType-pointer="1"/>
    <token id="0x7fffe970c0b0" file="main.cpp" linenr="49" str=")" scope="0x7fffe9710b20" link="0x7fffe970c000"/>
    <token id="0x7fffe970c160" file="main.cpp" linenr="49" str=";" scope="0x7fffe9710b20"/>
    <token id="0x7fffe970c210" file="main.cpp" linenr="50" str="if" scope="0x7fffe9710b20" type="name" astParent="0x7fffe970c2c0"/>
    <token id="0x7fffe970c2c0" file="main.cpp" linenr="50" str="(" scope="0x7fffe9710b20" link="0x7fffe970c580" astOperand1="0x7fffe970c210" astOperand2="0x7fffe970c420"/>
    <token id="0x7fffe970c370" file="main.cpp" linenr="50" str="operand" scope="0x7fffe9710b20" type="name" varId="2" variable="0x7fffe97111c0" values="0x7fffe96fe0d0" astParent="0x7fffe970c420" valueType-type="int" valueType-sign="signed"/>
    <token id="0x7fffe970c420" file="main.cpp" linenr="50" str="==" scope="0x7fffe9710b20" type="op" isComparisonOp="True" values="0x7fffe96fbab0" astParent="0x7fffe970c2c0" astOperand1="0x7fffe970c370" astOperand2="0x7fffe970c4d0" valueType-type="bool"/>
    <token id="0x7fffe970c4d0" file="main.cpp" linenr="50" str="1" scope="0x7fffe9710b20" type="number" isInt="True" values="0x7fffe96f8c40" astParent="0x7fffe970c420" valueType-type="int" valueType-sign="signed"/>
    <token id="0x7fffe970c580" file="main.cpp" linenr="50" str=")" scope="0x7fffe9710b20" link="0x7fffe970c2c0"/>
    <token id="0x7fffe970c630" file="main.cpp" linenr="51" str="{" scope="0x7fffe9710c90" link="0x7fffe970c840"/>
    <token id="0x7fffe970c6e0" file="main.cpp" linenr="52" str="return" scope="0x7fffe9710c90" type="name"/>
    <token id="0x7fffe970c790" file="main.cpp" linenr="52" str=";" scope="0x7fffe9710c90"/>
    <token id="0x7fffe970c840" file="main.cpp" linenr="53" str="}" scope="0x7fffe9710c90" link="0x7fffe970c630"/>
    <token id="0x7fffe970c8f0" file="main.cpp" linenr="54" str="DestroyFred" scope="0x7fffe9710b20" type="name" function="0x7fffe96f6e40" astParent="0x7fffe970c9a0"/>
    <token id="0x7fffe970c9a0" file="main.cpp" linenr="54" str="(" scope="0x7fffe9710b20" link="0x7fffe970cb00" astOperand1="0x7fffe970c8f0" astOperand2="0x7fffe970ca50" valueType-type="void"/>
    <token id="0x7fffe970ca50" file="main.cpp" linenr="54" str="temp" scope="0x7fffe9710b20" type="name" varId="3" variable="0x7fffe9711150" astParent="0x7fffe970c9a0" valueType-type="void" valueType-pointer="1"/>
    <token id="0x7fffe970cb00" file="main.cpp" linenr="54" str=")" scope="0x7fffe9710b20" link="0x7fffe970c9a0"/>
    <token id="0x7fffe970cbb0" file="main.cpp" linenr="54" str=";" scope="0x7fffe9710b20"/>
    <token id="0x7fffe970cc60" file="main.cpp" linenr="55" str="}" scope="0x7fffe9710b20" link="0x7fffe970bbe0"/>
    <token id="0x7fffe970cd10" file="main.cpp" linenr="57" str="void" scope="0x7fffe9710280" type="name" astParent="0x7fffe970cdc0"/>
    <token id="0x7fffe970cdc0" file="main.cpp" linenr="57" str="*" scope="0x7fffe9710280" type="op" isArithmeticalOp="True" astOperand1="0x7fffe970cd10" astOperand2="0x7fffe970cf20"/>
    <token id="0x7fffe970ce70" file="main.cpp" linenr="57" str="CreateFred" scope="0x7fffe9710280" type="name" function="0x7fffe96fc6c0" astParent="0x7fffe970cf20"/>
    <token id="0x7fffe970cf20" file="main.cpp" linenr="57" str="(" scope="0x7fffe9710280" link="0x7fffe970cfd0" astParent="0x7fffe970cdc0" astOperand1="0x7fffe970ce70" valueType-type="void" valueType-pointer="1"/>
    <token id="0x7fffe970cfd0" file="main.cpp" linenr="57" str=")" scope="0x7fffe9710280" link="0x7fffe970cf20"/>
    <token id="0x7fffe970d080" file="main.cpp" linenr="58" str="{" scope="0x7fffe9710e00" link="0x7fffe970d800"/>
    <token id="0x7fffe970d130" file="main.cpp" linenr="59" str="return" scope="0x7fffe9710e00" type="name" astOperand1="0x7fffe970d540"/>
    <token id="0x7fffe970d1e0" file="main.cpp" linenr="59" str="malloc" scope="0x7fffe9710e00" type="name" astParent="0x7fffe970d540"/>
    <token id="0x7fffe970d540" file="main.cpp" linenr="59" str="(" scope="0x7fffe9710e00" link="0x7fffe970d6a0" astParent="0x7fffe970d130" astOperand1="0x7fffe970d1e0" astOperand2="0x7fffe970d5f0" valueType-type="void" valueType-pointer="1"/>
    <token id="0x7fffe970d5f0" file="main.cpp" linenr="59" str="100" scope="0x7fffe9710e00" type="number" isInt="True" values="0x7fffe9703f00" astParent="0x7fffe970d540" valueType-type="int" valueType-sign="signed"/>
    <token id="0x7fffe970d6a0" file="main.cpp" linenr="59" str=")" scope="0x7fffe9710e00" link="0x7fffe970d540"/>
    <token id="0x7fffe970d750" file="main.cpp" linenr="59" str=";" scope="0x7fffe9710e00"/>
    <token id="0x7fffe970d800" file="main.cpp" linenr="60" str="}" scope="0x7fffe9710e00" link="0x7fffe970d080"/>
    <token id="0x7fffe970d8b0" file="main.cpp" linenr="62" str="void" scope="0x7fffe9710280" type="name"/>
    <token id="0x7fffe970d960" file="main.cpp" linenr="62" str="DestroyFred" scope="0x7fffe9710280" type="name" function="0x7fffe96f6e40" astParent="0x7fffe970da10"/>
    <token id="0x7fffe970da10" file="main.cpp" linenr="62" str="(" scope="0x7fffe9710280" link="0x7fffe970dcd0" astOperand1="0x7fffe970d960" astOperand2="0x7fffe970db70" valueType-type="void"/>
    <token id="0x7fffe970dac0" file="main.cpp" linenr="62" str="void" scope="0x7fffe9710280" type="name" astParent="0x7fffe970db70"/>
    <token id="0x7fffe970db70" file="main.cpp" linenr="62" str="*" scope="0x7fffe9710280" type="op" isArithmeticalOp="True" astParent="0x7fffe970da10" astOperand1="0x7fffe970dac0" astOperand2="0x7fffe970dc20"/>
    <token id="0x7fffe970dc20" file="main.cpp" linenr="62" str="operand" scope="0x7fffe9710280" type="name" varId="4" variable="0x7fffe9711230" astParent="0x7fffe970db70" valueType-type="void" valueType-pointer="1"/>
    <token id="0x7fffe970dcd0" file="main.cpp" linenr="62" str=")" scope="0x7fffe9710280" link="0x7fffe970da10"/>
    <token id="0x7fffe970dd80" file="main.cpp" linenr="63" str="{" scope="0x7fffe9710f70" link="0x7fffe970e1a0"/>
    <token id="0x7fffe970de30" file="main.cpp" linenr="64" str="free" scope="0x7fffe9710f70" type="name" astParent="0x7fffe970dee0"/>
    <token id="0x7fffe970dee0" file="main.cpp" linenr="64" str="(" scope="0x7fffe9710f70" link="0x7fffe970e040" astOperand1="0x7fffe970de30" astOperand2="0x7fffe970df90"/>
    <token id="0x7fffe970df90" file="main.cpp" linenr="64" str="operand" scope="0x7fffe9710f70" type="name" varId="4" variable="0x7fffe9711230" astParent="0x7fffe970dee0" valueType-type="void" valueType-pointer="1"/>
    <token id="0x7fffe970e040" file="main.cpp" linenr="64" str=")" scope="0x7fffe9710f70" link="0x7fffe970dee0"/>
    <token id="0x7fffe970e0f0" file="main.cpp" linenr="64" str=";" scope="0x7fffe9710f70"/>
    <token id="0x7fffe970e1a0" file="main.cpp" linenr="65" str="}" scope="0x7fffe9710f70" link="0x7fffe970dd80"/>
  </tokenlist>
  <scopes>
    <scope id="0x7fffe9710280" type="Global">
      <functionList>
        <function id="0x7fffe9707ee0" tokenDef="0x7fffe970d3e0" name="main"/>
        <function id="0x7fffe9707e40" tokenDef="0x7fffe970ae20" name="f"/>
        <function id="0x7fffe9707da0" tokenDef="0x7fffe970b870" name="MemoryLeakTest">
          <arg nr="1" variable="0x7fffe97111c0"/>
        </function>
        <function id="0x7fffe96fc6c0" tokenDef="0x7fffe970ce70" name="CreateFred"/>
        <function id="0x7fffe96f6e40" tokenDef="0x7fffe970d960" name="DestroyFred">
          <arg nr="1" variable="0x7fffe9711230"/>
        </function>
      </functionList>
    </scope>
    <scope id="0x7fffe97103f0" type="Function" className="main" classStart="0x7fffe9708160" classEnd="0x7fffe970acc0" nestedIn="0x7fffe9710280" function="0x7fffe9707ee0">
      <varlist>
        <var id="0x7fffe97110e0"/>
      </varlist>
    </scope>
    <scope id="0x7fffe9710560" type="For" classStart="0x7fffe97092c0" classEnd="0x7fffe97098d0" nestedIn="0x7fffe97103f0"/>
    <scope id="0x7fffe97106d0" type="If" classStart="0x7fffe970e670" classEnd="0x7fffe970e720" nestedIn="0x7fffe97103f0"/>
    <scope id="0x7fffe9710840" type="Function" className="f" classStart="0x7fffe970b030" classEnd="0x7fffe970b710" nestedIn="0x7fffe9710280" function="0x7fffe9707e40"/>
    <scope id="0x7fffe97109b0" type="If" classStart="0x7fffe970e7d0" classEnd="0x7fffe970e880" nestedIn="0x7fffe9710840"/>
    <scope id="0x7fffe9710b20" type="Function" className="MemoryLeakTest" classStart="0x7fffe970bbe0" classEnd="0x7fffe970cc60" nestedIn="0x7fffe9710280" function="0x7fffe9707da0">
      <varlist>
        <var id="0x7fffe9711150"/>
      </varlist>
    </scope>
    <scope id="0x7fffe9710c90" type="If" classStart="0x7fffe970c630" classEnd="0x7fffe970c840" nestedIn="0x7fffe9710b20"/>
    <scope id="0x7fffe9710e00" type="Function" className="CreateFred" classStart="0x7fffe970d080" classEnd="0x7fffe970d800" nestedIn="0x7fffe9710280" function="0x7fffe96fc6c0"/>
    <scope id="0x7fffe9710f70" type="Function" className="DestroyFred" classStart="0x7fffe970dd80" classEnd="0x7fffe970e1a0" nestedIn="0x7fffe9710280" function="0x7fffe96f6e40"/>
  </scopes>
  <variables>
    <var id="0x7fffe97110e0" nameToken="0x7fffe97082c0" typeStartToken="0x7fffe9708210" typeEndToken="0x7fffe9708210" isArgument="false" isArray="true" isClass="false" isExtern="false" isLocal="true" isPointer="false" isReference="false" isStatic="false" access="Local"/>
    <var id="0x7fffe97111c0" nameToken="0x7fffe970ba80" typeStartToken="0x7fffe970b9d0" typeEndToken="0x7fffe970b9d0" isArgument="true" isArray="false" isClass="false" isExtern="false" isLocal="false" isPointer="false" isReference="false" isStatic="false" access="Argument"/>
    <var id="0x7fffe9711150" nameToken="0x7fffe970bdf0" typeStartToken="0x7fffe970bc90" typeEndToken="0x7fffe970bd40" isArgument="false" isArray="false" isClass="false" isExtern="false" isLocal="true" isPointer="true" isReference="false" isStatic="false" access="Local"/>
    <var id="0x7fffe9711230" nameToken="0x7fffe970dc20" typeStartToken="0x7fffe970dac0" typeEndToken="0x7fffe970db70" isArgument="true" isArray="false" isClass="false" isExtern="false" isLocal="false" isPointer="true" isReference="false" isStatic="false" access="Argument"/>
  </variables>
  <valueflow>
    <values id="0x7fffe96fe5c0">
      <value intvalue="10" known="true"/>
    </values>
    <values id="0x7fffe96faed0">
      <value intvalue="0" known="true"/>
    </values>
    <values id="0x7fffe96fe5a0">
      <value intvalue="10" known="true"/>
    </values>
    <values id="0x7fffe96fe030">
      <value intvalue="11" known="true"/>
    </values>
    <values id="0x7fffe96fe920">
      <value intvalue="1" known="true"/>
    </values>
    <values id="0x7fffe96fe130">
      <value tokvalue="0x7fffe970a8a0" known="true"/>
    </values>
    <values id="0x7fffe96fead0">
      <value intvalue="0" known="true"/>
    </values>
    <values id="0x7fffe96fe0d0">
      <value intvalue="1" condition-line="50" possible="true"/>
    </values>
    <values id="0x7fffe96fbab0">
      <value intvalue="1" condition-line="50" possible="true"/>
    </values>
    <values id="0x7fffe96f8c40">
      <value intvalue="1" known="true"/>
    </values>
    <values id="0x7fffe9703f00">
      <value intvalue="100" known="true"/>
    </values>
  </valueflow>
</dump>
</dumps>
