{
  "users": [
    {
      "name": "MS Dhoni",
      "username": "dhoni",
      "email": "msdhoni@gmail.com",
      "phone": "4563214530",
      "id": 1
    },
    {
      "name": "Mohd Shami",
      "username": "mohdshami",
      "email": "shami@gmail.com",
      "phone": "7896547896",
      "id": 4
    },
    {
      "name": "KL Rahul",
      "username": "klrahul",
      "email": "rahul@gmail.com",
      "phone": "7458965874",
      "id": 5
    },
    {
      "name": "youssef",
      "username": "dhawansikhar",
      "email": "dhawan@gmail.com",
      "phone": "456987456000003",
      "id": 6
    },
    {
      "name": "Ben Nejah Youssef",
      "username": "sssssssss",
      "email": "youssefbennajeh111@gmail.com",
      "phone": "0000003",
      "id": 7
    }
  ]
}