{
  "inactive": [
    "To Do",
    "ToDo",
    "Blocked",
    "blocked",
    "todo",
    "to do",
    "Reading",
    "done",
    "Done"
  ],
  "active": [
    "Doing",
    "Assigned",
    "in progress",
    "In Progress",
    "Validation",
    "validation"
  ]
}
