{
    "redis": {
        "host": "rover-core",
        "port": 6379,
        "topic": "video0",
        "name": "video0-src"
    },
    "stream": {
        "fps": 20,
        "device": 0,
        "width": 320,
        "height": 240,
        "saturation": 0.5
    }
}