{
  "notes": [
    {
      "title": "Yoshi's birthday bash",
      "details": "Lorem Ipsum is simply dummy text of the printing and typesetting industry. Lorem Ipsum has been the industry's standard dummy text ever since the 1500s, when an unknown printer took a galley of type and scrambled it to make a type specimen book.",
      "category": "reminders",
      "id": 1
    },
    {
      "title": "Complete my ninja training",
      "details": "Lorem Ipsum is simply dummy text of the printing and typesetting industry. Lorem Ipsum has been the industry's standard dummy text ever since the 1500s, when an unknown printer took.",
      "category": "work",
      "id": 2
    },
    {
      "title": "Order a pizza!",
      "details": "Lorem Ipsum is simply dummy text of the printing and typesetting industry. Lorem Ipsum has been the industry's standard dummy text ever since the 1500s, when an unknown printer took a galley of type and scrambled it to make a type specimen book.\nLorem Ipsum is simply dummy text of the printing and typesetting industry. Lorem Ipsum has been the industry's standard dummy text ever since the 1500s, when an unknown printer took a galley of type and scrambled it to make a type specimen book.",
      "category": "todos",
      "id": 3
    },
    {
      "title": "SHASHI",
      "details": "ASDFDAF",
      "category": "remainders",
      "id": 6
    },
    {
      "title": "GFD",
      "details": "BVCBV  BCBVCGCGD BCBCG",
      "category": "todos",
      "id": 7
    }
  ]
}