,Year,Coal (terawatt-hours),Solar (terawatt-hours),Crude oil (terawatt-hours),Natural gas (terawatt-hours),Traditional biofuels (terawatt-hours),Other renewables (terawatt-hours),Hydropower (terawatt-hours),Nuclear (terawatt-hours),Wind (terawatt-hours)
0,1800,97.2223,0.0,0.0,0.0,5555.555556,0.0,0.0,0.0,0.0
1,1810,127.77788000000001,0.0,0.0,0.0,5833.333333,0.0,0.0,0.0,0.0
2,1820,152.7779,0.0,0.0,0.0,6111.111111,0.0,0.0,0.0,0.0
3,1830,263.8891,0.0,0.0,0.0,6388.888889,0.0,0.0,0.0,0.0
4,1840,355.55584,0.0,0.0,0.0,6944.444444,0.0,0.0,0.0,0.0
5,1850,569.4449,0.0,0.0,0.0,7222.222222,0.0,0.0,0.0,0.0
6,1860,1061.11196,0.0,0.0,0.0,6944.444444,0.0,0.0,0.0,0.0
7,1870,1641.6679800000002,0.0,5.55556,0.0,6944.444444,0.0,0.0,0.0,0.0
8,1880,2541.6687,0.0,33.33336,0.0,6944.444444,0.0,0.0,0.0,0.0
9,1890,3855.5586399999997,0.0,88.88896,33.33336,6666.666667,0.0,13.88888889,0.0,0.0
10,1900,5727.78236,0.0,180.5557,63.888940000000005,6111.111111,0.0,16.66666667,0.0,0.0
11,1910,8655.56248,0.0,397.22254,141.66678000000002,6388.888889,0.0,33.33333333,0.0,0.0
12,1920,9833.3412,0.0,888.8896,233.33352000000002,6944.444444,0.0,63.88888889,0.0,0.0
13,1930,10125.0081,0.0,1755.5569600000001,602.7782599999999,7222.222222,0.0,130.5555556,0.0,0.0
14,1940,11586.12038,0.0,2652.7799,875.0007,7222.222222,0.0,191.66666669999998,0.0,0.0
15,1950,12602.787859999999,0.0,5444.4488,2091.6683399999997,7500.0,0.0,333.3333333,0.0,0.0
16,1960,15441.67902,0.0,11097.2311,4472.2258,8888.888889,0.0,688.8888889,0.0,0.0
17,1965,16151.960169999998,0.0,18054.69004,6306.370076,9162.456946,17.9852321,919.7702757000001,25.78689584,0.0
18,1966,16332.016790000001,0.0,19442.23715,6871.686791,9218.172711,19.8060069,986.2858717,34.57627093,0.0
19,1967,16071.181190000001,0.0,20830.13575,7377.525476000001,9274.227277,19.98657074,1009.244569,42.4078552,0.0
20,1968,16312.605759999999,0.0,22613.21746,8046.478672,9330.622704000001,22.1200451,1059.06286,52.52310447,0.0
21,1969,16825.99292,0.0,24534.98916,8835.591838,9387.361065000001,23.25796438,1122.442526,63.43876256,0.0
22,1970,17065.27113,0.0,26649.8116,9614.414364,9444.444444,25.69319599,1174.560348,78.40661173,0.0
23,1971,16971.04648,0.0,28233.716119999997,10289.89468,9498.581964,27.87916846,1221.63273,110.0047304,0.0
24,1972,17161.86462,0.0,30399.209810000004,10858.55694,9553.029811,29.87710082,1276.766396,150.89707280000002,0.0
25,1973,17673.14043,0.0,32775.00958,11374.03922,9607.789765000001,32.08492382,1292.752251,202.6554947,0.0
26,1974,17687.80045,0.0,32299.54837,11652.60482,9662.863614,33.95881358,1419.0467210000002,263.3878734,0.0
27,1975,18031.66073,0.0,31973.184889999997,11657.597170000001,9718.253158,34.48367863,1440.451903,364.3608367,0.0
28,1976,18688.421290000002,0.0,34064.96456,12350.85663,9773.960206,38.46095587,1435.228335,433.39284979999996,0.0
29,1977,19241.4531,0.0,35224.407589999995,12756.89778,9829.986579,40.56255723,1472.559263,535.421645,0.0
30,1978,19456.78595,0.0,36354.280569999995,13291.68232,9886.334106,42.96747784,1588.704502,619.3130172,0.0
31,1979,20359.510440000002,0.0,36953.1491,14121.9509,9943.00463,46.16932882,1667.584671,639.6327497000001,0.0
32,1980,20856.53098,0.0,35506.32689,14238.319619999998,10000.0,49.38536385,1698.609443,711.3538907999999,0.0
33,1981,21148.797019999998,0.0,34228.87205,14395.89609,10105.91751,53.15454248,1725.2327460000001,835.9370357,0.0
34,1982,21384.22049,0.0,33177.85701,14473.226340000001,10212.95688,61.37055642,1796.8831719999998,916.6454617,0.0
35,1983,22040.194209999998,0.0,32981.31709,14706.113309999999,10321.12997,68.01793274,1879.268978,1029.398713,0.0
36,1984,22997.472530000003,0.0,33746.54047,15912.38739,10430.44881,76.00921831,1941.059184,1244.32029,0.0
37,1985,23906.3229,0.0,33792.84203,16263.140140000001,10540.92553,77.79223118,1979.586782,1489.132866,0.064220202
38,1986,24182.95534,0.0,34819.31693,16421.36448,10652.572390000001,85.57913281,2006.7196940000001,1594.9493439999999,0.138831313
39,1987,25145.102280000003,0.0,35532.11408,17289.17958,10765.40179,91.64285434,2034.519979,1734.9467960000002,0.195376768
40,1988,25889.97449,0.0,36735.8996,18083.522409999998,10879.42625,94.28072727,2099.1129300000002,1891.4868399999998,0.331579798
41,1989,26152.07667,0.0,37343.112389999995,18902.85595,10994.65842,104.03431280000001,2086.5426399999997,1945.242865,2.649776768
42,1990,25845.88485,0.0,37736.94729,19486.645419999997,11111.11111,116.4628246,2161.045291,2000.642591,3.632470516
43,1991,25561.41954,0.505223075,37763.148239999995,19984.586769999998,11242.7549,121.41227009999999,2213.1109149999997,2096.356868,4.086706675
44,1992,25478.81089,0.468615413,38422.53103,20076.920980000003,11375.95839,130.3448548,2211.5031670000003,2112.277946,4.733212019
45,1993,25580.921440000002,0.556737928,38179.42324,20275.09431,11510.74008,134.7069628,2344.2661359999997,2185.016841,5.697568819
46,1994,25729.64169,0.60006443,39021.80173,20405.363419999998,11647.11865,139.80040290000002,2359.685227,2226.0507829999997,7.122929844
47,1995,25867.8533,0.640874386,39555.43054,21121.78818,11785.11302,145.59588109999999,2488.983207,2322.5924219999997,8.261923443999999
48,1996,26516.28457,0.7052786790000001,40480.1731,22143.41796,11924.74234,149.6884804,2523.481143,2407.002623,9.204610762
49,1997,26549.71899,0.7566554990000001,41544.67299,22082.053190000002,12066.02598,160.95280630000002,2569.633113,2390.480054,12.01757667
50,1998,26351.79429,0.8802895009999999,41768.48384,22485.93806,12208.98355,168.45487119999999,2590.551798,2431.571247,15.91490057
51,1999,26492.77461,0.965823997,42510.09274,23107.57158,12414.05573,177.1371664,2608.338262,2524.5468170000004,21.21534431
52,2000,27403.94562,1.1779355759999999,43038.620010000006,24019.89227,12500.0,185.27220280000003,2654.953445,2580.976669,31.41996387
53,2001,27851.053710000004,1.463956125,43421.10755,24367.11133,12500.0,191.0179267,2586.668594,2653.821898,38.39098735
54,2002,28936.6423,1.831247734,43796.55068,25108.12839,12470.0,205.6996386,2633.835653,2696.204132,52.33180737
55,2003,31475.583339999997,2.3293707,44803.21017,25769.175519999997,12328.70237,217.2027959,2629.430399,2641.599256,62.91691456
56,2004,33656.311089999996,3.054656084,46503.96733,26752.16794,12159.75217,234.3682046,2808.226932,2757.124087,85.11605376
57,2005,36118.94545,4.249617768999999,47115.72728,27537.090989999997,12076.14729,254.3922875,2918.0648309999997,2769.0469420000004,104.08683590000001
58,2006,37979.81684,5.818328387,47732.19992,28347.57835,11993.117240000001,271.76335510000007,3030.307944,2803.605088,132.8592792
59,2007,40143.91171,7.864870878,48471.73162,29580.250969999997,11910.65806,294.2977297,3079.79887,2746.479825,170.6860872
60,2008,40712.5427,12.72162081,48250.642289999996,30321.378360000002,11828.76583,314.3656167,3263.589026,2737.860822,220.5696719
61,2009,40088.33994,21.09259048,47422.36853,29477.9263,11747.43666,338.2157334,3253.6011710000002,2699.245242,275.92926580000005
62,2010,41932.74507,33.82948514,48949.720460000004,31759.124219999998,11666.66667,378.0383427,3435.9055810000004,2767.507814,341.5652412
63,2011,43948.96889,65.21188479,49455.27172,32410.44868,11553.3766,397.45466760000005,3503.2270909999997,2651.771616,436.80344289999994
64,2012,44129.62497,100.9252749,50065.864989999995,33270.53388,11441.18663,430.3624386,3671.297583,2472.44864,523.8148612
65,2013,44953.01385,139.0442186,50698.38455,33714.94785,11330.0861,463.98250189999993,3797.954118,2491.705601,645.7219776000001
66,2014,44916.837810000005,197.6716635,51109.97172,33986.84723,11220.06442,504.3899227,3887.930335,2541.027341,712.4070431
67,2015,43786.8458,260.0058008,52053.27008,34741.88349,11111.11111,538.2067786,3891.408797,2575.664304,831.8262454
68,2016,43101.23216,328.18269639999994,53001.86598,35741.82987,11003.2158,556.9861292,4036.073668,2612.8328300000003,959.4687162999999
69,2017,43397.13549,442.6183606000001,53752.276379999996,36703.96587,10895.32049,586.1710901,4059.868393,2635.561104,1122.74585
