,Year,Daily caloric supply (kcal/person/day)
0,1270,1531.0
1,1300,1381.0
2,1310,1334.0
3,1380,2042.0
4,1420,1760.0
5,1450,1823.0
6,1600,1877.0
7,1700,2229.0
8,1705,1657.0
9,1750,2237.0
10,1787,1915.0
11,1800,2456.8
12,1810,2367.5
13,1812,2248.0
14,1820,2591.6666666666665
15,1830,2503.0
16,1837,1974.0
17,1840,2680.0
18,1846,2238.5
19,1850,2748.2
20,1860,2521.8571428571427
21,1863,2395.0
22,1870,2777.4
23,1880,2778.5714285714284
24,1890,2886.0
25,1900,3085.6
26,1910,3108.8571428571427
27,1920,3196.0
28,1930,2945.4
29,1934,2013.3333333333333
30,1940,3180.0
31,1946,1950.0
32,1947,2386.88
33,1948,2560.815789473684
34,1950,3160.0
35,1952,1861.0
36,1953,1879.0
37,1954,1895.0
38,1955,2005.0
39,1956,2051.0
40,1957,2045.0
41,1958,2053.0
42,1959,1722.0
43,1960,1453.0
44,1961,2346.4827586206898
45,1962,2373.7241379310344
46,1963,2385.477011494253
47,1964,2411.310344827586
48,1965,2430.2011494252874
49,1966,2440.2471264367814
50,1967,2455.103448275862
51,1968,2476.9942528735633
52,1969,2491.816091954023
53,1970,2512.32183908046
54,1971,2519.3735632183907
55,1972,2501.074712643678
56,1973,2517.8793103448274
57,1974,2526.4712643678163
58,1975,2523.2471264367814
59,1976,2554.6264367816093
60,1977,2558.390804597701
61,1978,2586.367816091954
62,1979,2603.706896551724
63,1980,2624.137931034483
64,1981,2627.7241379310344
65,1982,2630.862068965517
66,1983,2632.614942528736
67,1984,2645.229885057471
68,1985,2654.367816091954
69,1986,2660.764367816092
70,1987,2674.0919540229884
71,1988,2680.67816091954
72,1989,2676.103448275862
73,1990,2658.154285714286
74,1991,2623.4114285714286
75,1992,2589.932584269663
76,1993,2585.63687150838
77,1994,2598.4189944134077
78,1995,2610.6424581005585
79,1996,2626.27374301676
80,1997,2636.7374301675977
81,1998,2647.167597765363
82,1999,2663.027932960894
83,2000,2677.1944444444443
84,2001,2695.1944444444443
85,2002,2710.1388888888887
86,2003,2719.7277777777776
87,2004,2740.133333333333
88,2005,2757.0555555555557
89,2006,2775.4309392265195
90,2007,2795.07182320442
91,2008,2804.193370165746
92,2009,2812.3701657458564
93,2010,2823.596685082873
94,2011,2836.9
95,2012,2844.0055555555555
96,2013,2857.5555555555557
