---	A0A803KHH7,XP_004915002.1,XM_004914945.4,GeneID:101730350,NA
+++	A0A803KHH7,XP_004915002.1,XM_004914945.4,GeneID:101730350,XB-GENE-976744
---	A0A8J1ISW0,XP_031748683.1,XM_031892823.1,GeneID:116407506,NA
+++	A0A8J1ISW0,XP_031748683.1,XM_031892823.1,GeneID:116407506,XB-GENE-29100087
---	A0A8J1J214,XP_031748118.1,XM_031892258.1,GeneID:101733413,NA
+++	A0A8J1J214,XP_031748118.1,XM_031892258.1,GeneID:101733413,XB-GENE-29100091
---	A0A8J1J6E9,XP_031752600.1,XM_031896740.1,GeneID:108645187,NA
+++	A0A8J1J6E9,XP_031752600.1,XM_031896740.1,GeneID:108645187,XB-GENE-29100095
---	A0A8J1JPY0,XP_031759932.1,XM_031904072.1,GeneID:101735026,NA
+++	A0A8J1JPY0,XP_031759932.1,XM_031904072.1,GeneID:101735026,XB-GENE-29100099
---	A0A8J1JXT4,XP_031762703.1,XM_031906843.1,GeneID:100489535,NA
+++	A0A8J1JXT4,XP_031762703.1,XM_031906843.1,GeneID:100489535,XB-GENE-29100103
---	A0A8J1JXU8,XP_031762722.1,XM_031906862.1,GeneID:116412613,NA
+++	A0A8J1JXU8,XP_031762722.1,XM_031906862.1,GeneID:116412613,XB-GENE-29100107
---	A0A8J1K1Y7,XP_031762696.1,XM_031906836.1,GeneID:100494497,NA
+++	A0A8J1K1Y7,XP_031762696.1,XM_031906836.1,GeneID:100494497,XB-GENE-29100111
---	A0A8J1K207,XP_031762716.1,XM_031906856.1,GeneID:116412612,NA
+++	A0A8J1K207,XP_031762716.1,XM_031906856.1,GeneID:116412612,XB-GENE-29100115
---	A0A8J1K221,XP_031762726.1,XM_031906866.1,GeneID:116412614,NA
+++	A0A8J1K221,XP_031762726.1,XM_031906866.1,GeneID:116412614,XB-GENE-2910011
---	F7CLS9,XP_004915001.2,XM_004914944.4,GeneID:101730350,NA
+++	F7CLS9,XP_004915001.2,XM_004914944.4,GeneID:101730350,XB-GENE-976744
---	Q5G7I8,YP_203372.1,COX1,GeneID:3283494,NA
+++	Q5G7I8,YP_203372.1,COX1,GeneID:3283494,XB-GENE-5868906
