SymbolChange[A0A8J0SQR9]	uniprot2023_01=LOC100489483	uniprot2023_02=btnl10.2
SymbolChange[A0A8J1IRR7,A4IGN3]	uniprot2023_01=NA,c2orf76	uniprot2023_02=NA,c9h2orf76
TypeChange[art1|Q08CZ9]	uniprot2023_01=type=main;tr	uniprot2023_02=type=additional;tr
SymbolChange[A0A7D9NJS6]	uniprot2023_01=spring1	uniprot2023_02=whrn
SymbolChange[Q640T3]	uniprot2023_01=tmtc1	uniprot2023_02=anxa5
SymbolChange[A0A8J0SNC8]	uniprot2023_01=mpp6	uniprot2023_02=pals2
SymbolChange[Q05AZ2]	uniprot2023_01=plvap	uniprot2023_02=rab9a
SymbolChange[Q28EK0]	uniprot2023_01=nudt6	uniprot2023_02=rgr
TypeChange[LOC100488099|A0A6I8S0R7]	uniprot2023_01=type=main;tr	uniprot2023_02=type=additional;tr
SymbolChange[A0A7D9NJS9]	uniprot2023_01=cryba4	uniprot2023_02=med4
SymbolChange[A0A7D9NLI1]	uniprot2023_01=socs2	uniprot2023_02=tbx5
SymbolChange[A0A803JYP4]	uniprot2023_01=rarres1	uniprot2023_02=lxn
SymbolChange[A0A8J0SE61]	uniprot2023_01=smim11a	uniprot2023_02=smim11
SymbolChange[F7ABL8]	uniprot2023_01=mettl11b	uniprot2023_02=ntmt2
SymbolChange[A0A7D9NJW2]	uniprot2023_01=prtn3	uniprot2023_02=kmt2b
SymbolChange[A0A8J0SUT4]	uniprot2023_01=LOC100144286	uniprot2023_02=XB5730431
SymbolChange[A0A7D9NLF9]	uniprot2023_01=znf160	uniprot2023_02=qrich1l
SymbolChange[A0A7D9NLG4]	uniprot2023_01=vrk3	uniprot2023_02=lvrn
TypeChange[brpf3|B5DDZ6]	uniprot2023_01=type=main;tr	uniprot2023_02=type=additional;tr
SymbolChange[Q28IS1]	uniprot2023_01=tas2r39	uniprot2023_02=pik3r3
SymbolChange[Q6P872]	uniprot2023_01=cdca7l	uniprot2023_02=sf3b4
SymbolChange[A0A8J0QYZ5]	uniprot2023_01=LOC100492352	uniprot2023_02=XB940382
SymbolChange[Q5G7H9]	uniprot2023_01=nd6	uniprot2023_02=mt-nd6
SymbolChange[A0A803JAM7]	uniprot2023_01=cxcl8	uniprot2023_02=cxcl8a.1
SymbolChange[A0A8J0SZ90]	uniprot2023_01=LOC100495603	uniprot2023_02=XB5795725
SymbolChange[Q5BL93]	uniprot2023_01=palm	uniprot2023_02=plek
SymbolChange[A0A8J0QSQ5]	uniprot2023_01=LOC100497492	uniprot2023_02=XB17329844
SymbolChange[Q5FWR5]	uniprot2023_01=MGC108117	uniprot2023_02=bpi
SymbolChange[A0A8J0QSF5]	uniprot2023_01=LOC100486185	uniprot2023_02=XB5957062
SymbolChange[F6ZX65]	uniprot2023_01=XB5856846	uniprot2023_02=LOC100493464
SymbolChange[A0A7D9NLB8]	uniprot2023_01=wwtr1	uniprot2023_02=slain2
SymbolChange[Q0D2D1]	uniprot2023_01=kpna6	uniprot2023_02=lrrn3
SymbolChange[Q28EA1]	uniprot2023_01=tada2b	uniprot2023_02=dnajc28
SymbolChange[A0A7D9NLS1]	uniprot2023_01=rgmb	uniprot2023_02=acacb
SymbolChange[A0A8J0SXH5]	uniprot2023_01=LOC100498371	uniprot2023_02=XB5959262
SymbolChange[F6VZI1]	uniprot2023_01=piwil3	uniprot2023_02=piwil1
SymbolChange[B0BM51]	uniprot2023_01=gpr26	uniprot2023_02=XB5772073
SymbolChange[E1CHM3]	uniprot2023_01=mblac1	uniprot2023_02=wwtr1
SymbolChange[Q66KD7]	uniprot2023_01=piezo1	uniprot2023_02=aprt
TypeChange[XB5857145|A0A6I8RMV7]	uniprot2023_01=type=main;tr	uniprot2023_02=type=additional;tr
SymbolChange[A0A8J0SW92]	uniprot2023_01=LOC100492010	uniprot2023_02=XB5886923
SymbolChange[A0A803JJ39]	uniprot2023_01=cox20	uniprot2023_02=desi2
SymbolChange[A0A803KC39]	uniprot2023_01=LOC101731595	uniprot2023_02=capn8.5
TypeChange[LOC101732679|A0A8J1INB7]	uniprot2023_01=type=main;tr	uniprot2023_02=type=additional;tr
SymbolChange[Q08BU0]	uniprot2023_01=atp5mk	uniprot2023_02=rapgef2
SymbolChange[Q28HF4]	uniprot2023_01=septin5	uniprot2023_02=asb7
SymbolChange[A0A6I8PSK8]	uniprot2023_01=c9orf64	uniprot2023_02=c9h9orf64
SymbolChange[B3DL55]	uniprot2023_01=vps35l	uniprot2023_02=dpepe
SymbolChange[A0A803KH81]	uniprot2023_01=MGC146390	uniprot2023_02=ube3c
SymbolChange[A0A803KLC3]	uniprot2023_01=LOC100124818	uniprot2023_02=fabp4
SymbolChange[A9UMG7]	uniprot2023_01=gtf3c5	uniprot2023_02=kdm4a
SymbolChange[A0A8J0SJ03]	uniprot2023_01=MGC147117	uniprot2023_02=mgc147117
SymbolChange[B1H183]	uniprot2023_01=cdcp1	uniprot2023_02=upb1
TypeChange[ndufb3|Q28IE9]	uniprot2023_01=type=main;tr	uniprot2023_02=type=additional;tr
SymbolChange[A0A8J0S8E1]	uniprot2023_01=LOC100490253	uniprot2023_02=XB5730951
SymbolChange[A0A5S6K347]	uniprot2023_01=rapgefl1	uniprot2023_02=c7orf25
SymbolChange[A0A7D9NJK7]	uniprot2023_01=pglyrp2	uniprot2023_02=mterf2
SymbolChange[A0A803J5K3]	uniprot2023_01=dcun1d2	uniprot2023_02=adprhl1
SymbolChange[F6PV32]	uniprot2023_01=rtp3	uniprot2023_02=rtp3b
SymbolChange[Q6P2Y4]	uniprot2023_01=ipmk	uniprot2023_02=ppih
SymbolChange[A0A8J0T6A4]	uniprot2023_01=LOC100490139	uniprot2023_02=XB986811
SymbolChange[A9JTM7]	uniprot2023_01=shisa2	uniprot2023_02=otop3
SymbolChange[A0A7D9NM68]	uniprot2023_01=mnat1	uniprot2023_02=cntrl
SymbolChange[A0A8J0T0X6]	uniprot2023_01=LOC100493251	uniprot2023_02=XB22065091
SymbolChange[A0A803KIQ2]	uniprot2023_01=slc34a2-prov	uniprot2023_02=ppan
SymbolChange[A0A8J0QVE6]	uniprot2023_01=ccdc151	uniprot2023_02=odad3
SymbolChange[F6RNH6]	uniprot2023_01=mcf2l2	uniprot2023_02=mcf2l.2
SymbolChange[A0A803JI05]	uniprot2023_01=b3gnt6	uniprot2023_02=dmac2
TypeChange[fdxr|F6XUJ4]	uniprot2023_01=type=main;tr	uniprot2023_02=type=additional;tr
SymbolChange[Q28IP7]	uniprot2023_01=znf385d	uniprot2023_02=cdc42ep2
SymbolChange[Q5G7J0]	uniprot2023_01=nd1	uniprot2023_02=mt-nd1
SymbolChange[A0A8J0QTG5]	uniprot2023_01=LOC100498162	uniprot2023_02=XB5728872
TypeChange[XB5729271|Q28DP5]	uniprot2023_01=type=main;tr	uniprot2023_02=type=additional;tr
SymbolChange[F6SDN1]	uniprot2023_01=kiaa0895l	uniprot2023_02=matcap1
SymbolChange[F7EJK9]	uniprot2023_01=syngr2	uniprot2023_02=cbx2
SymbolChange[A0A803K9G0]	uniprot2023_01=slc25a22l	uniprot2023_02=slc25a22
SymbolChange[A0A8J0QNL3]	uniprot2023_01=LOC100489267	uniprot2023_02=XB5969542
TypeChange[slc39a12|A0A6I8PMZ8]	uniprot2023_01=type=main;tr	uniprot2023_02=type=main;sp
TypeChange[wwox|A0A8J1JFJ5]	uniprot2023_01=type=main;tr	uniprot2023_02=type=additional;tr
TypeChange[atp6v0c|Q6PBE9]	uniprot2023_01=type=main;tr	uniprot2023_02=type=additional;tr
SymbolChange[A0A8J0QXA8]	uniprot2023_01=LOC100379837	uniprot2023_02=spata18a
TypeChange[XB5807236|B2RYZ9]	uniprot2023_01=type=main;tr	uniprot2023_02=type=additional;tr
SymbolChange[Q6NVN2]	uniprot2023_01=cadm1	uniprot2023_02=erlec1
SymbolChange[A0A803KKM5]	uniprot2023_01=tmtopn3	uniprot2023_02=tmtops
SymbolChange[A0A1B8Y787]	uniprot2023_01=LOC100127826	uniprot2023_02=XB5873751
SymbolChange[A0A7D9NMF6]	uniprot2023_01=arnt	uniprot2023_02=htr2b
SymbolChange[Q28DB2]	uniprot2023_01=ildr1	uniprot2023_02=cpsf4l
TypeChange[taf4|A0A8J0SB10]	uniprot2023_01=type=main;tr	uniprot2023_02=type=additional;tr
TypeChange[XB5749127|B0BMA0]	uniprot2023_01=type=main;tr	uniprot2023_02=type=additional;tr
SymbolChange[Q28DU8]	uniprot2023_01=ddx41	uniprot2023_02=nsa2
SymbolChange[A0A8J0QWK2]	uniprot2023_01=LOC733880	uniprot2023_02=XB5745512
SymbolChange[A0A8J0T572]	uniprot2023_01=LOC100491633	uniprot2023_02=XB5759208
SymbolChange[A0A8J0QKN0]	uniprot2023_01=b3gnt10	uniprot2023_02=b3galt9
SymbolChange[A0A803JKL2]	uniprot2023_01=XB5894678	uniprot2023_02=btnl10.2
SymbolChange[A0A8J0QJT5]	uniprot2023_01=smad4.1	uniprot2023_02=smad4
SymbolChange[A0A8J0S7T7]	uniprot2023_01=c12orf10	uniprot2023_02=myg1
SymbolChange[A0A8J1JJ12,Q28EW5]	uniprot2023_01=LOC594909,cdc42se2-A	uniprot2023_02=cdc42se2-A,cdc42se2l
TypeChange[pcolce|Q66IF4]	uniprot2023_01=type=main;tr	uniprot2023_02=type=additional;tr
SymbolChange[A0A6I8Q5U0]	uniprot2023_01=itga2b.2	uniprot2023_02=itga2b.1
SymbolChange[A0A803KGH9]	uniprot2023_01=LOC549476	uniprot2023_02=rps14
SymbolChange[A0A8J0Q8R0]	uniprot2023_01=LOC100127658	uniprot2023_02=XB940377
SymbolChange[A0A8J0R3A1]	uniprot2023_01=fam92b	uniprot2023_02=cibar2
SymbolChange[A0JP96]	uniprot2023_01=rps17	uniprot2023_02=tmem63c
TypeChange[lgals1.3|F6XH66]	uniprot2023_01=type=main;tr	uniprot2023_02=type=additional;tr
SymbolChange[A0A7D9NJU6]	uniprot2023_01=lratd1	uniprot2023_02=gfi1
SymbolChange[A0A8J0SIE8]	uniprot2023_01=MGC69309	uniprot2023_02=mgc69309
SymbolChange[Q28D68]	uniprot2023_01=hist2h2bf	uniprot2023_02=h2bc21
SymbolChange[Q5BL46]	uniprot2023_01=barhl2	uniprot2023_02=lsm2
TypeChange[XB5922676|Q28FL2]	uniprot2023_01=type=main;tr	uniprot2023_02=type=additional;tr
SymbolChange[Q66IK3]	uniprot2023_01=sowahd	uniprot2023_02=dnajb1
TypeChange[XB5809687|A0A6I8S4C0]	uniprot2023_01=type=main;tr	uniprot2023_02=type=additional;tr
SymbolChange[A0A8J0QR58]	uniprot2023_01=ig100492381	uniprot2023_02=XB22166507
SymbolChange[A0A8J0T378]	uniprot2023_01=LOC100124771	uniprot2023_02=XB5729271
SymbolChange[A0A8J0T6B7]	uniprot2023_01=c2orf80	uniprot2023_02=c9h2orf80
SymbolChange[Q0P4K2]	uniprot2023_01=cabp4	uniprot2023_02=eif2ak2
SymbolChange[Q28D02]	uniprot2023_01=prr29	uniprot2023_02=nup37
SymbolChange[A0A8J0QR16]	uniprot2023_01=LOC100494383	uniprot2023_02=XB6462649
SymbolChange[Q6P7Z6]	uniprot2023_01=ppp1r14c	uniprot2023_02=arf5
SymbolChange[F6PIC2]	uniprot2023_01=XB5810926	uniprot2023_02=cyp4b1.4
SymbolChange[A0A6I8R5U9]	uniprot2023_01=pdcl3	uniprot2023_02=nms
TypeChange[rab29|A9UL72]	uniprot2023_01=type=main;tr	uniprot2023_02=type=additional;tr
SymbolChange[F7BJF0]	uniprot2023_01=c2orf69	uniprot2023_02=c9h2orf69
SymbolChange[Q68FA2]	uniprot2023_01=NA	uniprot2023_02=adissp
SymbolChange[A0A8J0SMJ9]	uniprot2023_01=LOC100495544	uniprot2023_02=fcrl4
SymbolChange[Q0D2C0]	uniprot2023_01=cd151	uniprot2023_02=dmac2l
SymbolChange[A0A7D9NJL4]	uniprot2023_01=grik5-like.1	uniprot2023_02=rep15
SymbolChange[A0A8J0R2L0]	uniprot2023_01=LOC100379842	uniprot2023_02=guca1bl
SymbolChange[F6XTM2]	uniprot2023_01=LOC100496752	uniprot2023_02=LOC101734900
SymbolChange[Q0IJ02]	uniprot2023_01=mtmr14	uniprot2023_02=taf4
TypeChange[mgc147117|Q0V9G7]	uniprot2023_01=type=main;tr	uniprot2023_02=type=additional;tr
SymbolChange[A0A803KJS5]	uniprot2023_01=LOC549723	uniprot2023_02=cluap1
SymbolChange[Q6P365]	uniprot2023_01=csf1	uniprot2023_02=ppp2ca
TypeChange[tbc1d8|A0A8J0SFK3]	uniprot2023_01=type=main;tr	uniprot2023_02=type=additional;tr
SymbolChange[A0A8J0SYZ6]	uniprot2023_01=noxo1.1	uniprot2023_02=noxo1.2
SymbolChange[A0A8J0QNE9]	uniprot2023_01=LOC100495517	uniprot2023_02=XB5870707
SymbolChange[A0A803KI61]	uniprot2023_01=lyve1	uniprot2023_02=commd1
SymbolChange[A0A8J0SN99]	uniprot2023_01=efcab1	uniprot2023_02=clxn
SymbolChange[A0A803KKU3]	uniprot2023_01=krt5.4	uniprot2023_02=krt78.7
SymbolChange[A0A7D9NJM7]	uniprot2023_01=hoxa3	uniprot2023_02=tmem143
TypeChange[vstm5|A0A8J0QW19]	uniprot2023_01=type=main;tr	uniprot2023_02=type=additional;tr
SymbolChange[A0A8J0QY56]	uniprot2023_01=LOC100494072	uniprot2023_02=XB5721655
SymbolChange[A0A8J0T090]	uniprot2023_01=LOC548945	uniprot2023_02=XB5763442
SymbolChange[A0A8J0QQP2]	uniprot2023_01=LOC100486434	uniprot2023_02=XB5891720
SymbolChange[A0A8J0S770]	uniprot2023_01=LOC100170425	uniprot2023_02=XB5807236
TypeChange[XB5765667|A8KBF9]	uniprot2023_01=type=main;tr	uniprot2023_02=type=additional;tr
SymbolChange[A0A7D9NMH8]	uniprot2023_01=gbx2.2	uniprot2023_02=lmtk2
SymbolChange[A0A8J0SF75]	uniprot2023_01=MGC69416	uniprot2023_02=mgc69416
SymbolChange[A0A803KL75]	uniprot2023_01=LOC100145482	uniprot2023_02=nadsyn1
SymbolChange[A0A8J0QTS3]	uniprot2023_01=mr1	uniprot2023_02=mhc1b-uba7.3
SymbolChange[F6ZKU5]	uniprot2023_01=st3gal3	uniprot2023_02=camlg
SymbolChange[A0A8J0QII0]	uniprot2023_01=LOC100492579	uniprot2023_02=XB5735880
SymbolChange[A0A6I8QEK2]	uniprot2023_01=slc22a20p.1	uniprot2023_02=slc22a20.1
SymbolChange[A0A7D9NLE4]	uniprot2023_01=otop3	uniprot2023_02=engase
SymbolChange[A0A8J0QWL2]	uniprot2023_01=LOC100487575	uniprot2023_02=XB22065716
SymbolChange[A0A7D9NKY6]	uniprot2023_01=mt-cyb	uniprot2023_02=art1
SymbolChange[A0A803JE15]	uniprot2023_01=nup50	uniprot2023_02=upk3a
SymbolChange[Q6P3Q7]	uniprot2023_01=sphk2	uniprot2023_02=pdlim4
SymbolChange[A0A803KK91]	uniprot2023_01=MGC147400	uniprot2023_02=ppp1r12b
SymbolChange[A0A8J0QM19]	uniprot2023_01=LOC100145428	uniprot2023_02=XB5740125
SymbolChange[Q5G7I0]	uniprot2023_01=nd5	uniprot2023_02=mt-nd5
SymbolChange[A0A8J0PFP0]	uniprot2023_01=LOC496665	uniprot2023_02=XB5742360
SymbolChange[Q6DII1]	uniprot2023_01=stimate	uniprot2023_02=nek2
SymbolChange[A0A7D9NJQ1]	uniprot2023_01=b3gat2	uniprot2023_02=LOC116410412
SymbolChange[A0A7D9NJN6]	uniprot2023_01=ei24	uniprot2023_02=rxfp1
SymbolChange[A0A1B8Y1I5]	uniprot2023_01=LOC101734259	uniprot2023_02=LOC116412309
SymbolChange[A0A803KKJ9]	uniprot2023_01=LOC100127660	uniprot2023_02=dalrd3
SymbolChange[A0A8J0QS82]	uniprot2023_01=gatd3a	uniprot2023_02=gatd3
SymbolChange[A0A8J0SS21]	uniprot2023_01=LOC100486850	uniprot2023_02=XB5725480
SymbolChange[B1H1F5]	uniprot2023_01=maz	uniprot2023_02=irak4
SymbolChange[A0A8J0R0Z3]	uniprot2023_01=LOC100497030	uniprot2023_02=XB5822195
TypeChange[mrps31|A0A8J0R1P5]	uniprot2023_01=type=main;tr	uniprot2023_02=type=additional;tr
SymbolChange[A0A8J0T1W7]	uniprot2023_01=LOC100127659	uniprot2023_02=XB5765667
SymbolChange[A0A8J0T3Y6]	uniprot2023_01=LOC733928	uniprot2023_02=XB5799681
SymbolChange[A0A8J0PGW7]	uniprot2023_01=casc4	uniprot2023_02=golm2
SymbolChange[F6VSY9]	uniprot2023_01=fbxl21p	uniprot2023_02=fbxl21
SymbolChange[Q28F86]	uniprot2023_01=angpt4.2	uniprot2023_02=arl10b
SymbolChange[Q68PF6]	uniprot2023_01=fbxo22	uniprot2023_02=lpar2
SymbolChange[Q28ET2]	uniprot2023_01=fzd6	uniprot2023_02=anxa4
SymbolChange[A0A803KIX6]	uniprot2023_01=zar1l	uniprot2023_02=ppil6
SymbolChange[A0A8J0SD12]	uniprot2023_01=LOC100145165	uniprot2023_02=XB5809687
SymbolChange[A0A7D9NJN9]	uniprot2023_01=gtsf1	uniprot2023_02=nkiras2
SymbolChange[A0A7D9NLH1]	uniprot2023_01=cisd3	uniprot2023_02=disp3.2
SymbolChange[A0A803KIU3]	uniprot2023_01=LOC496972	uniprot2023_02=cela1.5
SymbolChange[A0A8J0SZT1]	uniprot2023_01=LOC100489322	uniprot2023_02=mgat4b
SymbolChange[A0JM86]	uniprot2023_01=cnpy2	uniprot2023_02=esrra
SymbolChange[A0A7D9NKQ4]	uniprot2023_01=best3	uniprot2023_02=akap6
TypeChange[arl10b|A0A8J1JAU7]	uniprot2023_01=type=main;tr	uniprot2023_02=type=additional;tr
SymbolChange[A0A803KIS5]	uniprot2023_01=MGC108301	uniprot2023_02=tfpi2
SymbolChange[Q28J96]	uniprot2023_01=trim44	uniprot2023_02=fgfr1
SymbolChange[A0A7D9N0H9]	uniprot2023_01=XB5892933	uniprot2023_02=prss27.3
SymbolChange[A0A8J0QUN0]	uniprot2023_01=LOC100491172	uniprot2023_02=XB5960289
SymbolChange[A0A8J0SKI8]	uniprot2023_01=fam122c	uniprot2023_02=pabir3
TypeChange[krt19|Q6P7K6]	uniprot2023_01=type=main;tr	uniprot2023_02=type=additional;tr
SymbolChange[A0A7D9NMG5]	uniprot2023_01=XB996620	uniprot2023_02=c10h1orf198
SymbolChange[A0A803KLK6]	uniprot2023_01=LOC100145273	uniprot2023_02=jph1
SymbolChange[A0A8J0Q7S4]	uniprot2023_01=LOC100124990	uniprot2023_02=XB5822256
SymbolChange[A0A8J0QH19]	uniprot2023_01=mhc1b2	uniprot2023_02=mhc1b-uba13.2
SymbolChange[Q38JW2]	uniprot2023_01=IL-9	uniprot2023_02=il9
SymbolChange[A4QNF5]	uniprot2023_01=rps27	uniprot2023_02=rps27.1
SymbolChange[F6UWD2]	uniprot2023_01=tnks2	uniprot2023_02=tnks
SymbolChange[A0A6I8RCP9]	uniprot2023_01=LOC100486065	uniprot2023_02=mel
SymbolChange[A0A8J0QLL9]	uniprot2023_01=LOC100493594	uniprot2023_02=XB22169588
SymbolChange[A0A6I8PK71]	uniprot2023_01=vn2r1p	uniprot2023_02=vn2r1
SymbolChange[A0A6I8SUW9]	uniprot2023_01=tbc1d8b	uniprot2023_02=tbc1d8
TypeChange[phyhdla.3|A0A8J0QIN9]	uniprot2023_01=type=main;tr	uniprot2023_02=type=additional;tr
SymbolChange[A0A8J0SE03]	uniprot2023_01=LOC448677	uniprot2023_02=mgc89871
SymbolChange[A0A8J0QNJ1]	uniprot2023_01=LOC100490079	uniprot2023_02=XB5750836
SymbolChange[A0A8J0QP77]	uniprot2023_01=xbg100496955	uniprot2023_02=XB22169526
SymbolChange[A0A8J0QRX6]	uniprot2023_01=LOC100498165	uniprot2023_02=XB5726391
SymbolChange[A0A8J0R8E7]	uniprot2023_01=LOC100486056	uniprot2023_02=XB5896327
SymbolChange[Q4VA85]	uniprot2023_01=rps6ka5	uniprot2023_02=dap
SymbolChange[A0PJP2]	uniprot2023_01=tmem208	uniprot2023_02=ube2c
SymbolChange[A0A803J2X6]	uniprot2023_01=tigar	uniprot2023_02=ccnd2
SymbolChange[A0A8J0R7K6]	uniprot2023_01=LOC100485015	uniprot2023_02=XB22064855
SymbolChange[A0A803K6I0]	uniprot2023_01=lin7b	uniprot2023_02=lin7c
SymbolChange[A0A8J0SSM6]	uniprot2023_01=LOC733728	uniprot2023_02=XB5893022
SymbolChange[A0A8J0QRE8]	uniprot2023_01=c9orf135	uniprot2023_02=cfap95
SymbolChange[A0A8J0SDE9]	uniprot2023_01=LOC100489880	uniprot2023_02=XB1014132
TypeChange[XB5873751|A9JTQ8]	uniprot2023_01=type=main;tr	uniprot2023_02=type=additional;tr
SymbolChange[Q08D04]	uniprot2023_01=ribc1	uniprot2023_02=kat14
SymbolChange[A0A8J0QLE2]	uniprot2023_01=LOC100494211	uniprot2023_02=XB5848002
SymbolChange[A0A8J0T1D9]	uniprot2023_01=LOC100145274	uniprot2023_02=gtsf2
TypeChange[dgkb|A4III1]	uniprot2023_01=type=main;tr	uniprot2023_02=type=additional;tr
SymbolChange[A0A7D9NMC7]	uniprot2023_01=uqcrfs1	uniprot2023_02=lck
TypeChange[mtx2|A0A8J1IUL1]	uniprot2023_01=type=main;tr	uniprot2023_02=type=additional;tr
SymbolChange[Q28BK3]	uniprot2023_01=vps53	uniprot2023_02=acadl
SymbolChange[Q28GX6]	uniprot2023_01=usp25	uniprot2023_02=rph3al
SymbolChange[Q6DF68]	uniprot2023_01=h2bc12	uniprot2023_02=edar
SymbolChange[A0A803KKD3]	uniprot2023_01=MGC76254	uniprot2023_02=myc
SymbolChange[A0A8J1ILX7]	uniprot2023_01=LOC116406532	uniprot2023_02=XB994497
SymbolChange[A0A803KLE4]	uniprot2023_01=LOC100145210	uniprot2023_02=trpc4ap
SymbolChange[Q5G7I2]	uniprot2023_01=nd4l	uniprot2023_02=mt-nd4l
SymbolChange[Q6EV72]	uniprot2023_01=arpc1a	uniprot2023_02=fut1
TypeChange[XB5717875|A0A1B8XTN0]	uniprot2023_01=type=main;tr	uniprot2023_02=type=additional;tr
TypeChange[mgc146850|Q05B15]	uniprot2023_01=type=main;tr	uniprot2023_02=type=additional;tr
SymbolChange[Q0P4J7]	uniprot2023_01=alx1	uniprot2023_02=oxsm
SymbolChange[A0A8J0SRI1]	uniprot2023_01=LOC100144919	uniprot2023_02=XB5850668
SymbolChange[Q5EAM9]	uniprot2023_01=mprip	uniprot2023_02=steap4.1
SymbolChange[Q28GP5]	uniprot2023_01=LOC394448	uniprot2023_02=ccnb2
SymbolChange[A0A7D9NKW8]	uniprot2023_01=aldoa	uniprot2023_02=LOC100489839
SymbolChange[A0A8J0QLE1]	uniprot2023_01=LOC100497588	uniprot2023_02=XB987369
TypeChange[mafg|A0A8J0R6E8]	uniprot2023_01=type=main;tr	uniprot2023_02=type=additional;tr
TypeChange[XB5961849|B0BM83]	uniprot2023_01=type=main;tr	uniprot2023_02=type=additional;tr
SymbolChange[A0A803KI49]	uniprot2023_01=LOC100127730	uniprot2023_02=adora1
SymbolChange[A4QNF0]	uniprot2023_01=elp6	uniprot2023_02=ndufb10
SymbolChange[Q28GP9]	uniprot2023_01=pias1	uniprot2023_02=rhof
SymbolChange[Q6DEY9]	uniprot2023_01=vgll1	uniprot2023_02=pola2
SymbolChange[Q5G7I6]	uniprot2023_01=atp8	uniprot2023_02=mt-atp8
SymbolChange[A0A7D9NLY7]	uniprot2023_01=ube2e2	uniprot2023_02=atoh1
SymbolChange[A0A7D9NMD1]	uniprot2023_01=tmem26	uniprot2023_02=penk
SymbolChange[A0A8J0R6Q2]	uniprot2023_01=LOC100490531	uniprot2023_02=pcbp1
SymbolChange[Q6DIM9]	uniprot2023_01=caprin2	uniprot2023_02=vps16
SymbolChange[A0A7D9NJL2]	uniprot2023_01=osbpl8	uniprot2023_02=cnnm3
SymbolChange[A0A803KHK0]	uniprot2023_01=mkl2	uniprot2023_02=mrtfb
SymbolChange[A0A8J0PIA9]	uniprot2023_01=h1-1	uniprot2023_02=h1-10
TypeChange[camlg|A0A8J0QGX1]	uniprot2023_01=type=main;tr	uniprot2023_02=type=additional;tr
TypeChange[guca1bl|F6UG75]	uniprot2023_01=type=main;tr	uniprot2023_02=type=additional;tr
SymbolChange[A0A7D9NK89]	uniprot2023_01=ndufa11	uniprot2023_02=vstm5
SymbolChange[A0A8J0ST43]	uniprot2023_01=LOC100127789	uniprot2023_02=XB5821669
SymbolChange[Q6DF56]	uniprot2023_01=nnt	uniprot2023_02=arpc1b
SymbolChange[Q6P4M8]	uniprot2023_01=phf14	uniprot2023_02=fam20b
SymbolChange[A0A6I8R787]	uniprot2023_01=fam126b	uniprot2023_02=hycc2
SymbolChange[Q28F58]	uniprot2023_01=sptlc3	uniprot2023_02=hes5.10
SymbolChange[A0A1B8Y8P4]	uniprot2023_01=LOC100498389	uniprot2023_02=cxcl8a.2
SymbolChange[A0A8J0QPL2]	uniprot2023_01=LOC100495271	uniprot2023_02=XB5913757
SymbolChange[A0A7D9NJU9]	uniprot2023_01=fgf7	uniprot2023_02=LOC100486918
SymbolChange[Q6DDA8]	uniprot2023_01=cdkn2c	uniprot2023_02=frg1
SymbolChange[A0A803J8R5]	uniprot2023_01=med1l	uniprot2023_02=med1
SymbolChange[A0A8J0T4J5]	uniprot2023_01=LOC100497395	uniprot2023_02=XB5832479
SymbolChange[A0A803KJT5]	uniprot2023_01=LOC100145732	uniprot2023_02=tcp11l2
TypeChange[XB5850668|B0BLT9]	uniprot2023_01=type=main;tr	uniprot2023_02=type=additional;tr
SymbolChange[A0A8J0QZ90]	uniprot2023_01=LOC734020	uniprot2023_02=XB22063322
SymbolChange[Q28IK5]	uniprot2023_01=espn	uniprot2023_02=tada2a
SymbolChange[Q5FW11]	uniprot2023_01=maff	uniprot2023_02=dnajb2
SymbolChange[A0A8J0QWR7]	uniprot2023_01=LOC101731543	uniprot2023_02=XB22061515
SymbolChange[Q6P356]	uniprot2023_01=adam28.1	uniprot2023_02=eef1a1o
SymbolChange[A0A803KHE5]	uniprot2023_01=LOC100145465	uniprot2023_02=ccdc68
SymbolChange[Q0VFJ0]	uniprot2023_01=cd28	uniprot2023_02=rnf166
TypeChange[ccnb2|Q66KA1]	uniprot2023_01=type=main;tr	uniprot2023_02=type=additional;tr
SymbolChange[Q6P1S8]	uniprot2023_01=snx2	uniprot2023_02=rcn3
TypeChange[otop3|A0A803JVZ8]	uniprot2023_01=type=main;tr	uniprot2023_02=type=additional;tr
SymbolChange[Q28H72]	uniprot2023_01=cyb561d1	uniprot2023_02=mnat1
TypeChange[tnks|A0A8J0QUZ9]	uniprot2023_01=type=main;tr	uniprot2023_02=type=additional;tr
SymbolChange[A0A8J0QZS9]	uniprot2023_01=LOC100492268	uniprot2023_02=XB5732857
SymbolChange[A0A8J0T5P9]	uniprot2023_01=fam207a	uniprot2023_02=slx9
SymbolChange[A0A8J0QSM6]	uniprot2023_01=LOC100170427	uniprot2023_02=XB5882685
TypeChange[mgc69416|Q6GLI2]	uniprot2023_01=type=main;tr	uniprot2023_02=type=additional;tr
SymbolChange[A0A803JZZ5]	uniprot2023_01=grm6	uniprot2023_02=grm8
TypeChange[hspb11|A0A8J0SLR5]	uniprot2023_01=type=main;tr	uniprot2023_02=type=additional;tr
SymbolChange[Q28CP4]	uniprot2023_01=fmnl2	uniprot2023_02=kat8
SymbolChange[A0A8J0SPX2]	uniprot2023_01=LOC100490476	uniprot2023_02=XB5952276
SymbolChange[F7CD83]	uniprot2023_01=rasef	uniprot2023_02=LOC100379934
SymbolChange[A0A803K5C1]	uniprot2023_01=pecr	uniprot2023_02=marchf4
SymbolChange[A0A8J0R220]	uniprot2023_01=LOC101734214	uniprot2023_02=XB22062350
SymbolChange[A0A8J0R8D0]	uniprot2023_01=c11orf95	uniprot2023_02=zfta
SymbolChange[A0A6I8QUP9]	uniprot2023_01=ccdc189	uniprot2023_02=cfap119
TypeChange[cibar1|A9UL62]	uniprot2023_01=type=main;tr	uniprot2023_02=type=additional;tr
SymbolChange[Q5FVV0]	uniprot2023_01=nox4	uniprot2023_02=polr3k
SymbolChange[A0A8J0QI85]	uniprot2023_01=LOC100491713	uniprot2023_02=nodal3.2
SymbolChange[A0A8J0R7Y5]	uniprot2023_01=LOC101731925	uniprot2023_02=XB22064859
SymbolChange[Q496Y6]	uniprot2023_01=rtf2	uniprot2023_02=itih2
SymbolChange[A0A8J0R8D6]	uniprot2023_01=LOC100497729	uniprot2023_02=XB5717875
SymbolChange[A0A803KJI2]	uniprot2023_01=hmgn3	uniprot2023_02=mgc89178
SymbolChange[A0A803KHI9]	uniprot2023_01=MGC108187	uniprot2023_02=slc25a48
SymbolChange[A0A803KLC1]	uniprot2023_01=LOC496885	uniprot2023_02=angptl3
SymbolChange[A0A803KLQ8]	uniprot2023_01=LOC100170498	uniprot2023_02=hecw1
SymbolChange[F6T2H0]	uniprot2023_01=ccdc173	uniprot2023_02=cfap210
SymbolChange[G1K3C1]	uniprot2023_01=fgl1b	uniprot2023_02=dop1b
SymbolChange[Q0IHM4]	uniprot2023_01=ppm1a	uniprot2023_02=vps9d1
SymbolChange[A0A5G3I9B4]	uniprot2023_01=phyhdla.1	uniprot2023_02=phyhdla.2
SymbolChange[A0A803KIS6]	uniprot2023_01=Rufy2	uniprot2023_02=rufy2
SymbolChange[A0A8J0QY25]	uniprot2023_01=LOC100493076	uniprot2023_02=XB5836725
SymbolChange[A0A8J0T5E9]	uniprot2023_01=LOC100487861	uniprot2023_02=XB997834
SymbolChange[A0A6I8QG78]	uniprot2023_01=avpr2.2	uniprot2023_02=avpr2c
SymbolChange[A0A8J0QYH0]	uniprot2023_01=skiv2l	uniprot2023_02=skic2
SymbolChange[A0A8J0SQ86]	uniprot2023_01=fam92a	uniprot2023_02=cibar1
SymbolChange[A0A8J0T374]	uniprot2023_01=LOC100158544	uniprot2023_02=XB5950141
SymbolChange[A8WGZ3]	uniprot2023_01=c17orf67	uniprot2023_02=c10h17orf67
SymbolChange[Q28D09]	uniprot2023_01=txnip	uniprot2023_02=cdc23
TypeChange[nkiras2|A0A8J0R5R5]	uniprot2023_01=type=main;tr	uniprot2023_02=type=additional;tr
SymbolChange[A4IGU2]	uniprot2023_01=abhd13	uniprot2023_02=b3gat1
TypeChange[gpm6b|Q0IHP9]	uniprot2023_01=type=main;tr	uniprot2023_02=type=additional;tr
SymbolChange[A0A7D9NM97]	uniprot2023_01=lrrc8d	uniprot2023_02=ddr1
SymbolChange[F6TD01]	uniprot2023_01=c3orf70	uniprot2023_02=c9h3orf70
SymbolChange[F7ETG3]	uniprot2023_01=mcm3	uniprot2023_02=garem1
SymbolChange[A0A6I8SJC5]	uniprot2023_01=LOC100487454	uniprot2023_02=atp6ap1.1
SymbolChange[A4IID8]	uniprot2023_01=LOC549879	uniprot2023_02=pigc
SymbolChange[A4IGU5]	uniprot2023_01=pik3r3	uniprot2023_02=sfrpx
SymbolChange[A0A6I8S576]	uniprot2023_01=krt78.3	uniprot2023_02=krt78.4
SymbolChange[A0A8J0R4J9]	uniprot2023_01=LOC100486968	uniprot2023_02=XB994846
TypeChange[btn2a1|A0A8J0SBS3]	uniprot2023_01=type=main;tr	uniprot2023_02=type=additional;tr
SymbolChange[A0A8J0T0J4]	uniprot2023_01=LOC733945	uniprot2023_02=XB5722382
SymbolChange[Q5M901]	uniprot2023_01=h2ac14	uniprot2023_02=mybph
SymbolChange[A0A1B8Y8M8]	uniprot2023_01=LOC101730379	uniprot2023_02=cxc8b.1
SymbolChange[A0A7D9NLL1]	uniprot2023_01=alox5ap	uniprot2023_02=dusp18
TypeChange[asb7|A0A8J0SFP9]	uniprot2023_01=type=main;tr	uniprot2023_02=type=additional;tr
SymbolChange[A0A803KI68]	uniprot2023_01=LOC100145516	uniprot2023_02=steap4.2
SymbolChange[F6WIC2]	uniprot2023_01=cc2d2a	uniprot2023_02=c1qtnf7
SymbolChange[Q5G7I3]	uniprot2023_01=nd3	uniprot2023_02=nad3
SymbolChange[A0A8J0QNJ2]	uniprot2023_01=LOC100491441	uniprot2023_02=XB5858494
SymbolChange[A0A7D9NM73]	uniprot2023_01=kcna2	uniprot2023_02=kcna3
SymbolChange[A0A8J0QYT6]	uniprot2023_01=LOC100492585	uniprot2023_02=XB5856846
TypeChange[rcn3|A0A8J0SF40]	uniprot2023_01=type=main;tr	uniprot2023_02=type=additional;tr
SymbolChange[A0A8J0QUT5]	uniprot2023_01=LOC100489282	uniprot2023_02=XB22061507
SymbolChange[A0A8J0SF89]	uniprot2023_01=c15orf40	uniprot2023_02=c3h15orf40
SymbolChange[F6UVV5]	uniprot2023_01=cyp2g1p	uniprot2023_02=cyp2g1
SymbolChange[A0A7D9NKQ2]	uniprot2023_01=smim14	uniprot2023_02=rfxap
SymbolChange[A9JSB9]	uniprot2023_01=tsr2	uniprot2023_02=tex261
TypeChange[b3gat1|A0A8J0SPI6]	uniprot2023_01=type=main;tr	uniprot2023_02=type=additional;tr
SymbolChange[A0A8J0SZZ1]	uniprot2023_01=LOC100216037	uniprot2023_02=XB5993342
SymbolChange[A0A6I8R2Q0]	uniprot2023_01=nbeal3	uniprot2023_02=nbea
SymbolChange[A0A6I8R1V8]	uniprot2023_01=btn1a1	uniprot2023_02=XB5949738
SymbolChange[A0A7D9NKV3]	uniprot2023_01=gtf2e1.2	uniprot2023_02=prune2
SymbolChange[A0A7D9NKV7]	uniprot2023_01=XB5799681	uniprot2023_02=loxl4
SymbolChange[A0A7D9NM06]	uniprot2023_01=ptp4a3	uniprot2023_02=mgc147117
SymbolChange[A0A8J0QNW4]	uniprot2023_01=LOC100496311	uniprot2023_02=XB13580952
SymbolChange[A0A8J0SIC1]	uniprot2023_01=fam214a	uniprot2023_02=atosa
SymbolChange[Q28GX0]	uniprot2023_01=cdh5	uniprot2023_02=vrk3
SymbolChange[A0A6I8SN43]	uniprot2023_01=pc.1	uniprot2023_02=pc.2
SymbolChange[A0A803KGG1]	uniprot2023_01=LOC100158651	uniprot2023_02=fdxr
SymbolChange[A0A803KHE1]	uniprot2023_01=LOC100145721	uniprot2023_02=mmel1
SymbolChange[A0A8J0QV97]	uniprot2023_01=LOC100487364	uniprot2023_02=XB22063241
SymbolChange[A0A8J0R215]	uniprot2023_01=LOC619584	uniprot2023_02=XB5848842
SymbolChange[F6T8W8]	uniprot2023_01=c8orf33	uniprot2023_02=c9h8orf33
SymbolChange[F7A4U0]	uniprot2023_01=c9orf64	uniprot2023_02=c9h9orf64
SymbolChange[Q28D57]	uniprot2023_01=znf519	uniprot2023_02=mcrs1
TypeChange[tdp1|A0A8J1ILM2]	uniprot2023_01=type=main;tr	uniprot2023_02=type=additional;tr
SymbolChange[Q0IIY0]	uniprot2023_01=capn1	uniprot2023_02=krt61
SymbolChange[A0A8J0QW80]	uniprot2023_01=LOC594886	uniprot2023_02=XB5945007
TypeChange[adk|A0A6I8SMV1]	uniprot2023_01=type=main;tr	uniprot2023_02=type=additional;tr
SymbolChange[A0A8J0QVJ0]	uniprot2023_01=LOC100490553	uniprot2023_02=mhc1b-uba6.1
SymbolChange[A0A7D9NK15]	uniprot2023_01=nek6	uniprot2023_02=scin
SymbolChange[A0A7D9NKC7]	uniprot2023_01=crygdl.17	uniprot2023_02=adap1l
SymbolChange[A0A803JD15]	uniprot2023_01=XB1011895	uniprot2023_02=wwox
SymbolChange[Q5CZL0]	uniprot2023_01=adra1d	uniprot2023_02=pcolce
SymbolChange[Q5G7I9]	uniprot2023_01=nd2	uniprot2023_02=mt-nd2
SymbolChange[A0A8J0PH61]	uniprot2023_01=MGC108147	uniprot2023_02=mgc108147
SymbolChange[A0A8J0SVQ8]	uniprot2023_01=MGC108429	uniprot2023_02=mgc108429
SymbolChange[A0A8J0R356]	uniprot2023_01=LOC100498440	uniprot2023_02=XB5905938
SymbolChange[F6X173]	uniprot2023_01=h2ac1	uniprot2023_02=dgkb
SymbolChange[Q6GLG3]	uniprot2023_01=ndufs5	uniprot2023_02=srsf9
SymbolChange[A0A7D9NL80]	uniprot2023_01=agtr1	uniprot2023_02=trhr
SymbolChange[A0A803KI12]	uniprot2023_01=LOC100170484	uniprot2023_02=mdm1
TypeChange[krt78.7|A0A8J1J1I7]	uniprot2023_01=type=main;tr	uniprot2023_02=type=additional;tr
TypeChange[XB22062350|A0A6I8R0N1]	uniprot2023_01=type=main;tr	uniprot2023_02=type=additional;tr
SymbolChange[A0A8J0QHT0]	uniprot2023_01=LOC100489834	uniprot2023_02=XB5857145
SymbolChange[A0A8J0SLN0]	uniprot2023_01=LOC496784	uniprot2023_02=XB5889122
SymbolChange[A0A7D9NKR6]	uniprot2023_01=ints15	uniprot2023_02=slc16a10
TypeChange[akap6|A0A8J0QMJ6]	uniprot2023_01=type=main;tr	uniprot2023_02=type=additional;tr
SymbolChange[F7CBB0]	uniprot2023_01=cstpp1	uniprot2023_02=XB5902317
SymbolChange[F6PY71]	uniprot2023_01=LOC100485512	uniprot2023_02=tlr14.2
SymbolChange[A0A8J0SKQ4]	uniprot2023_01=c5orf63	uniprot2023_02=c1h5orf63
SymbolChange[A0A8J0T2U0]	uniprot2023_01=fgfr1op	uniprot2023_02=cep43
SymbolChange[A0A6I8QXZ0]	uniprot2023_01=LOC100486629	uniprot2023_02=arhgap20b
SymbolChange[A0A8J0QQV6]	uniprot2023_01=LOC100495804	uniprot2023_02=XB5729788
SymbolChange[Q28GF7]	uniprot2023_01=diras2	uniprot2023_02=psenen
SymbolChange[A0A7D9NLM9]	uniprot2023_01=cox6b1	uniprot2023_02=nit1
SymbolChange[A0A8J0R4H3]	uniprot2023_01=cbm101731809provisional	uniprot2023_02=cbm20
SymbolChange[F6XR15]	uniprot2023_01=LOC116406449	uniprot2023_02=abcb5
SymbolChange[A4QNF7]	uniprot2023_01=slc48a1	uniprot2023_02=crip1
SymbolChange[Q6GUH5]	uniprot2023_01=kcne3	uniprot2023_02=mtx2
TypeChange[sbk1|A4IIN7]	uniprot2023_01=type=main;tr	uniprot2023_02=type=additional;tr
SymbolChange[F7BAI9]	uniprot2023_01=c11orf53	uniprot2023_02=pou2af2
TypeChange[abcb5|Q6P3N4]	uniprot2023_01=type=main;tr	uniprot2023_02=type=additional;tr
SymbolChange[A0A6I8R1D6]	uniprot2023_01=XB5873923	uniprot2023_02=mhc1b-uda
SymbolChange[A0A6I8RT47]	uniprot2023_01=galnt6.3	uniprot2023_02=galnt6.1
TypeChange[map3k1|A0A8J1IWP0]	uniprot2023_01=type=main;tr	uniprot2023_02=type=additional;tr
SymbolChange[F6T900]	uniprot2023_01=mettl26	uniprot2023_02=wfikkn1
SymbolChange[Q28FP4]	uniprot2023_01=cldn11	uniprot2023_02=hspb11
SymbolChange[Q0P4H9]	uniprot2023_01=kiaa0825	uniprot2023_02=lratd1
TypeChange[disp3.2|A0A8J1JUX8]	uniprot2023_01=type=main;tr	uniprot2023_02=type=additional;tr
SymbolChange[A0A6I8QIV0]	uniprot2023_01=cdc123	uniprot2023_02=camk1d
SymbolChange[A0A7D9NM01]	uniprot2023_01=znf800	uniprot2023_02=LOC100485340
SymbolChange[A0A8J0QU31]	uniprot2023_01=LOC100490956	uniprot2023_02=XB5895996
TypeChange[dmac2|A0A8J1IRZ8]	uniprot2023_01=type=main;tr	uniprot2023_02=type=additional;tr
TypeChange[aprt|A0A8J0T391]	uniprot2023_01=type=main;tr	uniprot2023_02=type=additional;tr
TypeChange[XB5905938|A0A803JD31]	uniprot2023_01=type=main;tr	uniprot2023_02=type=additional;tr
SymbolChange[A0A8J0QTC1]	uniprot2023_01=LOC100486342	uniprot2023_02=XB990816
SymbolChange[A0A8J0SKJ4]	uniprot2023_01=LOC100145527	uniprot2023_02=XB5885308
SymbolChange[A0A1B8XVM9]	uniprot2023_01=LOC105945968	uniprot2023_02=LOC101733971
SymbolChange[A0A7D9NLI2]	uniprot2023_01=galnt16	uniprot2023_02=fgd6
SymbolChange[A0A7D9NM80]	uniprot2023_01=mapre2	uniprot2023_02=dennd5b
SymbolChange[A0A7D9NMD6]	uniprot2023_01=slc39a1l	uniprot2023_02=mtmr4
SymbolChange[A0A7D9NMD8]	uniprot2023_01=gpm6b	uniprot2023_02=col9a1
SymbolChange[A0A7D9NME2]	uniprot2023_01=nck2	uniprot2023_02=tec
SymbolChange[A0A8J0QD04]	uniprot2023_01=palm2	uniprot2023_02=palm2akap2
SymbolChange[A0A803JV96]	uniprot2023_01=nup205	uniprot2023_02=stmp1
SymbolChange[Q5BKN6]	uniprot2023_01=rnls	uniprot2023_02=pcgf2
SymbolChange[F7E4I4]	uniprot2023_01=cmahp	uniprot2023_02=cmah
SymbolChange[F7E4J1]	uniprot2023_01=osbpl9	uniprot2023_02=c9h2orf69
SymbolChange[Q6DJ28]	uniprot2023_01=c15orf40	uniprot2023_02=c3h15orf40
SymbolChange[A0A7D9NJJ6]	uniprot2023_01=tmem127	uniprot2023_02=hao1
SymbolChange[Q5BJ34]	uniprot2023_01=gsk3a	uniprot2023_02=arf4
SymbolChange[A0A8J0QFM5]	uniprot2023_01=palm2	uniprot2023_02=palm2akap2
SymbolChange[A0A7D9NK48]	uniprot2023_01=ifnl3	uniprot2023_02=col4a5
SymbolChange[A0A8J0SLX2]	uniprot2023_01=MGC146850	uniprot2023_02=mgc146850
SymbolChange[A0A7D9NJW7]	uniprot2023_01=rasa2	uniprot2023_02=csf2rb
SymbolChange[Q4JF50]	uniprot2023_01=bix1.2	uniprot2023_02=LOC101733442
SymbolChange[A0A7D9NKD0]	uniprot2023_01=brpf3	uniprot2023_02=poldip2
SymbolChange[A0A7D9NKG4]	uniprot2023_01=larp6-like.1	uniprot2023_02=mtnr1a
TypeChange[krt5.4|B2GUG7]	uniprot2023_01=type=additional;tr	uniprot2023_02=type=main;tr
TypeChange[spring1|B2GUI5]	uniprot2023_01=type=additional;tr	uniprot2023_02=type=main;tr
TypeChange[atp5mk|A0A6I8SSN4]	uniprot2023_01=type=additional;tr	uniprot2023_02=type=main;tr
SymbolChange[A0A7D9NL13]	uniprot2023_01=ndufb4	uniprot2023_02=lpar3
SymbolChange[A0A7D9NKW4]	uniprot2023_01=tmem170a	uniprot2023_02=mrps14
SymbolChange[A0A7D9NL69]	uniprot2023_01=tmem59	uniprot2023_02=slc4a7
SymbolChange[A0A8J0T0T6]	uniprot2023_01=fgfr1op	uniprot2023_02=cep43
SymbolChange[F7ETI7]	uniprot2023_01=dhx36	uniprot2023_02=gpr149
SymbolChange[F6Z5W7]	uniprot2023_01=tgm3l.7	uniprot2023_02=tgm3l.8
SymbolChange[A0A803K298]	uniprot2023_01=arc3	uniprot2023_02=arc2
SymbolChange[Q0P4L6]	uniprot2023_01=c2orf69	uniprot2023_02=c9h2orf69
TypeChange[hmgn3|A0A8J0SNT8]	uniprot2023_01=type=additional;tr	uniprot2023_02=type=main;tr
SymbolChange[A0A8J0SNV2]	uniprot2023_01=fgfr1op	uniprot2023_02=cep43
SymbolChange[F7CNA3]	uniprot2023_01=LOC101733140	uniprot2023_02=XB990428
SymbolChange[A0A8J0SNX9]	uniprot2023_01=fgfr1op	uniprot2023_02=cep43
TypeChange[dlx1|A0PJP5]	uniprot2023_01=type=additional;tr	uniprot2023_02=type=main;tr
TypeChange[cstpp1|Q0VFE4]	uniprot2023_01=type=additional;tr	uniprot2023_02=type=main;tr
TypeChange[tmem59|B1WBF5]	uniprot2023_01=type=additional;tr	uniprot2023_02=type=main;tr
SymbolChange[A0A8J0SQR4]	uniprot2023_01=med1l	uniprot2023_02=med1
SymbolChange[Q28CH5]	uniprot2023_01=usp20	uniprot2023_02=ssbp3
SymbolChange[A0A6I8QJ71]	uniprot2023_01=c17orf80	uniprot2023_02=c10h17orf80
TypeChange[LOC100495603|A0A8J1JQK8]	uniprot2023_01=type=additional;tr	uniprot2023_02=type=main;tr
TypeChange[dcun1d2|B0BMA1]	uniprot2023_01=type=additional;tr	uniprot2023_02=type=main;tr
SymbolChange[F6ZUW5]	uniprot2023_01=aadacl4	uniprot2023_02=cfap107
SymbolChange[B0BM35]	uniprot2023_01=wnt9b	uniprot2023_02=msra.2
SymbolChange[B0BM99]	uniprot2023_01=slc8a1	uniprot2023_02=cfap161
SymbolChange[A0A8J0SPY3]	uniprot2023_01=MGC69416	uniprot2023_02=mgc69416
SymbolChange[F6TBS4]	uniprot2023_01=trpm8	uniprot2023_02=trpm8b
TypeChange[negr1|A0A803K146]	uniprot2023_01=type=additional;tr	uniprot2023_02=type=main;tr
SymbolChange[A0A8J0T1S8]	uniprot2023_01=LOC100488346	uniprot2023_02=atp2b2
TypeChange[c9orf135|A0A8J1IMD4]	uniprot2023_01=type=additional;tr	uniprot2023_02=type=main;tr
TypeChange[gpr26|F6TCM5]	uniprot2023_01=type=additional;tr	uniprot2023_02=type=main;tr
TypeChange[rrm2.1|F6VJ70]	uniprot2023_01=type=additional;tr	uniprot2023_02=type=main;tr
SymbolChange[A0A8J0T4Y8]	uniprot2023_01=LOC100144286	uniprot2023_02=XB5730431
SymbolChange[A0A6I8QY01]	uniprot2023_01=tnks2	uniprot2023_02=tnks
SymbolChange[A0A8J0PK53]	uniprot2023_01=mhc1b2	uniprot2023_02=mhc1b-uba13.2
SymbolChange[F7DME1]	uniprot2023_01=gpat3	uniprot2023_02=ncapg2
SymbolChange[A0A8J0SST2]	uniprot2023_01=LOC100144919	uniprot2023_02=XB5850668
TypeChange[cd28|A8E5W7]	uniprot2023_01=type=additional;tr	uniprot2023_02=type=main;tr
SymbolChange[Q28HC8]	uniprot2023_01=cyp2c19	uniprot2023_02=elmod2
TypeChange[LOC100490553|A0A8J1IP45]	uniprot2023_01=type=additional;tr	uniprot2023_02=type=main;tr
SymbolChange[A0A8J0QLH8]	uniprot2023_01=LOC100490531	uniprot2023_02=pcbp1
SymbolChange[A0A8J0QLU4]	uniprot2023_01=fam92b	uniprot2023_02=cibar2
SymbolChange[A0A8J0T3Q9]	uniprot2023_01=LOC100498039	uniprot2023_02=XB5950266
SymbolChange[A0A8J0T423]	uniprot2023_01=fgfr1op	uniprot2023_02=cep43
SymbolChange[A0A6I8RZZ4]	uniprot2023_01=mcf2l2	uniprot2023_02=mcf2l.2
SymbolChange[A0A8J0T3I4]	uniprot2023_01=LOC100490553	uniprot2023_02=mhc1b-uba6.1
SymbolChange[Q28GL9]	uniprot2023_01=ccdc181	uniprot2023_02=pabpn1l
TypeChange[uchl3|Q28GY5]	uniprot2023_01=type=additional;tr	uniprot2023_02=type=main;tr
TypeChange[tas2r39|Q2AB43]	uniprot2023_01=type=additional;tr	uniprot2023_02=type=main;tr
SymbolChange[F7ADP0]	uniprot2023_01=pgc-like.1	uniprot2023_02=XB964428
SymbolChange[A0A8J0R0U6]	uniprot2023_01=atp2b2	uniprot2023_02=atp2b4
SymbolChange[A0A8J0R0Z5]	uniprot2023_01=LOC101731543	uniprot2023_02=XB22061515
TypeChange[c2orf76|A0A8J1IRQ4]	uniprot2023_01=type=additional;tr	uniprot2023_02=type=main;tr
SymbolChange[A0A8J0SUW4]	uniprot2023_01=LOC100127872	uniprot2023_02=XB5818974
SymbolChange[A0A8J0T786]	uniprot2023_01=LOC100490531	uniprot2023_02=pcbp1
SymbolChange[Q28FQ9]	uniprot2023_01=clstn1	uniprot2023_02=pfdn5
SymbolChange[A0A6I8QW47]	uniprot2023_01=krt17	uniprot2023_02=krt19
TypeChange[smim11a|A0A8J1J3J2]	uniprot2023_01=type=additional;tr	uniprot2023_02=type=main;tr
TypeChange[gtf3c5|A0A6I8RZA6]	uniprot2023_01=type=additional;tr	uniprot2023_02=type=main;tr
SymbolChange[A0A8J0T6A6]	uniprot2023_01=LOC100490531	uniprot2023_02=pcbp1
TypeChange[alx1|A0A6R5AD90]	uniprot2023_01=type=additional;tr	uniprot2023_02=type=main;tr
SymbolChange[A0A8J0R0A6]	uniprot2023_01=LOC100498440	uniprot2023_02=XB5905938
SymbolChange[A0A8J0T644]	uniprot2023_01=c15orf41	uniprot2023_02=cdin1
TypeChange[shisa2|A0A6I8S9Q8]	uniprot2023_01=type=additional;tr	uniprot2023_02=type=main;tr
SymbolChange[A0A6I8PRV0]	uniprot2023_01=rrm2.2	uniprot2023_02=rrm2.1
SymbolChange[A0A8J0R2Y5]	uniprot2023_01=atp2b2	uniprot2023_02=atp2b4
SymbolChange[A0A6I8PQC7]	uniprot2023_01=42Sp43	uniprot2023_02=42sp43
TypeChange[LOC100489834|A0A8J1ITS8]	uniprot2023_01=type=additional;tr	uniprot2023_02=type=main;tr
SymbolChange[A0A6I8QTQ6]	uniprot2023_01=ddx58	uniprot2023_02=rigi
TypeChange[LOC394448|A0A8J0SX26]	uniprot2023_01=type=additional;tr	uniprot2023_02=type=main;tr
TypeChange[krt78.3|A0A8J0QQK0]	uniprot2023_01=type=additional;tr	uniprot2023_02=type=main;tr
SymbolChange[A0A8J0R2E2]	uniprot2023_01=LOC100498440	uniprot2023_02=XB5905938
SymbolChange[A0A8J0R270]	uniprot2023_01=LOC100497555	uniprot2023_02=XB5721690
SymbolChange[A4QNC3]	uniprot2023_01=ppm1e	uniprot2023_02=prkag1
SymbolChange[A8WGY9]	uniprot2023_01=map3k1	uniprot2023_02=negr1
SymbolChange[A0A6I8R4E5]	uniprot2023_01=arsk	uniprot2023_02=rfesd
TypeChange[MGC108147|A0A8J0SVZ9]	uniprot2023_01=type=additional;tr	uniprot2023_02=type=main;tr
SymbolChange[A4QNP6]	uniprot2023_01=vegfb	uniprot2023_02=bcl7b
SymbolChange[A0A6I8Q1T3]	uniprot2023_01=kmt2d	uniprot2023_02=prkag1
TypeChange[btn1a1|A8WH06]	uniprot2023_01=type=additional;tr	uniprot2023_02=type=main;tr
TypeChange[cisd3|A8WH31]	uniprot2023_01=type=additional;tr	uniprot2023_02=type=main;tr
TypeChange[slc25a39|A0A8J0SZH5]	uniprot2023_01=type=additional;tr	uniprot2023_02=type=main;tr
SymbolChange[Q6P7M2]	uniprot2023_01=mcoln2	uniprot2023_02=gna11
SymbolChange[A0A6I8S6H9]	uniprot2023_01=XB1011895	uniprot2023_02=wwox
SymbolChange[A0A8J0R595]	uniprot2023_01=LOC100486434	uniprot2023_02=XB5891720
SymbolChange[A0A8J0S894]	uniprot2023_01=phka2	uniprot2023_02=phka1p1
SymbolChange[A0A6I8R3H6]	uniprot2023_01=mcf2l2	uniprot2023_02=mcf2l.2
SymbolChange[A0A8J0R4Z3]	uniprot2023_01=LOC100490531	uniprot2023_02=pcbp1
SymbolChange[Q6P8D6]	uniprot2023_01=pde4c	uniprot2023_02=vrk1
TypeChange[LOC100492268|A0A8J1J7T1]	uniprot2023_01=type=additional;tr	uniprot2023_02=type=main;tr
SymbolChange[Q6P8A4]	uniprot2023_01=plcl2	uniprot2023_02=rgmb
SymbolChange[A0A8J0SYC6]	uniprot2023_01=LOC100490531	uniprot2023_02=pcbp1
SymbolChange[A0A8J0R453]	uniprot2023_01=LOC100486056	uniprot2023_02=XB5896327
TypeChange[LOC100490531|A0A8J1IUW3]	uniprot2023_01=type=additional;tr	uniprot2023_02=type=main;tr
TypeChange[LOC100144286|A0A8J1JXY6]	uniprot2023_01=type=additional;tr	uniprot2023_02=type=main;tr
SymbolChange[A0A8J0R3L7]	uniprot2023_01=atp2b2	uniprot2023_02=atp2b4
TypeChange[fam241b|A0A803J5N6]	uniprot2023_01=type=additional;tr	uniprot2023_02=type=main;tr
SymbolChange[A0A6I8RBD0]	uniprot2023_01=tbc1d8b	uniprot2023_02=tbc1d8
SymbolChange[A0A8J0QV37]	uniprot2023_01=LOC100492268	uniprot2023_02=XB5732857
SymbolChange[A0A8J0QUV5]	uniprot2023_01=LOC100486434	uniprot2023_02=XB5891720
SymbolChange[A0A8J0R788]	uniprot2023_01=LOC100490531	uniprot2023_02=pcbp1
SymbolChange[F7DDI8]	uniprot2023_01=hacl1	uniprot2023_02=colq
SymbolChange[Q38JW3]	uniprot2023_01=IL-9	uniprot2023_02=il9
SymbolChange[A0A8J0R615]	uniprot2023_01=LOC100486056	uniprot2023_02=XB5896327
TypeChange[prr29|A0A8J0QU36]	uniprot2023_01=type=additional;tr	uniprot2023_02=type=main;tr
SymbolChange[A0A8J0R5U8]	uniprot2023_01=ccdc151	uniprot2023_02=odad3
SymbolChange[A0A8J0S8I8]	uniprot2023_01=LOC100170427	uniprot2023_02=XB5882685
SymbolChange[A0A8J0SZN2]	uniprot2023_01=LOC100490531	uniprot2023_02=pcbp1
SymbolChange[A0A8J0S8M0]	uniprot2023_01=smim11a	uniprot2023_02=smim11
SymbolChange[A0A1B8Y763]	uniprot2023_01=LOC100497639	uniprot2023_02=LOC100492724
SymbolChange[A0A1B8Y7H5]	uniprot2023_01=LOC105945166	uniprot2023_02=LOC101732679
SymbolChange[A0A8J0QX54]	uniprot2023_01=LOC100493594	uniprot2023_02=XB22169588
SymbolChange[A0A803JBY4]	uniprot2023_01=sec31b	uniprot2023_02=ndufb8
SymbolChange[A0A6I8SAW3]	uniprot2023_01=gpd1	uniprot2023_02=cox14
SymbolChange[Q5M8D8]	uniprot2023_01=twf2	uniprot2023_02=fam241b
SymbolChange[A0A8J0R7V5]	uniprot2023_01=LOC100486434	uniprot2023_02=XB5891720
SymbolChange[A0A6I8SBT5]	uniprot2023_01=rnf112	uniprot2023_02=mfap4.1
TypeChange[tbc1d8b|A0A8J0Q8F5]	uniprot2023_01=type=additional;tr	uniprot2023_02=type=main;tr
SymbolChange[A0A8J0R7M0]	uniprot2023_01=LOC100490531	uniprot2023_02=pcbp1
SymbolChange[A0A8J0QYR2]	uniprot2023_01=atp2b2	uniprot2023_02=atp2b4
SymbolChange[A0A8J0QYR5]	uniprot2023_01=LOC100498440	uniprot2023_02=XB5905938
SymbolChange[A0A8J0QZD0]	uniprot2023_01=LOC100492268	uniprot2023_02=XB5732857
SymbolChange[A0A803KBJ6]	uniprot2023_01=LOC105945166	uniprot2023_02=btn2a1
SymbolChange[A0A8J0QYD3]	uniprot2023_01=LOC100497555	uniprot2023_02=XB5721690
SymbolChange[A0A8J0QY68]	uniprot2023_01=LOC100498440	uniprot2023_02=XB5905938
SymbolChange[Q5I029]	uniprot2023_01=caskin1	uniprot2023_02=ctrb2
TypeChange[LOC100490956|A0A8J1JBN3]	uniprot2023_01=type=additional;tr	uniprot2023_02=type=main;tr
SymbolChange[B3DLC6]	uniprot2023_01=asap2	uniprot2023_02=nfkbiz
TypeChange[ints15|B7ZUG7]	uniprot2023_01=type=additional;tr	uniprot2023_02=type=main;tr
TypeChange[mrps31|Q0V9E5]	uniprot2023_01=type=additional;tr	uniprot2023_02=type=main;tr
TypeChange[kpna6|Q642T8]	uniprot2023_01=type=additional;tr	uniprot2023_02=type=main;tr
TypeChange[crygdl.17|A0A8J0SAF9]	uniprot2023_01=type=additional;tr	uniprot2023_02=type=main;tr
SymbolChange[A0A8J0SE77]	uniprot2023_01=fgfr1op	uniprot2023_02=cep43
SymbolChange[B3DM74]	uniprot2023_01=frk	uniprot2023_02=c12orf40
TypeChange[h2bc12|Q6AZK7]	uniprot2023_01=type=additional;tr	uniprot2023_02=type=main;tr
SymbolChange[F6V4C4]	uniprot2023_01=ganab	uniprot2023_02=ints5
SymbolChange[A0A8J0SGE0]	uniprot2023_01=ttll13p	uniprot2023_02=ttll13
SymbolChange[F7CWA1]	uniprot2023_01=phyhdla.1	uniprot2023_02=phyhdla.3
SymbolChange[A0A6I8RFN3]	uniprot2023_01=pycr1	uniprot2023_02=mafg
SymbolChange[A0A803KK98]	uniprot2023_01=ehd1	uniprot2023_02=ehd3
TypeChange[LOC100492579|A0A8J1JFZ8]	uniprot2023_01=type=additional;tr	uniprot2023_02=type=main;tr
TypeChange[rps17|F7B301]	uniprot2023_01=type=additional;tr	uniprot2023_02=type=main;tr
SymbolChange[F7D8V7]	uniprot2023_01=phtf1	uniprot2023_02=rsbn1
TypeChange[gpm6b|Q6DFR6]	uniprot2023_01=type=additional;tr	uniprot2023_02=type=main;tr
TypeChange[LOC100379842|A0A8J1JEQ1]	uniprot2023_01=type=additional;tr	uniprot2023_02=type=main;tr
SymbolChange[F6RI40]	uniprot2023_01=usp49	uniprot2023_02=chia
SymbolChange[A0A1B8YA01]	uniprot2023_01=chadl	uniprot2023_02=adcyap1r1
SymbolChange[A0A803KL58]	uniprot2023_01=baf-l	uniprot2023_02=myoz2
SymbolChange[Q6DEQ5]	uniprot2023_01=scml4	uniprot2023_02=rbm6
TypeChange[maz|A0A803JFE1]	uniprot2023_01=type=additional;tr	uniprot2023_02=type=main;tr
SymbolChange[F7CV21]	uniprot2023_01=tdp1	uniprot2023_02=kcnk13
SymbolChange[A4IIA1]	uniprot2023_01=pgs1	uniprot2023_02=slc25a39
SymbolChange[A0A8J0SGT9]	uniprot2023_01=LOC100491633	uniprot2023_02=XB5759208
SymbolChange[A4IHW0]	uniprot2023_01=smpd3	uniprot2023_02=gck
TypeChange[ppm1a|A4IHV9]	uniprot2023_01=type=additional;tr	uniprot2023_02=type=main;tr
