NoID: >lcl|NC_030677.2_cds_162 [gene=LOC116408412] [db_xref=GeneID:116408412] [protein=immunoglobulin kappa variable 3-20-like] [exception=rearrangement required for product] [location=complement(join(9468255..9468562,9468704..9468803))] [gbkey=CDS]
NoID: >lcl|NC_030677.2_cds_163 [gene=LOC116408411] [db_xref=GeneID:116408411] [protein=immunoglobulin kappa variable 3-20-like] [exception=rearrangement required for product] [location=complement(join(9531691..9531998,9532097..9532196))] [gbkey=CDS]
NoID: >lcl|NC_030677.2_cds_164 [gene=LOC101735157] [db_xref=GeneID:101735157] [protein=immunoglobulin kappa variable 4-1-like] [exception=rearrangement required for product] [location=complement(join(9602580..9602902,9603002..9603101))] [gbkey=CDS]
NoID: >lcl|NC_030677.2_cds_166 [gene=LOC116408414] [db_xref=GeneID:116408414] [protein=immunoglobulin kappa variable 3-20-like] [exception=rearrangement required for product] [location=complement(join(9622174..9622493,9622582..9622630))] [gbkey=CDS]
NoID: >lcl|NC_030677.2_cds_167 [gene=LOC116408413] [db_xref=GeneID:116408413] [protein=immunoglobulin kappa variable 3-20-like] [exception=rearrangement required for product] [location=complement(join(9624706..9625025,9625115..9625163))] [gbkey=CDS]
NoID: >lcl|NC_030677.2_cds_168 [gene=LOC101730301] [db_xref=GeneID:101730301] [protein=immunoglobulin kappa variable 3-20-like] [exception=rearrangement required for product] [location=complement(join(9633681..9634006,9634096..9634144))] [gbkey=CDS]
NoID: >lcl|NC_030677.2_cds_169 [gene=LOC116408416] [db_xref=GeneID:116408416] [protein=immunoglobulin kappa variable 3-11-like] [exception=rearrangement required for product] [location=complement(join(9646936..9647243,9647398..9647446))] [gbkey=CDS]
NoID: >lcl|NC_030677.2_cds_171 [gene=LOC105945703] [db_xref=GeneID:105945703] [protein=immunoglobulin kappa variable 3-20-like] [exception=rearrangement required for product] [location=complement(join(9665050..9665357,9665447..9665495))] [gbkey=CDS]
NoID: >lcl|NC_030677.2_cds_176 [gene=LOC116408415] [db_xref=GeneID:116408415] [protein=immunoglobulin kappa variable 3-20-like] [exception=rearrangement required for product] [location=complement(join(9754328..9754644,9754734..9754782))] [gbkey=CDS]
NoID: >lcl|NC_030677.2_cds_177 [gene=LOC116408262] [db_xref=GeneID:116408262] [protein=immunoglobulin kappa variable 6D-21-like] [exception=rearrangement required for product] [location=complement(join(9758193..9758512,9758602..9758650))] [gbkey=CDS]
NoID: >lcl|NC_030677.2_cds_178 [gene=LOC116408417] [db_xref=GeneID:116408417] [protein=immunoglobulin kappa variable 6D-21-like] [exception=rearrangement required for product] [location=complement(join(9762167..9762474,9762564..9762612))] [gbkey=CDS]
NoID: >lcl|NC_030677.2_cds_179 [gene=LOC116408418] [db_xref=GeneID:116408418] [protein=immunoglobulin kappa variable 6D-21-like] [exception=rearrangement required for product] [location=complement(join(9767516..9767823,9767913..9767961))] [gbkey=CDS]
NoID: >lcl|NC_030677.2_cds_2488 [gene=LOC116408314] [db_xref=GeneID:116408314] [protein=Ig kappa chain V-V region K2-like] [exception=rearrangement required for product] [location=join(101069684..101069729,101069816..101070171)] [gbkey=CDS]
NoID: >lcl|NC_030677.2_cds_2489 [gene=LOC108648378] [db_xref=GeneID:108648378] [protein=immunoglobulin lambda variable 1-51-like] [exception=rearrangement required for product] [location=join(101090854..101090899,101090983..101091518)] [gbkey=CDS]
NoID: >lcl|NC_030677.2_cds_2490 [gene=LOC105945765] [db_xref=GeneID:105945765] [protein=immunoglobulin lambda variable 1-44-like] [exception=rearrangement required for product] [location=join(101103298..101103343,101103426..101103784)] [gbkey=CDS]
NoID: >lcl|NC_030677.2_cds_2491 [gene=LOC108648379] [db_xref=GeneID:108648379] [protein=immunoglobulin lambda variable 1-47-like] [exception=rearrangement required for product] [location=join(101112232..101112277,101112360..101112730)] [gbkey=CDS]
NoID: >lcl|NC_030677.2_cds_3706 [gene=LOC101730959] [db_xref=GeneID:101730959] [protein=Ig gamma-1 chain C region, membrane-bound form-like] [exception=rearrangement required for product] [location=complement(join(140521599..140521655,140521856..140521980,140522730..140522759,140524689..140524718,140528469..140528807,140529155..140529161))] [gbkey=CDS]
NoID: >lcl|NC_030677.2_cds_3707 [gene=LOC116412143] [db_xref=GeneID:116412143] [protein=immunoglobulin heavy constant gamma 1-like] [exception=rearrangement required for product] [location=complement(join(140554337..140554656,140556032..140556349,140556755..140557078,140558214..140558513,140563308..140563446))] [gbkey=CDS]
NoID: >lcl|NC_030677.2_cds_3712 [gene=LOC116406688] [db_xref=GeneID:116406688] [protein=immunoglobulin heavy variable 4-59-like] [exception=rearrangement required for product] [location=complement(join(140710421..140710749,140710837..140710882))] [gbkey=CDS]
NoID: >lcl|NC_030677.2_cds_3713 [gene=LOC108645683] [db_xref=GeneID:108645683] [protein=immunoglobulin heavy variable 3-66-like] [exception=rearrangement required for product] [location=complement(join(140715189..140715517,140715604..140715649))] [gbkey=CDS]
NoID: >lcl|NC_030677.2_cds_3714 [gene=LOC108645684] [db_xref=GeneID:108645684] [protein=immunoglobulin heavy variable 3-53-like] [exception=rearrangement required for product] [location=complement(join(140724503..140724831,140735236..140735281))] [gbkey=CDS]
NoID: >lcl|NC_030677.2_cds_3715 [gene=LOC116406689] [db_xref=GeneID:116406689] [protein=immunoglobulin heavy variable 3-53-like] [exception=rearrangement required for product] [location=complement(join(140742571..140742899,140742988..140743033))] [gbkey=CDS]
NoID: >lcl|NC_030677.2_cds_3716 [gene=LOC116412146] [db_xref=GeneID:116412146] [protein=Ig heavy chain V region 914-like] [exception=rearrangement required for product] [location=complement(join(140755539..140755864,140755955..140756000))] [gbkey=CDS]
NoID: >lcl|NC_030677.2_cds_3718 [gene=LOC116412153] [db_xref=GeneID:116412153] [protein=immunoglobulin heavy variable 4-61-like] [exception=rearrangement required for product] [location=complement(join(140812045..140812427,140812501..140812555))] [gbkey=CDS]
NoID: >lcl|NC_030677.2_cds_3719 [gene=LOC116412158] [db_xref=GeneID:116412158] [protein=Ig heavy chain V region PJ14-like] [exception=rearrangement required for product] [location=complement(join(140817042..140817403,140817482..140817527))] [gbkey=CDS]
NoID: >lcl|NC_030677.2_cds_3720 [gene=LOC116412159] [db_xref=GeneID:116412159] [protein=Ig heavy chain V region XIG14-like] [exception=rearrangement required for product] [location=complement(join(140821773..140822098,140822180..140822225))] [gbkey=CDS]
NoID: >lcl|NC_030677.2_cds_3721 [gene=LOC116412162] [db_xref=GeneID:116412162] [protein=Ig heavy chain V region PJ14-like] [exception=rearrangement required for product] [location=complement(join(140917115..140917479,140917559..140917613))] [gbkey=CDS]
NoID: >lcl|NC_030677.2_cds_3722 [gene=LOC116412164] [db_xref=GeneID:116412164] [protein=Ig heavy chain V region XIG8-like] [exception=rearrangement required for product] [location=complement(join(140919836..140920206,140920291..140920336))] [gbkey=CDS]
NoID: >lcl|NC_030677.2_cds_3723 [gene=LOC101732959] [db_xref=GeneID:101732959] [protein=immunoglobulin heavy variable 5-51-like] [exception=rearrangement required for product] [location=complement(join(140950165..140950493,140950578..140950649,140955183..140955320,140955405..140955507))] [gbkey=CDS]
NoID: >lcl|NC_030677.2_cds_3724 [gene=LOC116412174] [db_xref=GeneID:116412174] [protein=Ig heavy chain V region 6.96-like] [exception=rearrangement required for product] [location=complement(join(140961702..140962090,140962182..140962227))] [gbkey=CDS]
NoID: >lcl|NC_030677.2_cds_3725 [gene=LOC101733168] [db_xref=GeneID:101733168] [protein=immunoglobulin heavy variable 3-48-like] [exception=rearrangement required for product] [location=complement(join(140970253..140970409,140975544..140975781,140975873..140975918))] [gbkey=CDS]
NoID: >lcl|NC_030677.2_cds_3726 [gene=LOC101733218] [db_xref=GeneID:101733218] [protein=immunoglobulin heavy variable 5-10-1-like] [exception=rearrangement required for product] [location=complement(join(140983823..140984151,140984236..140984278))] [gbkey=CDS]
NoID: >lcl|NC_030677.2_cds_3727 [gene=LOC116412182] [db_xref=GeneID:116412182] [protein=Ig heavy chain V region 914-like] [exception=rearrangement required for product] [location=complement(join(141007992..141008163,141013288..141013450,141013527..141013572))] [gbkey=CDS]
NoID: >lcl|NC_030677.2_cds_3728 [gene=LOC101733867] [db_xref=GeneID:101733867] [protein=Ig heavy chain V region XIG14-like] [exception=rearrangement required for product] [location=complement(join(141083445..141083782,141084597..141084621))] [gbkey=CDS]
NoID: >lcl|NC_030677.2_cds_3730 [gene=LOC101734352] [db_xref=GeneID:101734352] [protein=Ig heavy chain V region XIG8-like] [exception=rearrangement required for product] [location=complement(join(141160594..141160931,141162076..141162106))] [gbkey=CDS]
NoID: >lcl|NC_030677.2_cds_3731 [gene=LOC105946447] [db_xref=GeneID:105946447] [protein=Ig heavy chain V region XIG14-like] [exception=rearrangement required for product] [location=complement(join(141165189..141165526,141167170..141167206))] [gbkey=CDS]
NoID: >lcl|NC_030677.2_cds_3732 [gene=LOC108645686] [db_xref=GeneID:108645686] [protein=Ig heavy chain V region XIG14-like] [exception=rearrangement required for product] [location=complement(join(141176323..141176660,141178009..141178012))] [gbkey=CDS]
NoID: >lcl|NC_030677.2_cds_3733 [gene=LOC108645687] [db_xref=GeneID:108645687] [protein=immunoglobulin heavy variable 3-66-like] [exception=rearrangement required for product] [location=complement(join(141180967..141181313,141181401..141181446))] [gbkey=CDS]
NoID: >lcl|NC_030677.2_cds_3734 [gene=LOC101734807] [db_xref=GeneID:101734807] [protein=immunoglobulin heavy variable 3-43-like] [exception=rearrangement required for product] [location=complement(join(141212000..141212310,141212386..141212431))] [gbkey=CDS]
NoID: >lcl|NC_030677.2_cds_3735 [gene=LOC116412202] [db_xref=GeneID:116412202] [protein=Ig heavy chain V region 914-like] [exception=rearrangement required for product] [location=complement(join(141214734..141215056,141215132..141215177))] [gbkey=CDS]
NoID: >lcl|NC_030677.2_cds_3736 [gene=LOC101735293] [db_xref=GeneID:101735293] [protein=immunoglobulin heavy variable 3-74-like] [exception=rearrangement required for product] [location=complement(join(141217894..141218221,141218297..141218342))] [gbkey=CDS]
NoID: >lcl|NC_030677.2_cds_3740 [gene=LOC116406700] [db_xref=GeneID:116406700] [protein=T cell receptor alpha variable 21-like] [exception=rearrangement required for product] [location=complement(join(141609146..141609441,141609916..141609964))] [gbkey=CDS]
NoID: >lcl|NC_030677.2_cds_3741 [gene=LOC116406697] [db_xref=GeneID:116406697] [protein=T cell receptor alpha variable 1-2-like] [exception=rearrangement required for product] [location=complement(join(141645865..141646196,141646479..141646515))] [gbkey=CDS]
NoID: >lcl|NC_030677.2_cds_3744 [gene=LOC116406509] [db_xref=GeneID:116406509] [protein=T cell receptor alpha variable 19-like] [exception=rearrangement required for product] [location=complement(join(141763129..141763436,141763527..141763572))] [gbkey=CDS]
NoID: >lcl|NC_030677.2_cds_3745 [gene=LOC116406703] [db_xref=GeneID:116406703] [protein=T cell receptor alpha variable 9-2-like] [exception=rearrangement required for product] [location=complement(join(141767426..141767781,141767859..141767907))] [gbkey=CDS]
NoID: >lcl|NC_030677.2_cds_3750 [gene=LOC101731734] [db_xref=GeneID:101731734] [protein=immunoglobulin heavy variable 5-10-1-like] [exception=rearrangement required for product] [location=join(141830415..141830457,141830542..141830876)] [gbkey=CDS]
NoID: >lcl|NC_030677.2_cds_3751 [gene=LOC116412217] [db_xref=GeneID:116412217] [protein=immunoglobulin heavy variable 5-51-like] [exception=rearrangement required for product] [location=join(141834531..141834573,141834652..141834983)] [gbkey=CDS]
NoID: >lcl|NC_030677.2_cds_4299 [gene=LOC101735097] [db_xref=GeneID:101735097] [protein=immunoglobulin lambda variable 5-37-like] [exception=rearrangement required for product] [location=join(153221554..153221599,153221896..153222284)] [gbkey=CDS]
NoID: >lcl|NC_030677.2_cds_4300 [gene=LOC116407069] [db_xref=GeneID:116407069] [protein=immunoglobulin lambda variable 8-61-like] [exception=rearrangement required for product] [location=join(153225037..153225082,153225168..153225523)] [gbkey=CDS]
NoID: >lcl|NC_030677.2_cds_4301 [gene=LOC116407074] [db_xref=GeneID:116407074] [protein=immunoglobulin lambda variable 8-61-like] [exception=rearrangement required for product] [location=join(153232174..153232219,153232305..153232660)] [gbkey=CDS]
NoID: >lcl|NC_030677.2_cds_4302 [gene=LOC116412299] [db_xref=GeneID:116412299] [protein=immunoglobulin lambda variable 8-61-like] [exception=rearrangement required for product] [location=join(153237924..153237969,153238055..153238410)] [gbkey=CDS]
NoID: >lcl|NC_030677.2_cds_4303 [gene=LOC116407072] [db_xref=GeneID:116407072] [protein=immunoglobulin lambda variable 8-61-like] [exception=rearrangement required for product] [location=join(153242599..153242644,153242730..153243085)] [gbkey=CDS]
NoID: >lcl|NC_030677.2_cds_4304 [gene=LOC116412301] [db_xref=GeneID:116412301] [protein=immunoglobulin lambda variable 8-61-like] [exception=rearrangement required for product] [location=join(153244682..153244727,153244811..153245157)] [gbkey=CDS]
NoID: >lcl|NC_030677.2_cds_4305 [gene=LOC108645239] [db_xref=GeneID:108645239] [protein=immunoglobulin lambda variable 5-39-like] [exception=rearrangement required for product] [location=join(153253112..153253157,153253527..153253909)] [gbkey=CDS]
NoID: >lcl|NC_030677.2_cds_4306 [gene=LOC116407119] [db_xref=GeneID:116407119] [protein=immunoglobulin lambda variable 5-52-like] [exception=rearrangement required for product] [location=join(153258970..153259015,153259148..153259494)] [gbkey=CDS]
NoID: >lcl|NC_030677.2_cds_4308 [gene=LOC108645690] [db_xref=GeneID:108645690] [protein=immunoglobulin lambda variable 5-39-like] [exception=rearrangement required for product] [location=join(153284859..153284904,153284986..153285332)] [gbkey=CDS]
NoID: >lcl|NC_030677.2_cds_4310 [gene=LOC116407151] [db_xref=GeneID:116407151] [protein=immunoglobulin lambda variable 5-39-like] [exception=rearrangement required for product] [location=join(153296086..153296131,153296213..153296553)] [gbkey=CDS]
NoID: >lcl|NC_030677.2_cds_4311 [gene=LOC116407135] [db_xref=GeneID:116407135] [protein=immunoglobulin lambda variable 5-39-like] [exception=rearrangement required for product] [location=join(153299768..153299813,153299895..153300235)] [gbkey=CDS]
NoID: >lcl|NC_030677.2_cds_4312 [gene=LOC105948241] [db_xref=GeneID:105948241] [protein=probable non-functional immunoglobulin lambda variable 5-48] [exception=rearrangement required for product] [location=join(153309414..153309459,153309541..153309887)] [gbkey=CDS]
NoID: >lcl|NC_030677.2_cds_4314 [gene=LOC105945882] [db_xref=GeneID:105945882] [protein=immunoglobulin lambda variable 3-9-like] [exception=rearrangement required for product] [location=join(153317028..153317124,153317207..153317508)] [gbkey=CDS]
NoID: >lcl|NC_030677.2_cds_4315 [gene=LOC116407167] [db_xref=GeneID:116407167] [protein=immunoglobulin lambda variable 3-9-like] [exception=rearrangement required for product] [location=join(153346876..153346921,153347004..153347305)] [gbkey=CDS]
NoID: >lcl|NC_030677.2_cds_4316 [gene=LOC101733767] [db_xref=GeneID:101733767] [protein=immunoglobulin lambda variable 3-9-like] [exception=rearrangement required for product] [location=join(153351557..153351602,153351685..153351992)] [gbkey=CDS]
NoID: >lcl|NC_030683.2_cds_29544 [gene=LOC101733817] [db_xref=GeneID:101733817] [protein=T cell receptor beta variable 29-1-like] [exception=rearrangement required for product] [location=join(378521..378566,378874..379217)] [gbkey=CDS]
NoID: >lcl|NC_030683.2_cds_29545 [gene=LOC116412120] [db_xref=GeneID:116412120] [protein=T cell receptor beta variable 29-1-like] [exception=rearrangement required for product] [location=join(385911..386052,386184..386527)] [gbkey=CDS]
NoID: >lcl|NC_030683.2_cds_29546 [gene=LOC116412103] [db_xref=GeneID:116412103] [protein=T-cell receptor beta-1 chain C region-like] [exception=rearrangement required for product] [location=complement(join(398526..398546,400848..400954,401083..401100,402688..403008,412685..413036))] [gbkey=CDS]
NoID: >lcl|NC_030683.2_cds_29564 [gene=LOC116412121] [db_xref=GeneID:116412121] [protein=T cell receptor alpha variable 21-like] [exception=rearrangement required for product] [location=complement(join(597676..597745,623902..624319,625267..625312))] [gbkey=CDS]
NoID: >lcl|NC_030683.2_cds_29565 [gene=LOC101730620] [db_xref=GeneID:101730620] [protein=T cell receptor beta variable 28-like] [exception=rearrangement required for product] [location=complement(719115..719552)] [gbkey=CDS]
NoID: >lcl|NC_030683.2_cds_29566 [gene=LOC100493691] [db_xref=GeneID:100493691] [protein=T cell receptor beta variable 20-1-like] [exception=rearrangement required for product] [location=complement(join(721298..721698,722178..722259))] [gbkey=CDS]
NoID: >lcl|NC_030685.2_cds_39481 [gene=LOC100488918] [db_xref=GeneID:100488918] [protein=tyrosine-protein phosphatase non-receptor type substrate 1-like] [exception=rearrangement required for product] [location=complement(join(1114005..1114111,1115104..1115388,1127359..1127658,1127790..1128119,1149930..1150014))] [gbkey=CDS]
NoID: >lcl|NC_030685.2_cds_39482 [gene=LOC101733402] [db_xref=GeneID:101733402] [protein=immunoglobulin heavy constant gamma 2-like] [exception=rearrangement required for product] [location=complement(join(1161982..1162112,1163682..1163966,1164967..1165282))] [gbkey=CDS]
NoID: >lcl|NC_030685.2_cds_39485 [gene=LOC101731890] [db_xref=GeneID:101731890] [protein=immunoglobulin heavy constant gamma 1-like] [partial=5'] [exception=rearrangement required for product] [location=complement(join(1269986..1270107,1272853..1273137,1273585..1273884,1274033..>1274399))] [gbkey=CDS]
NoID: >lcl|NC_030686.2_cds_44261 [gene=LOC100491209] [db_xref=GeneID:100491209] [protein=Ig mu chain C region-like isoform X2] [exception=rearrangement required for product] [location=join(37661552..37661594,37662105..37662446,37665358..37665681,37665779..37665898,37666566..37666916,37667004..37667312,37668046..37668371)] [gbkey=CDS]
MultiID: >lcl|NW_022279350.1_cds_NP_001135626.1_45088 [gene=LOC100216185] [db_xref=GeneID:100216185] [protein=uncharacterized protein LOC100216185] [frame=2] [partial=5'] [exception=annotated by transcript or proteomic data] [protein_id=NP_001135626.1] [location=join(<577..651,10537..10675,13507..13630,17689..17764,17858..17994,22966..23044,23415..23502,24634..24849)] [gbkey=CDS]
MultiID: >lcl|NW_022279431.1_cds_NP_001135591.1_45141 [gene=slc25a34] [db_xref=GeneID:100216146] [protein=solute carrier family 25 member 34] [partial=3'] [exception=annotated by transcript or proteomic data] [protein_id=NP_001135591.1] [location=complement(<729..1116)] [gbkey=CDS]
MultiID: >lcl|NW_022279440.1_cds_NP_001001238.1_45145 [gene=slc31a1] [db_xref=GeneID:407919] [protein=solute carrier family 31 (copper transporter), member 1] [frame=2] [partial=5'] [exception=annotated by transcript or proteomic data] [protein_id=NP_001001238.1] [location=join(<379..549,2329..2530)] [gbkey=CDS]
MultiID: >lcl|NW_022279442.1_cds_NP_001004849.1_45147 [gene=otud5] [db_xref=GeneID:448134] [protein=OTU domain-containing protein 5] [frame=3] [partial=5'] [exception=annotated by transcript or proteomic data] [protein_id=NP_001004849.1] [location=join(<165..229,320..>475,<1927..1932,1934..2054,2545..2666)] [gbkey=CDS]
MultiID: >lcl|NW_022279444.1_cds_NP_989058.1_45148 [gene=prpf4] [db_xref=GeneID:394655] [protein=U4/U6 small nuclear ribonucleoprotein Prp4] [partial=5'] [exception=annotated by transcript or proteomic data] [protein_id=NP_989058.1] [location=join(<202..207,210..404)] [gbkey=CDS]
MultiID: >lcl|NW_022279502.1_cds_NP_001011360.1_45158 [gene=efna3] [db_xref=GeneID:496827] [protein=ephrin A3 precursor] [frame=2] [partial=5',3'] [exception=annotated by transcript or proteomic data] [protein_id=NP_001011360.1] [location=complement(join(<5..8,10..80,223..>512))] [gbkey=CDS]
