adprhl2	GeneID:548938	XB-GENE-944445	ADP-ribose glycohydrolase ARH3
afg3l1p	GeneID:548660	XB-GENE-1014910	AFG3-like AAA ATPase 1, pseudogene
agr3	GeneID:448756	XB-GENE-950741	anterior gradient protein 3
akirin1	GeneID:548834	XB-GENE-5820002	akirin-1
akr1c8p	GeneID:448368	XB-GENE-5757727	aldo-keto reductase family 1, member C8, pseudogene
alkbh8	GeneID:550051	XB-GENE-985927	alkylated DNA repair protein alkB homolog 8
anapc13.1	GeneID:549994	XB-GENE-958927	anaphase-promoting complex subunit 13
anapc16	GeneID:448194	XB-GENE-953456	anaphase-promoting complex subunit 16
aspa	GeneID:733935	XB-GENE-1016250	aspartoacylase
atad1	GeneID:100216041	XB-GENE-5779938	ATPase family AAA domain-containing protein 1
atp5if1	GeneID:100216112	XB-GENE-956790	ATPase inhibitor, mitochondrial
babam2	GeneID:448242	XB-GENE-1032920	BRISC and BRCA1-A complex member 2
bag6	GeneID:100038304	XB-GENE-478689	large proline-rich protein bag6
birc5l	GeneID:733575	XB-GENE-966741	baculoviral IAP repeat-containing protein 5.2
birc7	GeneID:100127811	XB-GENE-5914029	baculoviral IAP repeat-containing protein 7
c11orf54	GeneID:549100	XB-GENE-1010634	ester hydrolase C11orf54 homolog
c15orf41	GeneID:549243	XB-GENE-941818	protein C15orf41 homolog
c16orf91	GeneID:733536	XB-GENE-877214	protein ccsmst1
c19orf54	GeneID:100144997	XB-GENE-5907400	UPF0692 protein C19orf54 homolog
c1orf74	GeneID:496431	XB-GENE-951025	UPF0739 protein C1orf74 homolog
c2cd3	GeneID:780184	XB-GENE-5904944	C2 domain-containing protein 3
calcrl	GeneID:549647	XB-GENE-5736126	calcitonin gene-related peptide type 1 receptor
ccdc22	GeneID:448468	XB-GENE-979496	coiled-coil domain-containing protein 22
ccdc90b	GeneID:448234	XB-GENE-947820	coiled-coil domain-containing protein 90B, mitochondrial
cenpn	GeneID:496510	XB-GENE-945688	centromere protein N
cenpo	GeneID:733516	XB-GENE-963144	centromere protein O
cer1	GeneID:394437	XB-GENE-484971	cerberus
cfap36	GeneID:394695	XB-GENE-988920	cilia- and flagella-associated protein 36
cgn	GeneID:100145755	XB-GENE-1009257	cingulin
chmp3	GeneID:548983	XB-GENE-1005141	charged multivesicular body protein 3
ciapin1	GeneID:100490633	XB-GENE-998244	anamorsin
crisp2-like	GeneID:100495843	NA	allurin
crtac1	GeneID:779826	XB-GENE-5881785	cartilage acidic protein 1
cyb5r4	GeneID:549510	XB-GENE-984179	cytochrome b5 reductase 4
cybrd1	GeneID:548408	XB-GENE-1011687	cytochrome b reductase 1
cystm1	GeneID:549193	XB-GENE-5727646	cysteine-rich and transmembrane domain-containing protein 1
dand5	GeneID:733727	XB-GENE-480809	DAN domain family member 5
dapl1	GeneID:733831	XB-GENE-1014847	death-associated protein-like 1
depdc7	GeneID:779629	XB-GENE-1010065	DEP domain-containing protein 7
dis3l	GeneID:780296	XB-GENE-1013178	DIS3-like exonuclease 1
dis3l2	GeneID:780265	XB-GENE-5958094	DIS3-like exonuclease 2
ecrg4	GeneID:548499	XB-GENE-997587	augurin
egr1	GeneID:100038164	XB-GENE-853412	early growth response protein 1
eif4a3.1	GeneID:100135173	XB-GENE-5773453	eukaryotic initiation factor 4A-III
elavl2	GeneID:594913	XB-GENE-491749	ELAV-like protein 2
elp6	GeneID:493328	XB-GENE-5919888	elongator complex protein 6
fam174a	GeneID:549878	XB-GENE-6538612	membrane protein FAM174
fam50a	GeneID:734115	XB-GENE-970297	protein FAM50A
fam76b	GeneID:548701	XB-GENE-5850810	protein FAM76B
foxc2	GeneID:407875	XB-GENE-481382	forkhead box protein C2
foxd4l1.1	GeneID:549682	XB-GENE-479247	forkhead box protein D5
foxi2	GeneID:549298	XB-GENE-982122	forkhead box protein I2
foxj1	GeneID:496834	XB-GENE-853648	forkhead box protein J1
frmd3	GeneID:779965	XB-GENE-1011845	FERM domain-containing protein 3
fxr1	GeneID:594894	XB-GENE-1004708	fragile X mental retardation syndrome-related protein 1 homolog
fzd7	GeneID:549495	XB-GENE-483731	frizzled-7
gadl1	GeneID:733871	XB-GENE-5721903	acidic amino acid decarboxylase GADL1
galnt11	GeneID:448751	XB-GENE-981830	polypeptide N-acetylgalactosaminyltransferase 11
gba3	GeneID:779892	XB-GENE-954388	glucosidase, beta, acid 3 (gene/pseudogene)
gfod2	GeneID:594979	XB-GENE-5740207	glucose-fructose oxidoreductase domain-containing protein 2
gnrhr2	GeneID:100135415	XB-GENE-5867415	gonadotropin releasing hormone receptor 2 (pseudogene)
gpatch4	GeneID:394573	XB-GENE-922177	G patch domain-containing protein 4
herpud2	GeneID:549572	XB-GENE-5806725	homocysteine-responsive endoplasmic reticulum-resident ubiquitin-like domain member 2 protein
hfm1	GeneID:779837	XB-GENE-5894880	probable ATP-dependent DNA helicase HFM1
hmgxb4	GeneID:594948	XB-GENE-951781	HMG box-containing protein 4
hyou1	GeneID:779444	XB-GENE-921821	hypoxia up-regulated protein 1
ift57	GeneID:549315	XB-GENE-999089	intraflagellar transport protein 57 homolog
ikzf5	GeneID:550109	XB-GENE-978531	zinc finger protein Pegasus
impad1	GeneID:548969	XB-GENE-5751033	inositol monophosphatase 3
insm1	GeneID:779614	XB-GENE-993149	insulinoma-associated protein 1
intu	GeneID:100495950	XB-GENE-919872	protein inturned
kcnrg	GeneID:394457	XB-GENE-987331	putative potassium channel regulatory protein
kif11	GeneID:548870	XB-GENE-978999	kinesin-like protein KIF11
letmd1	GeneID:548776	XB-GENE-962658	LETM1 domain-containing protein 1
limd1	GeneID:549360	XB-GENE-1017238	LIM domain-containing protein 1
lin28a	GeneID:548523	XB-GENE-491384	protein lin-28 homolog A
loxl2	GeneID:100216062	XB-GENE-1010775	lysyl oxidase homolog 2
lrrc9	GeneID:780204	XB-GENE-1011352	leucine-rich repeat-containing protein 9
lsm12	GeneID:394627	XB-GENE-5780031	protein LSM12 homolog
mad2l2	GeneID:448122	XB-GENE-973653	mitotic spindle assembly checkpoint protein MAD2B
maf	GeneID:613051	XB-GENE-6053271	transcription factor Maf
marchf8	GeneID:448095	XB-GENE-944304	E3 ubiquitin-protein ligase MARCH8
marveld2	GeneID:550046	XB-GENE-5839559	MARVEL domain-containing protein 2
mdh1	GeneID:448318	XB-GENE-484872	malate dehydrogenase, cytoplasmic
med31	GeneID:448081	XB-GENE-951034	mediator of RNA polymerase II transcription subunit 31
meis3	GeneID:448474	XB-GENE-485337	homeobox protein meis3
mettl1	GeneID:448504	XB-GENE-1000662	tRNA (guanine-N(7)-)-methyltransferase A
mms19	GeneID:779833	XB-GENE-979258	MMS19 nucleotide excision repair protein homolog
mri1	GeneID:549631	XB-GENE-974909	methylthioribose-1-phosphate isomerase
nit2	GeneID:549387	XB-GENE-946902	omega-amidase NIT2
nmd3	GeneID:394998	XB-GENE-942228	60S ribosomal export protein NMD3
notch1	GeneID:100037842	XB-GENE-479318	neurogenic locus notch homolog protein 1
nphp3	GeneID:780190	XB-GENE-487873	nephrocystin-3
nup188	GeneID:100135081	XB-GENE-5933085	nucleoporin NUP188 homolog
oxr1	GeneID:100127645	XB-GENE-980206	oxidation resistance protein 1
parpbp	GeneID:733805	XB-GENE-1004674	PCNA-interacting partner
pes1	GeneID:395049	XB-GENE-480670	pescadillo homolog
phactr4	GeneID:100145319	XB-GENE-5930004	phosphatase and actin regulator 4
phb2	GeneID:549305	XB-GENE-5844763	prohibitin-2
ppp1r3b	GeneID:548704	XB-GENE-956777	protein phosphatase 1 regulatory subunit 3B
ppp2r2b	GeneID:549212	XB-GENE-946380	serine/threonine-protein phosphatase 2A 55 kDa regulatory subunit B beta isoform
ppp4r2	GeneID:496569	XB-GENE-6258889	serine/threonine-protein phosphatase 4 regulatory subunit 2
prmt2	GeneID:780163	XB-GENE-980934	protein arginine N-methyltransferase 2
ptcd3	GeneID:548397	XB-GENE-961480	pentatricopeptide repeat-containing protein 3, mitochondrial
ptdss2	GeneID:780129	XB-GENE-988429	phosphatidylserine synthase 2
pxdn	GeneID:493201	XB-GENE-923300	peroxidasin
pym1	GeneID:549028	XB-GENE-943122	partner of Y14 and mago
rbm5	GeneID:550032	XB-GENE-494987	RNA-binding protein 5
rgs1	GeneID:496714	XB-GENE-968765	regulator of G-protein signaling 1
rhbg	GeneID:496595	XB-GENE-1009286	ammonium transporter Rh type B
rilpl2	GeneID:780001	XB-GENE-5715323	RILP-like protein 2
rnft1	GeneID:549103	XB-GENE-984035	E3 ubiquitin-protein ligase RNFT1
rnps1	GeneID:548710	XB-GENE-941526	RNA-binding protein with serine-rich domain 1
rsph6a	GeneID:549514	XB-GENE-1014690	radial spoke head protein 6 homolog A
rtn2	GeneID:100135745	XB-GENE-941644	reticulon-2
saal1	GeneID:407882	XB-GENE-5809569	protein saal1
scamp5.1	GeneID:493330	XB-GENE-22061154	secretory carrier-associated membrane protein 5
scg3	GeneID:100125084	XB-GENE-966935	secretogranin-3
scly	GeneID:496582	XB-GENE-485701	selenocysteine lyase
serhl	GeneID:493433	XB-GENE-5751959	serine hydrolase-like (pseudogene)
serpinb1	GeneID:496899	XB-GENE-1217264	leukocyte elastase inhibitor
setd3	GeneID:549331	XB-GENE-1016707	actin-histidine N-methyltransferase
sh2d4a	GeneID:780161	XB-GENE-492416	SH2 domain-containing protein 4A
shisa9	GeneID:100127547	XB-GENE-955578	protein shisa-9
ska3	GeneID:100144945	XB-GENE-994918	spindle and kinetochore-associated protein 3
slc22a15.1	GeneID:448510	XB-GENE-959503	solute carrier family 22 member 15
slc25a46	GeneID:548884	XB-GENE-5803974	solute carrier family 25 member 46
slc35b1	GeneID:395058	XB-GENE-972777	solute carrier family 35 member B1
slc51a-like.1	GeneID:100135183	XB-GENE-5838770	organic solute transporter subunit alpha
sox17b.2	GeneID:100038235	XB-GENE-495335	transcription factor Sox-17-beta.2
spast	GeneID:549207	XB-GENE-947839	spastin
stau2	GeneID:496843	XB-GENE-491508	double-stranded RNA-binding protein Staufen homolog 2
sting1	GeneID:100127621	XB-GENE-5880492	stimulator of interferon genes protein
swi5	GeneID:100135158	XB-GENE-6257718	DNA repair protein SWI5 homolog
taf8	GeneID:549471	XB-GENE-491356	transcription initiation factor TFIID subunit 8
tarbp2	GeneID:595034	XB-GENE-491800	RISC-loading complex subunit tarbp2
tbc1d7	GeneID:549086	XB-GENE-489046	TBC1 domain family member 7
tdp2	GeneID:549698	XB-GENE-967013	tyrosyl-DNA phosphodiesterase 2
tdrd3	GeneID:395019	XB-GENE-949075	tudor domain-containing protein 3
tdrd7	GeneID:496822	XB-GENE-944683	tudor domain-containing protein 7
tecpr1	GeneID:100135077	XB-GENE-5865975	tectonin beta-propeller repeat-containing protein 1
terf2ip	GeneID:779476	XB-GENE-5905850	telomeric repeat-binding factor 2-interacting protein 1
tfip11	GeneID:100038256	XB-GENE-984521	tuftelin-interacting protein 11
tha1p	GeneID:594999	XB-GENE-972838	threonine aldolase 1 pseudogene
tmem209	GeneID:496808	XB-GENE-976000	transmembrane protein 209
tmem231	GeneID:100145127	XB-GENE-1011804	transmembrane protein 231
tmem251	GeneID:497000	XB-GENE-971513	transmembrane protein 251
tmem30cp	GeneID:448286	XB-GENE-946884	transmembrane protein 30C, pseudogene
trabd2a	GeneID:100491951	XB-GENEPAGE-6050973	metalloprotease TIKI1
tut1	GeneID:100127188	XB-GENE-491663	speckle targeted PIP5K1A-regulated poly(A) polymerase
ubiad1	GeneID:549292	XB-GENE-963273	ubiA prenyltransferase domain-containing protein 1
usp15	GeneID:100158604	XB-GENE-1008519	ubiquitin carboxyl-terminal hydrolase 15
usp16	GeneID:447956	XB-GENE-1007164	ubiquitin carboxyl-terminal hydrolase 16
usp30	GeneID:733894	XB-GENE-981069	ubiquitin carboxyl-terminal hydrolase 30
usp33	GeneID:548982	XB-GENE-1016674	ubiquitin carboxyl-terminal hydrolase 33
uvssa	GeneID:100135095	XB-GENE-5833232	UV-stimulated scaffold protein A
vegt	GeneID:394452	XB-GENE-1033829	T-box protein VegT
ventx1.2	GeneID:394455	XB-GENE-920868	homeobox protein vent1
wdr26	GeneID:733878	XB-GENE-993726	WD repeat-containing protein 26
zc3h15	GeneID:548859	XB-GENE-5800360	zinc finger CCCH domain-containing protein 15
zfp36l2	GeneID:100125029	XB-GENE-971012	mRNA decay activator protein ZFP36L2
znf143	GeneID:595042	XB-GENE-1012504	zinc finger protein 143
znf346	GeneID:100135716	XB-GENE-967544	zinc finger protein 346
