tbc1d24.L	XB-GENE-981686	GeneID:100036814	N.A.	TBC1 domain family member 24 L homeolog
cxcl8a.L	XB-GENE-6256174	GeneID:100036815	N.A.	C-X-C motif chemokine ligand 8a gene 1 L homeolog
c4h11orf58.L	XB-GENE-6255507	GeneID:100037094	N.A.	chromosome 4 C11orf58 homolog L homeolog
kgd4.S	XB-GENE-6488649	GeneID:100037103	N.A.	alpha-ketoglutarate dehydrogenase subunit 4 S homeolog
prpf4.L	XB-GENE-6255248	GeneID:100037169	N.A.	pre-mRNA processing factor kinase PRP4K L homeolog
cyp2a6.L	XB-GENE-5903970	GeneID:100037191	N.A.	cytochrome P450 family 2 subfamily A member 6 gene 1 L homeolog
tha1.L	XB-GENE-972843	GeneID:100037219	N.A.	threonine aldolase 1 L homeolog
c9_10h17orf58.L	XB-GENE-6253947	GeneID:100049720	N.A.	chromosome 9-_10 c17orf58 homolog  L homeolog
timp1.L	XB-GENE-5797903	GeneID:100049771	N.A.	TIMP metallopeptidase inhibitor 1 L homeolog
nherf4.L	XB-GENE-865583	GeneID:100101295	N.A.	NHERF family PDZ scaffold protein 4 L homeolog
rnf220.L	XB-GENE-865514	GeneID:100101303	N.A.	ring finger protein 220, gene 1 L homeolog
gpr12l.L	XB-GENE-5793169	GeneID:100126607	N.A.	G protein-coupled receptor 12 like L homeolog
st3gal8.L	XB-GENE-5928563	GeneID:100126621	N.A.	ST3 beta-galactoside alpha-2,3-sialyltransferase 8 L homeolog
stk35l.L	XB-GENE-6252767	GeneID:100127259	N.A.	serine/threonine kinase 35 L homeolog
XB17329847.L [provisional]	XB-GENE-6252758	GeneID:100127285	N.A.	hypothetical protein LOC101731854 L homeolog
LOC100491211.S	XB-GENE-5953564	GeneID:100127293	N.A.	fucolectin S homeolog (provisional)
cimip2b.S	XB-GENE-6252437	GeneID:100127307	N.A.	ciliary microtubule inner protein 2B S homeolog
carm1l.L	XB-GENE-6256127	GeneID:100137622	N.A.	coactivator associated arginine methyltransferase 1 like L homeolog
larp6l.S	XB-GENE-5806190	GeneID:100137645	N.A.	la ribonucleoprotein 6, translational regulator like S homeolog
fcsk.L	XB-GENE-980323	GeneID:100137687	N.A.	fucose kinase L homeolog
acnat1.L	XB-GENE-5872588	GeneID:100137716	N.A.	acyl-coenzyme A amino acid N-acyltransferase 1 gene 1 L homeolog
rbm12b.L	XB-GENE-22063328	GeneID:100158382	N.A.	RNA binding motif protein 12B gene 1 L homeolog
slc2a9l.L	XB-GENE-5883716	GeneID:100158398	N.A.	solute carrier family 2, facilitated glucose transporter member 9 like L homeolog
nat16.S	XB-GENE-6252745	GeneID:100158414	N.A.	N-acetyltransferase 16 (GCN5-related, putative) S homeolog
h4c4.L	XB-GENE-6466049	GeneID:100189569	N.A.	H4 clustered histone 4 L homeolog
mhc1-uba1.1.L	XB-GENE-864964	GeneID:100189573	N.A.	major histocompatibility complex, class 1, UB alpha chain, subfamily 1, member 1 L homeolog
XB5997626.L	XB-GENE-5997629	GeneID:100189586	N.A.	provisional ortholog of upregulator of cell proliferation L homeolog
tex12.S	XB-GENE-6251652	GeneID:100271897	N.A.	testis expressed 12 S homeolog
zar1l.S	XB-GENE-6372206	GeneID:100294519	N.A.	ZAR1-like protein S homeolog
arl6.S	XB-GENE-17334781	GeneID:100335048	N.A.	ADP ribosylation factor like GTPase 6 S homeolog
XB5939409.L	XB-GENE-5939488	GeneID:100335148	N.A.	provisional ortholog of cleavage stimulation factor subunit 3 L homeolog
spmip8.L	XB-GENE-5864992	GeneID:100337604	N.A.	sperm microtubule inner protein 8 L homeolog
ventx1.S	XB-GENE-6464310	GeneID:100337611	N.A.	VENT homeobox 1 gene 1 S homeolog
atp6ap1.L	XB-GENE-17333997	GeneID:100337617	N.A.	ATPase, H+ transporting, lysosomal accessory protein 1, gene 1 L homeolog
evpl.L	XB-GENE-993874	GeneID:100380992	N.A.	envoplakin L homeolog
tlcd4.2.S	XB-GENE-5756271	GeneID:100381011	N.A.	TLC domain containing 4, gene 2 S homeolog
gbp6.L	XB-GENE-6050535	GeneID:100381036	N.A.	guanylate binding protein family member 6 L homeolog
ubl4a.S	XB-GENE-6253458	GeneID:100381043	N.A.	ubiquitin like 4A S homeolog
ptf1a.S	XB-GENE-484429	GeneID:100381084	N.A.	pancreas associated transcription factor 1a S homeolog
gatd3.L	XB-GENE-944490	GeneID:100381155	N.A.	glutamine amidotransferase class 1 domain containing 3 L homeolog
c1h12orf43.L	XB-GENE-5925308	GeneID:100381174	N.A.	chromosome 1 C12orf43 homolog L homeolog
c4h11orf96.L	XB-GENE-6079452	GeneID:100381201	N.A.	chromosome 4 C11orf96 homolog L homeolog
smim11.L	XB-GENE-5844155	GeneID:100628319	N.A.	small integral membrane protein 11 L homeolog
slc66a2.S	XB-GENE-17343625	GeneID:108695209	N.A.	solute carrier family 66 member 2, gene 1 S homeolog
mtss1.S	XB-GENE-17333183	GeneID:108695440	N.A.	metastasis suppressor 1, gene 1 S homeolog
nxpe3l.S	XB-GENE-22064981	GeneID:108695475	N.A.	neurexophilin and PC-esterase domain family member 3 like gene1 S homeolog
c6h8orf82.S	XB-GENE-22064965	GeneID:108695487	N.A.	chromosome 6 C8orf82 homolog S homeolog
scrt1.S	XB-GENE-17336046	GeneID:108695492	N.A.	scratch family transcriptional repressor 1 S homeolog
zbed10.S	XB-GENE-22065652	GeneID:108695503	N.A.	zinc finger BED-type containing 10 S homeolog
naip.2.L	XB-GENE-17331148	GeneID:108695682	N.A.	NLR family apoptosis inhibitory protein gene 2 L homeolog
ndnf.L	XB-GENE-22066211	GeneID:108695785	N.A.	neuron derived neurotrophic factor L homeolog
c7h10orf88.L	XB-GENE-6485635	GeneID:108696101	N.A.	chromosome 7 C10orf88 homolog L homeolog
myof.L	XB-GENE-6487513	GeneID:108696180	N.A.	myoferlin, gene 1 L homeolog
c7h10orf105.L	XB-GENE-17340938	GeneID:108696270	N.A.	chromosome 7 C10orf105 homolog L homeolog
c7h1orf127.L	XB-GENE-11536278	GeneID:108696361	N.A.	chromosome 7 C1orf127 homolog L homeolog
tecta.L	XB-GENE-17333753	GeneID:108696423	N.A.	tectorin alpha gene 1 L homeolog
mypopl2.L	XB-GENE-22065337	GeneID:108696494	N.A.	Myb related transcription factor, partner of profilin like 2 gene 1 L homeolog
tex12.L	XB-GENE-17330948	GeneID:108696497	N.A.	testis expressed 12 L homeolog
cnfn.4.L	XB-GENE-22064336	GeneID:108696708	N.A.	cornifelin, gene 4 L homeolog
ins1p.L	XB-GENE-6485944	GeneID:108696734	N.A.	insulin 1 precursor L homeolog
kcnj22.L	XB-GENE-17335816	GeneID:108696937	N.A.	potassium inwardly rectifying channel subfamily J member 22 L homeolog
hepacam2l.L	XB-GENE-22166509	GeneID:108697441	N.A.	HEPACAM family member 2 like L homeolog
tecta.S	XB-GENE-17333754	GeneID:108697606	N.A.	tectorin alpha gene 1 S homeolog
fxyd7.S	XB-GENE-22063248	GeneID:108697904	N.A.	FXYD domain containing ion transport regulator 7 S homeolog
slc2a9.L	XB-GENE-17345103	GeneID:108698035	N.A.	solute carrier family 2 member 9 L homeolog
camkvl	XB-GENE-22062965	GeneID:108698096	N.A.	CaM kinase like vesicle associated like L homeolog
c8h8orf48.L	XB-GENE-6486327	GeneID:108698368	N.A.	chromosome 8 C8orf48 homolog L homeolog
slc6a14.L	XB-GENE-17341538	GeneID:108698476	N.A.	solute carrier family 6 member 14, gene 1 L homeolog
tmtopn.L	XB-GENE-17338783	GeneID:108698496	N.A.	multiple tissue opsin L homeolog
bloc1s3.L	XB-GENE-17331052	GeneID:108698532	N.A.	biogenesis of lysosomal organelles complex-1, subunit 3 L homeolog
mhc2-dab.L	XB-GENE-5827650	GeneID:108698550	N.A.	major histocompatibility complex, class II, DA beta L homeolog
ly6g6e.L	XB-GENE-22063243	GeneID:108698570	N.A.	lymphocyte antigen 6 family member G6E L homeolog
cdc42ep2l	XB-GENE-17336354	GeneID:108698598	N.A.	CDC42 effector protein 2 like L homeolog
c8h19orf33.L	XB-GENE-22065705	GeneID:108698599	N.A.	chromosome 8 C19orf33 homolog L homeolog
selenow.L	XB-GENE-6485651	GeneID:108698632	N.A.	selenoprotein W1 L homeolog
lrfn1.L	XB-GENE-17335467	GeneID:108698658	N.A.	leucine rich repeat and fibronectin type III domain containing 1, gene 1 L homeolog
lgals3l.L (provisional)	XB-GENE-6488957	GeneID:108698758	N.A.	galectin 3 like L homeolog (provisional)
skic2.L	XB-GENE-6487148	GeneID:108698937	N.A.	SKI2 subunit of superkiller complex L homeolog
btn1a1l.L	XB-GENE-22063308	GeneID:108698999	N.A.	butyrophilin subfamily 1 member A1 like L homeolog
XB5946283.L [provisional:fcrl5]	XB-GENE-11536239	GeneID:108699152	N.A.	provisional ortholog of Fc receptor like 5 L homeolog
spaca5.L	XB-GENE-22063312	GeneID:108699312	N.A.	sperm acrosome associated 5 L homeolog
ripk3l.L	XB-GENE-22167185	GeneID:108699327	N.A.	receptor interacting serine/threonine kinase 3-like, gene 1 L homeolog
entrep3.L	XB-GENE-17344671	GeneID:108699483	N.A.	endosomal transmembrane epsin interactor 3 L homeolog
fcrl4.L	XB-GENE-6486234	GeneID:108699588	N.A.	Fc receptor-like protein 4 L homeolog
timp1.S	XB-GENE-17345855	GeneID:108699853	N.A.	TIMP metallopeptidase inhibitor 1 S homeolog
pou5f3.S	XB-GENE-17344635	GeneID:108699884	N.A.	POU class 5 homeobox 3, gene 1 S homeolog
pierce1.S	XB-GENE-17340794	GeneID:108699912	N.A.	piercer of microtubule wall 1 S homeolog
slc10a3.S	XB-GENE-6486728	GeneID:108699971	N.A.	solute carrier family 10 member 3 S homeolog
eeig1.S	XB-GENE-17332627	GeneID:108699972	N.A.	EEIG family member 1 S homeolog
pabir2.S	XB-GENE-17330158	GeneID:108700179	N.A.	PABIR family member 2 S homeolog
tektl1.S	XB-GENE-6487823	GeneID:108700213	N.A.	tektin like 1 S homeolog
c8h19orf33.S	XB-GENE-22065706	GeneID:108700256	N.A.	chromosome 8 C19orf33 homolog S homeolog
actmap.S	XB-GENE-6487850	GeneID:108700269	N.A.	actin maturation protease S homeolog
lrfn1.S	XB-GENE-17335468	GeneID:108700292	N.A.	leucine rich repeat and fibronectin type III domain containing 1, gene 1 S homeolog
camkvl	XB-GENE-22062966	GeneID:108700298	N.A.	CaM kinase like vesicle associated like S homeolog
smad10.S	XB-GENE-5995204	GeneID:108700426	N.A.	SMAD family member 10 S homeolog
npdc1.S	XB-GENE-17342784	GeneID:108700498	N.A.	neural proliferation, differentiation and control, 1, gene 1 S homeolog
v2rc1.S	XB-GENE-5798353	GeneID:108700596	N.A.	vomeronasal receptor C-1 S homeolog
tmtopn.S	XB-GENE-17338784	GeneID:108700663	N.A.	multiple tissue opsin S homeolog
g6pc3.L	XB-GENE-6486406	GeneID:108700836	N.A.	glucose 6 phosphatase, catalytic 3 L homeolog
c9_10h1orf198.L	XB-GENE-6486553	GeneID:108700868	N.A.	chromosome 9_10 C1orf198 homolog L homeolog
bpil.2.L	XB-GENE-22168626	GeneID:108701045	N.A.	bactericidal permeability increasing protein like gene 2 L homeolog
tgm3l.L	XB-GENE-17339823	GeneID:108701046	N.A.	transglutaminase 3 like gene 1 L homeolog
mtcl2.L	XB-GENE-6487406	GeneID:108701087	N.A.	microtubule crosslinking factor 2 L homeolog
rcvrn.L	XB-GENE-17335889	GeneID:108701191	N.A.	recoverin, gene 1 L homeolog
cfap210.L	XB-GENE-17342585	GeneID:108701366	N.A.	cilia and flagella associated protein 210 L homeolog
cmklr2.L	XB-GENE-17330285	GeneID:108701465	N.A.	chemerin chemokine-like receptor 2 1 L homeolog
c9_10h2orf80.L	XB-GENE-22063939	GeneID:108701476	N.A.	chromosome 9_10 C2orf80 homolog L homeolog
ocm.L	XB-GENE-17343084	GeneID:108701585	N.A.	oncomodulin L homeolog
noxo1.2.L	XB-GENE-17339955	GeneID:108701677	N.A.	NADPH oxidase organizer 1 gene 2 L homeolog
nherf2.L	XB-GENE-17332873	GeneID:108701908	N.A.	NHERF family PDZ scaffold protein 2 L homeolog
c9_10h2orf76.S	XB-GENE-17337951	GeneID:108702237	N.A.	chromosome 9_10 C2orf76 homolog S homeolog
pttg1ip.S	XB-GENE-17338753	GeneID:108702407	N.A.	pituitary tumor-transforming 1 interacting protein, gene 1 S homeolog
tbc1d20.S	XB-GENE-17332856	GeneID:108702450	N.A.	TBC1 domain family member 20 S homeolog
mtcl2.S	XB-GENE-17338471	GeneID:108702785	N.A.	microtubule crosslinking factor 2 S homeolog
cmklr2.S	XB-GENE-6489261	GeneID:108703064	N.A.	chemerin chemokine-like receptor 2 S homeolog
ocm4.S	XB-GENE-22065765	GeneID:108703149	N.A.	oncomodulin 4 gene 1 S homeolog
ocm.S	XB-GENE-17343085	GeneID:108703150	N.A.	oncomodulin S homeolog
noxo1.2.S	XB-GENE-17339956	GeneID:108703231	N.A.	NADPH oxidase organizer 1 gene 2 S homeolog
cfap119.S	XB-GENE-11536256	GeneID:108703264	N.A.	cilia and flagella associated protein 119 S homeolog
dusp13b.S	XB-GENE-17337763	GeneID:108703346	N.A.	dual specificity phosphatase 13b S homeolog
ndnf.S	XB-GENE-22066212	GeneID:108703355	N.A.	neuron derived neurotrophic factor S homeolog
cibar2.S	XB-GENE-17346393	GeneID:108704060	N.A.	CBY1 interacting BAR domain containing 2 S homeolog
cgas.L	XB-GENE-6486956	GeneID:108704160	N.A.	cyclic GMP-AMP synthase L homeolog
septinl.L	XB-GENE-22169602	GeneID:108704612	N.A.	septin like L homeolog
tabpl.S	XB-GENE-22169509	GeneID:108704746	N.A.	tapasin-like S homeolog
c1h22orf15.S	XB-GENE-22064758	GeneID:108705141	N.A.	chromosome 1 C22orf15 homolog S homeolog
mypopl1.L	XB-GENE-22169524	GeneID:108705291	N.A.	Myb related transcription factor, partner of profilin like 1 L homeolog
znf84l.L	XB-GENE-22041761	GeneID:108705293	N.A.	zinc finger protein 84 like L homeolog
wfdc8l.L	XB-GENE-22169520	GeneID:108705298	N.A.	WAP four-disulfide core domain protein 8-like, whey acidic protein like L homeolog
XB5750836.S	XB-GENE-5750843	GeneID:108705362	N.A.	blastomere cadherin-like S homeolog
nherf4.S	XB-GENE-17343676	GeneID:108705410	N.A.	NHERF family PDZ scaffold protein 4 S homeolog
hcar1.S	XB-GENE-6488654	GeneID:108705662	N.A.	hydroxycarboxylic acid receptor 1 S homeolog
yrdcl.S	XB-GENE-22063317	GeneID:108705666	N.A.	yrdC N6-threonylcarbamoyltransferase domain containing like S homeolog
yrdcl.L	XB-GENE-22063316	GeneID:108705686	N.A.	yrdC N6-threonylcarbamoyltransferase domain containing like L homeolog
slc7a2.S	XB-GENE-17332395	GeneID:108706608	N.A.	solute carrier family 7 member 2 gene 1 S homeolog
mttp.S	XB-GENE-17342984	GeneID:108706738	N.A.	microsomal triglyceride transfer protein, gene 1 S homeolog
opn4xb.S	XB-GENE-17344930	GeneID:108706749	N.A.	melanopsin-B-like S homeolog
cxcl8a.S	XB-GENE-17339499	GeneID:108706769	N.A.	C-X-C motif chemokine ligand 8a gene 1 S homeolog
stra6l.S	XB-GENE-17341181	GeneID:108706914	N.A.	stra6-like gene 1 S homeolog
entrep1.S	XB-GENE-17338714	GeneID:108706965	N.A.	fendosomal transmembrane epsin interactor 1 S homeolog
spmip10.S	XB-GENE-17336744	GeneID:108707196	N.A.	sperm associated microtubule inner protein 10 S homeolog
c1h18orf54.S	XB-GENE-6487854	GeneID:108707334	N.A.	chromosome 1 C18orf54 homolog S homeolog
ark2c.S	XB-GENE-6489200	GeneID:108707350	N.A.	arkadia (RNF111) C-terminal like ring finger ubiquitin ligase 2C S homeolog
atosb.S	XB-GENE-17332252	GeneID:108707364	N.A.	atos homolog B S homeolog
or52k2l.L	XB-GENE-22167956	GeneID:108707591	N.A.	olfactory receptor 52K2-like L homeolog
trpm2l.L	XB-GENE-17336280	GeneID:108707608	N.A.	transient receptor potential cation channel, subfamily M, member 2 like L homeolog
lrrc32.L	XB-GENE-17341305	GeneID:108707633	N.A.	leucine rich repeat containing 32, gene 1 L homeolog
tmem30c.L	XB-GENE-6489026	GeneID:108707668	N.A.	transmembrane protein 30C L homeolog
or51ao2.L	XB-GENE-17343398	GeneID:108707770	N.A.	olfactory receptor family 51 subfamily AO member 2 L homeolog
tmprss2.L	XB-GENE-22065908	GeneID:108707852	N.A.	transmembrane serine protease 2 gene 1 L homeolog
cfap276.L	XB-GENE-17333602	GeneID:108708123	N.A.	cilia and flagella associated protein 276 L homeolog
c2h1orf116.L	XB-GENE-6488015	GeneID:108708160	N.A.	chromosome 2 C1orf116 homolog L homeolog
nhsl3.L	XB-GENE-17341334	GeneID:108708269	N.A.	NHS like 3 L homeolog
tmtopn2.L	XB-GENE-17337434	GeneID:108708394	N.A.	multiple tissue opsin 2 L homeolog
il18r1.L	XB-GENE-6488807	GeneID:108708407	N.A.	interleukin 18 receptor 1, gene 1 L homeolog
mettl21e.L	XB-GENE-6486980	GeneID:108708469	N.A.	methyltransferase like 21E L homeolog
tmt1a.2.L	XB-GENE-22069552	GeneID:108708615	N.A.	thiol methyltransferase 1A gene 2 L homeolog
or5f1l1.L	XB-GENE-22065209	GeneID:108708619	N.A.	olfactory receptor family 5 subfamily F member 1 like 1 gene 1 L homeolog
zar1.L	XB-GENE-18005852	GeneID:108708693	N.A.	ZAR1-like protein L homeolog
gpr12.L	XB-GENE-17333338	GeneID:108708711	N.A.	G protein-coupled receptor 12 L homeolog
inppl1a.L	XB-GENE-6487464	GeneID:108708768	N.A.	inositol polyphosphate phosphatase-like 1a L homeolog
or52l1.L	XB-GENE-22167960	GeneID:108708775	N.A.	olfactory receptor 52L1 L homeolog
trim39l.L	XB-GENE-22167850	GeneID:108708800	N.A.	tripartite motif containing 39 like gene 1 L homeolog
trim39l.S	XB-GENE-22167851	GeneID:108709062	N.A.	tripartite motif containing 39 like gene 1 S homeolog
or51ao2.S	XB-GENE-17343399	GeneID:108709157	N.A.	olfactory receptor family 51 subfamily AO member 2 S homeolog
c2h21orf62.S	XB-GENE-6487510	GeneID:108709228	N.A.	chromosome 2 C21orf62 homolog S homeolog
smim11.S	XB-GENE-17346266	GeneID:108709234	N.A.	small integral membrane protein 11 S homeolog
tmprss2.S	XB-GENE-22065909	GeneID:108709252	N.A.	transmembrane serine protease 2 gene 1 S homeolog
bltp3a.S	XB-GENE-17343310	GeneID:108709448	N.A.	bridge-like lipid transfer protein family member 3AS homeolog
cimap3.S	XB-GENE-6488429	GeneID:108709457	N.A.	ciliary microtubule associated protein 3 S homeolog
XB5965586.S	XB-GENE-6486699	GeneID:108709667	N.A.	provisional ortholog of NFKB inhibitor zeta S homeolog
tmtopn2.S	XB-GENE-17337435	GeneID:108709695	N.A.	multiple tissue opsin 2 S homeolog
skic8.S	XB-GENE-17338184	GeneID:108709826	N.A.	SKI8 subunit of superkiller complex S homeolog
gpr12.S	XB-GENE-17333339	GeneID:108709963	N.A.	G protein-coupled receptor 12 S homeolog
lrrc32.S	XB-GENE-17341306	GeneID:108710039	N.A.	leucine rich repeat containing 32, gene 1 S homeolog
neu3.S	XB-GENE-18005549	GeneID:108710057	N.A.	sialidase 3 (membrane sialidase) gene 1 S homeolog
afg2a.L	XB-GENE-17345522	GeneID:108710141	N.A.	AFG2 AAA ATPase homolog A L homeolog
prfprl2.L	XB-GENE-22164442	GeneID:108710313	N.A.	pyroglutamylated RFamide peptide receptor-like 2 gene 1 L homeolog
parietopsin.L	XB-GENE-18005841	GeneID:108710584	N.A.	parietopsin L homeolog
mtnr1al.L	XB-GENE-5911705	GeneID:108710792	N.A.	melatonin receptor type 1A likeL homeolog
abtb3.L	XB-GENE-17345075	GeneID:108710803	N.A.	ankyrin repeat and BTB domain containing 3 L homeolog
mttp.L	XB-GENE-6486734	GeneID:108710823	N.A.	microsomal triglyceride transfer protein, gene 1 L homeolog
ndnf.L	XB-GENE-22066197	GeneID:108710826	N.A.	neuron-derived neurotrophic factor L homeolog
fbxl21.L	XB-GENE-17331749	GeneID:108710846	N.A.	F-box and leucine-rich repeat protein 21 L homeolog
afg2b.L	XB-GENE-6487950	GeneID:108711402	N.A.	AFG2 AAA ATPase homolog B L homeolog
ttll13.L	XB-GENE-17330357	GeneID:108711444	N.A.	tubulin tyrosine ligase like 13 L homeolog
qrfprl2.S	XB-GENE-17330173	GeneID:108712295	N.A.	pyroglutamylated RFamide peptide receptor-like 2  S homeolog
abtb3.S	XB-GENE-6488433	GeneID:108712582	N.A.	ankyrin repeat and BTB domain containing 3 S homeolog
prss57l.L	XB-GENE-17329846	GeneID:108712609	N.A.	serine protease 57 like L homeolog
ltc4s.S	XB-GENE-6486938	GeneID:108712616	N.A.	leukotriene C4 synthase, gene 1 S homeolog
c3h5orf15.S	XB-GENE-6487526	GeneID:108712620	N.A.	chromosome 3 C5orf15 homolog S homeolog
ndnf.S	XB-GENE-22066198	GeneID:108712633	N.A.	neuron-derived neurotrophic factor S homeolog
rps28.L	XB-GENE-17344181	GeneID:108712659	N.A.	ribosomal protein S28 L homeolog
larp6l.L	XB-GENE-18005825	GeneID:108712702	N.A.	la ribonucleoprotein 6, translational regulator like L homeolog
ttll13.S	XB-GENE-17330358	GeneID:108712862	N.A.	tubulin tyrosine ligase like 13 S homeolog
rasef2.S	XB-GENE-17341013	GeneID:108712869	N.A.	RAS and EF-hand domain containing 2 S homeolog
entrep2.S	XB-GENE-6485655	GeneID:108712949	N.A.	endosomal transmembrane epsin interactor 2 S homeolog
scamp5.S	XB-GENE-22061156	GeneID:108712966	N.A.	secretory carrier membrane protein 5 gene 1 S homeolog
mhc1-uea.L	XB-GENE-22167952	GeneID:108713088	N.A.	major histocompatibility complex, class 1, UE alpha chain L homeolog
cimap1c.L	XB-GENE-17342287	GeneID:108713177	N.A.	ciliary microtubule associated protein 1C L homeolog
stra6l.L	XB-GENE-6487045	GeneID:108713373	N.A.	stra6-like gene 1 L homeolog
ntmt2.L	XB-GENE-17334730	GeneID:108713669	N.A.	N-terminal Xaa-Pro-Lys N-methyltransferase 2 L homeolog
rigi.L	XB-GENE-17346760	GeneID:108713708	N.A.	RNA sensor RIG-IL homeolog
polr2l.L	XB-GENE-17346691	GeneID:108713863	N.A.	RNA polymerase II, I and III subunit L gene 1 L homeolog
nod2.L	XB-GENE-22201332	GeneID:108713994	N.A.	nucleotide-binding oligomerization domain-containing protein 2 L homeolog
brd10.L	XB-GENE-17340721	GeneID:108714189	N.A.	bromodomain containing 10 L homeolog
zng1a.L	XB-GENE-17330064	GeneID:108714402	N.A.	Zn regulated GTPase metalloprotein activator 1A L homeolog
eeig2.L	XB-GENE-17338039	GeneID:108714433	N.A.	EEIG family member 2 L homeolog
ift56.L	XB-GENE-6487880	GeneID:108714464	N.A.	intraflagellar transport 56 L homeolog
c1h9orf85.L	XB-GENE-6486961	GeneID:108714497	N.A.	chromosome 1 C9orf85 homolog L homeolog
cep15.L	XB-GENE-6488396	GeneID:108714733	N.A.	centrosomal protein 15 L homeolog
c1h14orf119.L	XB-GENE-6487302	GeneID:108714879	N.A.	chromosome 1 C14orf119 homolog L homeolog
sirt3.S	XB-GENE-6487013	GeneID:108715195	N.A.	sirtuin 3 S homeolog
c4h11orf96.S	XB-GENE-17339948	GeneID:108715272	N.A.	chromosome 4 C11orf96 homolog S homeolog
st3gal2.S	XB-GENE-17336545	GeneID:108715471	N.A.	ST3 beta-galactoside alpha-2,3-sialyltransferase 2 gene 1 S homeolog
lhfpl7.L	XB-GENE-17338163	GeneID:108715683	N.A.	LHFPL tetraspan subfamily member 7 L homeolog
eeig2.S	XB-GENE-6488325	GeneID:108715696	N.A.	EEIG family member 2 S homeolog
ntmt2.S	XB-GENE-17334731	GeneID:108715745	N.A.	N-terminal Xaa-Pro-Lys N-methyltransferase 2 S homeolog
csnk1e.S	XB-GENE-17337390	GeneID:108715790	N.A.	casein kinase 1 epsilon S homeolog
atp2b2.S	XB-GENE-17340777	GeneID:108715812	N.A.	ATPase plasma membrane Ca2+ transporting 2 S homeolog
ccdc3l.S	XB-GENE-18005642	GeneID:108715902	N.A.	coiled-coil domain containing like 3 S homeolog
tmtopn3.L	XB-GENE-17338785	GeneID:108716225	N.A.	multiple tissue opsin 3 L homeolog
hcar1.L	XB-GENE-17338096	GeneID:108716697	N.A.	hydroxycarboxylic acid receptor 1 L homeolog
mtcl3.L	XB-GENE-17338002	GeneID:108716760	N.A.	MTCL family member 3 L homeolog
atp13al.L	XB-GENE-6486892	GeneID:108716994	N.A.	ATPase type 13A like L homeolog
pebp1.L	XB-GENE-22069564	GeneID:108717052	N.A.	phosphatidylethanolamine binding protein 1, gene 1 L homeolog
MGC146443.S	XB-GENE-18005588	GeneID:108717167	N.A.	uncharacterized protein MGC146443 S homeolog
c5h6orf120.S	XB-GENE-17342555	GeneID:108717844	N.A.	chromosome 5 C6orf120 homolog S homeolog
c5h6orf118.S	XB-GENE-17340313	GeneID:108717869	N.A.	chromosome 5 C6orf118 homolog S homeolog
atp13al.S	XB-GENE-17339036	GeneID:108718084	N.A.	ATPase type 13A like S homeolog
tmtopn3.S	XB-GENE-17338786	GeneID:108718185	N.A.	multiple tissue opsin 3 S homeolog
mypopl1.S	XB-GENE-22169525	GeneID:108718342	N.A.	Myb related transcription factor, partner of profilin like 1 S homeolog
nxpe3l.L	XB-GENE-22064980	GeneID:108718619	N.A.	neurexophilin and PC-esterase domain family member 3 like gene1 L homeolog
znf783.L	XB-GENE-22065603	GeneID:108718651	N.A.	Zinc finger family member 783 L homeolog
ark2c.L	XB-GENE-17344155	GeneID:108718737	N.A.	arkadia (RNF111) C-terminal like ring finger ubiquitin ligase 2C L homeolog
atosb.L	XB-GENE-17332251	GeneID:108718940	N.A.	fatos homolog B L homeolog
atp2c1.S	XB-GENE-17336005	GeneID:108718958	N.A.	ATPase, Ca++ transporting, type 2C, member 1 S homeolog
spmip7.L	XB-GENE-6487986	GeneID:108718993	N.A.	sperm microtubule inner protein 7 L homeolog
matcap2.L	XB-GENE-6488063	GeneID:108719017	N.A.	microtubule associated tyrosine carboxypeptidase 2 L homeolog
trpv4l.L	XB-GENE-22066241	GeneID:108719393	N.A.	transient receptor potential cation channel, subfamily V, member 4 like, gene 1 L homeolog
mtss1.L	XB-GENE-6487937	GeneID:108719409	N.A.	metastasis suppressor 1, gene 1 L homeolog
atp2c1.L	XB-GENE-6486564	GeneID:108719984	N.A.	ATPase, Ca++ transporting, type 2C, member 1 L homeolog
acd.S	XB-GENE-18005616	GeneID:108720072	N.A.	ACD shelterin complex subunit and telomerase recruitment factor S homeolog
scamp5.L	XB-GENE-22061155	GeneID:110008576	N.A.	secretory carrier membrane protein 5 gene 1 L homeolog
tbxt.2.S	XB-GENE-5981788	GeneID:373550	N.A.	T, brachyury homolog, gene 2 S homeolog
or15a3.S	XB-GENE-5876793	GeneID:373607	N.A.	olfactory receptor family 15 subfamily A member 3 S homeolog
or11an9c.L	XB-GENE-5765049	GeneID:373608	N.A.	olfactory receptor family 11 subfamily AN member 9C L homeolog
axin2l.L	XB-GENE-6252887	GeneID:373619	N.A.	axin 2 like L homeolog
mhc2-daa.L	XB-GENE-5889264	GeneID:373678	N.A.	major histocompatibility complex, class II, DA alpha
opn4xb.L	XB-GENE-5957217	GeneID:373689	N.A.	melanopsin-B-like L homeolog
adam13.S	XB-GENE-17332744	GeneID:373720	N.A.	ADAM metallopeptidase domain 13 S homeolog
steep1.L	XB-GENE-5808712	GeneID:373791	N.A.	STING1 ER exit protein 1 L homeolog
lhb.2.L	XB-GENE-6067985	GeneID:373843	N.A.	luteinizing hormone subunit beta L homeolog
grik5l.S	XB-GENE-5860323	GeneID:378489	N.A.	glutamate ionotropic receptor kainate type subunit 5 like S homeolog
cimap1a.L	XB-GENE-6079195	GeneID:379057	N.A.	ciliary microtubule associated protein 1A L homeolog
tbc1d20.L	XB-GENE-963360	GeneID:379059	N.A.	TBC1 domain family member 20 L homeolog
pisdl.L	XB-GENE-5897077	GeneID:379065	N.A.	phosphatidylserine decarboxylase like L homeolog
ocm4.L	XB-GENE-22065764	GeneID:379090	N.A.	oncomodulin 4 gene 1 L homeolog
nef1f.L	XB-GENE-876576	GeneID:379168	N.A.	neuronal intermediate filament family member 1  L homeolog
MGC69466.L	XB-GENE-6251621	GeneID:379171	N.A.	MGC69466 protein L homeolog
phb1.L	XB-GENE-977676	GeneID:379173	N.A.	prohibitin 1 L homeolog
llph.S	XB-GENE-1188271	GeneID:379208	N.A.	LLPH S homeolog
cyp2a6.S	XB-GENE-5820991	GeneID:379297	N.A.	cytochrome P450 family 2 subfamily A member 6 gene 1 S homeolog
cimap1a.S	XB-GENE-17337913	GeneID:379331	N.A.	ciliary microtubule associated protein 1A S homeolog
akr1c8.S	XB-GENE-5757795	GeneID:379425	N.A.	aldo-keto reductase family 1, member C8 S homeolog
anxa1.S	XB-GENE-17330548	GeneID:379455	N.A.	annexin A1 gene 1 S homeolog
cela1.L	XB-GENE-17338297	GeneID:379467	N.A.	chymotrypsin like elastase 1, gene 1 L homeolog
phb1.S	XB-GENE-17346339	GeneID:379509	N.A.	prohibitin 1 S homeolog
oat.L	XB-GENE-1005712	GeneID:379754	N.A.	ornithine aminotransferase L homeolog
cetn2.S	XB-GENE-967622	GeneID:379819	N.A.	centrin 2 S homeolog
rab11b.S	XB-GENE-491178	GeneID:379824	N.A.	RAB11B, member RAS oncogene family gene 1 S homeolog
g6pc1.L	XB-GENE-17333016	GeneID:379852	N.A.	glucose-6-phosphatase, catalytic subunit 1, gene 1 L homeolog
paics.L	XB-GENE-17334793	GeneID:379855	N.A.	phosphoribosylaminoimidazole carboxylase and phosphoribosylaminoimidazolesuccinocarboxamide synthase L homeolog
msra.L	XB-GENE-1011251	GeneID:379956	N.A.	methionine sulfoxide reductase A, gene 1 L homeolog
cmah.L	XB-GENE-988338	GeneID:379989	N.A.	cytidine monophospho-N-acetylneuraminic acid hydroxylase L homeolog
ark2n.L	XB-GENE-988451	GeneID:380047	N.A.	arkadia (RNF111) N-terminal like PKA signaling regulator 2N L homeolog
mcm6.S	XB-GENE-6256556	GeneID:380282	N.A.	minichromosome maintenance complex component 6 S homeolog
lamtor3l.L	XB-GENE-6253417	GeneID:380570	N.A.	late endosomal/lysosomal adaptor, MAPK and MTOR activator 3 like L homeolog
glull.1.S	XB-GENE-990058	GeneID:380593	N.A.	glutamate-ammonia ligase like 1 S homeolog
adam13.L	XB-GENE-988112	GeneID:386623	N.A.	ADAM metallopeptidase domain 13 L homeolog
grik5l.L	XB-GENE-18005836	GeneID:394374	N.A.	glutamate ionotropic receptor kainate type subunit 5 like L homeolog
mcm6.L	XB-GENE-962683	GeneID:394426	N.A.	minichromosome maintenance complex component 6 L homeolog
pou5f3.L	XB-GENE-6252587	GeneID:397784	N.A.	POU class 5 homeobox 3, gene 1 L homeolog
cetn2.L	XB-GENE-17332223	GeneID:397814	N.A.	centrin 2 L homeolog
ventx2.S	XB-GENE-6252342	GeneID:397844	N.A.	VENT homeobox 2 gene 1 S homeolog
trim7.L	XB-GENE-6252340	GeneID:397847	N.A.	tripartite motif containing 7 L homeolog
gja4.2.S	XB-GENE-22062680	GeneID:397866	N.A.	gap junction alpha 4 gene 2 S homeolog
tubal3.L	XB-GENE-17344590	GeneID:397931	N.A.	tubulin alpha like 3 gene 1 L homeolog
ventx2.L	XB-GENE-6252158	GeneID:397948	N.A.	VENT homeobox 2 gene 1 L homeolog
ventx1.L	XB-GENE-920512	GeneID:398007	N.A.	VENT homeobox 1 gene 1 L homeolog
mcm6.2.L	XB-GENE-5870555	GeneID:398071	N.A.	minichromosome maintenance complex component 6 gene 2 L homeolog
or11an2b.L	XB-GENE-5946330	GeneID:398113	N.A.	olfactory receptor family 11 subfamily AN member 2B L homeolog
cripto.3.L	XB-GENE-6067836	GeneID:398127	N.A.	cripto, EGF-CFC family member gene 3 L homeolog
xmc.L	XB-GENE-5750775	GeneID:398255	N.A.	marginal coil Xmc L homeolog
znf236.L	XB-GENE-5822615	GeneID:398330	N.A.	zinc finger  family member 236 L homeolog
znf251l.L	XB-GENE-6251601	GeneID:398331	N.A.	zinc finger protein 251 like L homeolog
menf.1.L	XB-GENE-6251570	GeneID:398397	N.A.	mesendoderm nuclear factor, gene 1 L homeolog
anxa1.L	XB-GENE-977629	GeneID:398427	N.A.	annexin A1 gene 1 L homeolog
gfus.L	XB-GENE-5754292	GeneID:398450	N.A.	GDP-L-fucose synthase L homeolog
opn1sw2.S	XB-GENE-5817986	GeneID:398602	N.A.	opsin 1, short wave sensitive gene 2 S homeolog
MGC108429.L	XB-GENE-5783455	GeneID:398639	N.A.	mgc108429 protein L homeolog
st3gal8.S	XB-GENE-17343273	GeneID:398747	N.A.	ST3 beta-galactoside alpha-2,3-sialyltransferase 8 S homeolog
hcls1.S	XB-GENE-6486929	GeneID:398923	N.A.	hematopoietic cell-specific Lyn substrate 1 S homeolog
mhc2-dma.S	XB-GENE-6254658	GeneID:399001	N.A.	major histocompatibility complex, class II, DM alpha S homeolog
nherf2.S	XB-GENE-865463	GeneID:399076	N.A.	NHERF family PDZ scaffold protein 2 S homeolog
slc7a2.L	XB-GENE-994552	GeneID:399077	N.A.	solute carrier family 7 member 2 gene 1 L homeolog
top1.L	XB-GENE-950006	GeneID:399263	N.A.	DNA topoisomerase I gene 1 L homeolog
csnk1e.L	XB-GENE-865132	GeneID:399381	N.A.	casein kinase 1 epsilon L homeolog
serinc1.L	XB-GENE-6253900	GeneID:399429	N.A.	serine incorporator 1, gene 1 L homeolog
phox2a.S	XB-GENE-853858	GeneID:402788	N.A.	paired like homeobox 2A S homeolog
smad10.L	XB-GENE-6256010	GeneID:403356	N.A.	SMAD family member 10 L homeolog
slc5a8.L	XB-GENE-865289	GeneID:403396	N.A.	solute carrier family 5 member 8, gene 1 L homeolog
st3gal2.L	XB-GENE-6487642	GeneID:414465	N.A.	ST3 beta-galactoside alpha-2,3-sialyltransferase 2 gene 1 L homeolog
slc22a15.L	XB-GENE-6256479	GeneID:414494	N.A.	solute carrier family 22 member 15 gene 1 L homeolog
gpr4l.2.S	XB-GENE-5853099	GeneID:414643	N.A.	G protein-coupled receptor 4 like gene 2 S homeolog
mettl13.S	XB-GENE-965492	GeneID:414682	N.A.	methyltransferase 13, eEF1A N-terminus and K55 S homeolog
slc66a2.L	XB-GENE-988369	GeneID:431879	N.A.	solute carrier family 66 member 2, gene 1 L homeolog
prorsd1.L	XB-GENE-954559	GeneID:431901	N.A.	prolyl-tRNA synthetase associated domain containing 1 L homeolog
hycc1.S	XB-GENE-866578	GeneID:431909	N.A.	hyccin PI4KA lipid kinase complex subunit 1 S homeolog
tubal3.S	XB-GENE-5834879	GeneID:431994	N.A.	tubulin alpha like 3 gene 1 S homeolog
bltp3b.L	XB-GENE-5895281	GeneID:432006	N.A.	bridge-like lipid transfer protein family member 3B L homeolog
afg3l1.S	XB-GENE-1014915	GeneID:432063	N.A.	AFG3-like AAA ATPase 1 S homeolog
ptgr3.S	XB-GENE-6256271	GeneID:432094	N.A.	prostaglandin reductase 3 S homeolog
ift70a.S	XB-GENE-1221165	GeneID:432240	N.A.	intraflagellar transport 70a S homeolog
slc2a9l.S	XB-GENE-6255738	GeneID:432243	N.A.	solute carrier family 2, facilitated glucose transporter member 9 like S homeolog
glull.1.L	XB-GENE-18005794	GeneID:432308	N.A.	glutamate-ammonia ligase like 1 L homeolog
shisa1.L	XB-GENE-5937902	GeneID:443566	N.A.	shisa 1 gene 1 L homeolog
atosa.L	XB-GENE-5816759	GeneID:443587	N.A.	atos homolog A L homeolog
zftraf1.L	XB-GENE-6252002	GeneID:443645	N.A.	zinc finger TRAF-type containing 1 L homeolog
rrm2.L	XB-GENE-947057	GeneID:443815	N.A.	ribonucleotide reductase M2, gene 1 L homeolog
surf4.S	XB-GENE-6251724	GeneID:443878	N.A.	surfeit 4 gene 1 S homeolog
cdc42ep2l	XB-GENE-5822272	GeneID:443961	N.A.	CDC42 effector protein 2 like S homeolog
ark2n.S	XB-GENE-17341495	GeneID:444312	N.A.	arkadia (RNF111) N-terminal like PKA signaling regulator 2N S homeolog
eeig1.L	XB-GENE-5892622	GeneID:444316	N.A.	EEIG family member 1 L homeolog
slx9.L	XB-GENE-954079	GeneID:444323	N.A.	SLX9 ribosome biogenesis factor L homeolog
ppp1r3c.L	XB-GENE-969184	GeneID:444329	N.A.	protein phosphatase 1, regulatory (inhibitor) subunit 3C gene 1L homeolog
tmt1a.L	XB-GENE-5802653	GeneID:444332	N.A.	thiol methyltransferase 1A gene 1 L homeolog
fcrl3p.L	XB-GENE-5897207	GeneID:444389	N.A.	Fc receptor like 3 pseuodgene L homeolog
skic8.L	XB-GENE-5751613	GeneID:444484	N.A.	SKI8 subunit of superkiller complex L homeolog
dhdl.L	XB-GENE-968491	GeneID:444539	N.A.	trans-1,2-dihydrobenzene-1,2-diol dehydrogenase like L homeolog
coa3.L	XB-GENE-6489312	GeneID:444575	N.A.	cytochrome c oxidase assembly factor 3 L homeolog
tlcd4.2.L	XB-GENE-6254610	GeneID:444633	N.A.	TLC domain containing 4, gene 2 L homeolog
paics.S	XB-GENE-965998	GeneID:444677	N.A.	phosphoribosylaminoimidazole carboxylase and phosphoribosylaminoimidazolesuccinocarboxamide synthase S homeolog
qng1.L	XB-GENE-6254381	GeneID:444733	N.A.	Q-nucleotide N-glycosylase 1 L homeolog
bltp1.L	XB-GENE-958867	GeneID:444760	N.A.	bridge-like lipid transfer protein family member 1 L homeolog
c9_10h2orf76.L	XB-GENE-5798608	GeneID:444810	N.A.	chromosome 9-10 C2orf76 homolog L homeolog
trim69.L	XB-GENE-6251710	GeneID:446238	N.A.	tripartite motif-containing 69 gene 1 L homeolog
skic3.L	XB-GENE-5929219	GeneID:446406	N.A.	SKI3 subunit of superkiller complex L homeolog
c4h11orf58.S	XB-GENE-17332590	GeneID:446600	N.A.	chromosome 4 C11orf58 homolog S homeolog
h2ac7.L	XB-GENE-6030947	GeneID:446610	N.A.	H2A clustered histone 7 L homeolog
neff1.S	XB-GENE-6255668	GeneID:446639	N.A.	neuronal intermediate filament family member 1  S homeolog
ppp1r3c.S	XB-GENE-17331304	GeneID:446643	N.A.	protein phosphatase 1, regulatory (inhibitor) subunit 3C gene 1S homeolog
zng1b.L	XB-GENE-6255356	GeneID:446757	N.A.	Zn regulated GTPase metalloprotein activator 1B L homeolog
haus3l.L	XB-GENE-6255109	GeneID:446808	N.A.	HAUS augmin like complex subunit 3 like L homeolog
atp2b2.L	XB-GENE-960661	GeneID:446855	N.A.	ATPase plasma membrane Ca2+ transporting 2 L homeolog
ptgr1.L	XB-GENE-6255097	GeneID:446864	N.A.	prostaglandin reductase 1, gene 1 L homeobox
c2hxorf38.S	XB-GENE-6078200	GeneID:446924	N.A.	chromosome 2 Cxorf38 homolog L homeolog
rimoc1.L	XB-GENE-6254852	GeneID:446937	N.A.	RAB7A interacting MON1-CCZ1 complex subunit 1 L homeolog
npdc1.L	XB-GENE-6254837	GeneID:446973	N.A.	neural proliferation, differentiation and control, 1, gene 1 L homeolog
cyp27a1.3.L	XB-GENE-984301	GeneID:446987	N.A.	cytochrome P450 family 27 subfamily A member 1 gene 3 L homeolog
cel.L	XB-GENE-22172576	GeneID:447025	N.A.	carboxyl ester lipase, gene 1  L homeolog
zfyve28b.L	XB-GENE-1219059	GeneID:447053	N.A.	zinc finger FYVE-type containing 28b L homeolog
cela1.S	XB-GENE-5739330	GeneID:447166	N.A.	chymotrypsin like elastase 1, gene 1 S homeolog
XB5836416.L	XB-GENE-5836437	GeneID:447176	N.A.	hypothetical protein LOC594893 L homeolog
rps28.S	XB-GENE-1006620	GeneID:447177	N.A.	ribosomal protein S28 S homeolog
mhc1-uba6.3.L	XB-GENE-6254130	GeneID:447287	N.A.	major histocompatibility complex, class 1, UB alpha chain, subfamily 6, member 3 L homeolog
g6pc1.S	XB-GENE-963993	GeneID:447506	N.A.	glucose-6-phosphatase, catalytic subunit 1, gene 1 S homeolog
lyset.L	XB-GENE-6078298	GeneID:447520	N.A.	lysosomal enzyme trafficking factor L homeolog
gba1.L	XB-GENE-6253753	GeneID:447570	N.A.	glucosylceramidase beta 1 L homeolog
mob2.L	XB-GENE-956903	GeneID:447585	N.A.	MOB kinase activator 2 L homeolog
ptgr3.L	XB-GENE-17345266	GeneID:447607	N.A.	prostaglandin reductase 3 L homeolog
ift25.L	XB-GENE-948270	GeneID:447687	N.A.	intraflagellar transport 25 L homeolog
axin2l.S	XB-GENE-6253409	GeneID:447702	N.A.	axin 2 like S homeolog
h2ac14.L	XB-GENE-994962	GeneID:494591	N.A.	H2A clustered histone 14 L homeolog
rab11b.L	XB-GENE-17332887	GeneID:494642	N.A.	RAB11B, member RAS oncogene family gene 1 L homeolog
XB1011895.L	XB-GENE-1011898	GeneID:494777	N.A.	Putative ortholog of fOR IV protein, 1 of 2 L homeolog
atp6ap1.S	XB-GENE-952455	GeneID:495089	N.A.	ATPase, H+ transporting, lysosomal accessory protein 1, gene 1 S homeolog
prpf4.S	XB-GENE-988313	GeneID:495151	N.A.	pre-mRNA processing factor kinase PRP4K S homeolog
rbm12b.S	XB-GENE-22063329	GeneID:495241	N.A.	RNA binding motif protein 12B gene 1 S homeolog
rab10l.L	XB-GENE-6253950	GeneID:495396	N.A.	RAB10, member RAS oncogene family like L homeolog
XB5897957.S	XB-GENE-5897966	GeneID:495453	N.A.	hypothetical LOC495453 S homeolog
cel.S	XB-GENE-22172577	GeneID:495520	N.A.	carboxyl ester lipase, gene 1  S homeolog
nherf1.L	XB-GENE-17341728	GeneID:495828	N.A.	NHERF family PDZ scaffold protein 1 L homeolog
XB5964940.L	XB-GENE-5964950	GeneID:495835	N.A.	uncharacterized XB5964940 L homeolog
c2h1orf74.L	XB-GENE-951030	GeneID:495943	N.A.	chromosome 2  C1orf74 homolog L homeolog
saxo4.L	XB-GENE-961529	GeneID:496026	N.A.	stabilizer of axonemal microtubules 4 L homeolog
atosa.S	XB-GENE-17341758	GeneID:496170	N.A.	atos homolog A S homeolog
mogat2.L	XB-GENE-6040390	GeneID:496214	N.A.	monoacylglycerol O-acyltransferase 2, gene 1 L homeolog
cimip2c.S	XB-GENE-6252225	GeneID:496230	N.A.	ciliary microtubule inner protein 2C S homeolog
tmt1a.3.L	XB-GENE-22069558	GeneID:496284	N.A.	thiol methyltransferase 1A gene 3 L homeolog
mhc1-uba6.1.L	XB-GENE-5820459	GeneID:496312	N.A.	major histocompatibility complex, class 1, UB alpha chain, subfamily 6, member 1 L homeolog
banf2.L	XB-GENE-5852365	GeneID:496357	N.A.	BANF family member 2 L homeolog
fucolectin-e.S	XB-GENE-6252073	GeneID:496374	N.A.	epidermal fucolectin S homeolog
gpr4l.L	XB-GENE-5959860	GeneID:496402	N.A.	G protein-coupled receptor 4 like gene 1 L homeolog
bmal1.S	XB-GENE-495459	GeneID:497632	N.A.	basic helix-loop-helix ARNT like 1 S homeolog
bmal1.L	XB-GENE-17342306	GeneID:503673	N.A.	basic helix-loop-helix ARNT like 1 L homeolog
gdf1.S	XB-GENE-481423	GeneID:677862	N.A.	growth differentiation factor 1 S homeolog
nherf1.S	XB-GENE-865698	GeneID:733155	N.A.	NHERF family PDZ scaffold protein 1S homeolog
acd.L	XB-GENE-5835921	GeneID:733156	N.A.	ACD shelterin complex subunit and telomerase recruitment factorL homeolog
ripk3l.2.L	XB-GENE-5914991	GeneID:733239	N.A.	receptor interacting serine/threonine kinase 3-like, gene 2 L homeolog
brd10.S	XB-GENE-5953268	GeneID:733262	N.A.	bromodomain containing 10 S homeolog
ccdc115.S	XB-GENE-5795143	GeneID:733352	N.A.	coiled-coil domain containing 115 S homeolog
cimap2.L	XB-GENE-5864257	GeneID:733356	N.A.	ciliary microtubule associated protein 2 L homeolog
spmap1.L	XB-GENE-994083	GeneID:733380	N.A.	spmap1 L homeolog
c9_10h17orf75.L	XB-GENE-6253136	GeneID:733424	N.A.	chromosome 9_10 C17orf75 homolog L homeolog
zftraf1.S	XB-GENE-5917347	GeneID:733442	N.A.	zinc finger TRAF-type containing 1 S homeolog
tdgf1.L	XB-GENE-866416	GeneID:733445	N.A.	teratocarcinoma-derived growth factor 1, member 1 L homeolog
h1-3.L	XB-GENE-5734217	GeneID:734208	N.A.	H1.3 linker histone, cluster member L homeolog
pttg1ip.L	XB-GENE-954069	GeneID:734288	N.A.	pituitary tumor-transforming 1 interacting protein, gene 1 L homeolog
MGC146443.L	XB-GENE-6487975	GeneID:734386	N.A.	uncharacterized protein MGC146443 L homeolog
polr2l.S	XB-GENE-6255885	GeneID:734578	N.A.	RNA polymerase II, I and III subunit L gene 1 S homeolog
zng1a.S	XB-GENE-5878492	GeneID:734600	N.A.	Zn regulated GTPase metalloprotein activator 1A S homeolog
wdr88l.L	XB-GENE-22166269	GeneID:734656	N.A.	WD repeat domain 88 like L homeolog
XB17329841.S [provisional]	XB-GENE-6255301	GeneID:734703	N.A.	hypothetical protein LOC734703 S homeolog
h2ax.S	XB-GENE-6493983	GeneID:734746	N.A.	H2A.X variant histone S homeolog
clxn.S	XB-GENE-5727581	GeneID:734757	N.A.	calaxin S homeolog
zfyve27.L	XB-GENE-1012381	GeneID:734772	N.A.	zinc finger  FYVE domain containing 27 L homeolog
ewsr1.L	XB-GENE-6254712	GeneID:734969	N.A.	EWS RNA binding protein 1 L homeolog
lrrn1l.L	XB-GENE-6254508	GeneID:735038	N.A.	leucine rich repeat neuronal 1 like L homeolog
c2h1orf216.S	XB-GENE-1006876	GeneID:735096	N.A.	chromosome 2 C1orf216 homolog S homeolog
MGC130869.L	XB-GENE-995389	GeneID:735208	N.A.	Putative ortholog of complement C1r subcomponent precursor (EC 3.4.21.41) (Complement component 1, r subcomponent), 1 of 1 L homeolog
XB5865341.S [provisional]	XB-GENE-5865366	GeneID:779021	N.A.	uncharacterized XB5865341 S homeolog
xlcgf66.1.L	XB-GENE-5921200	GeneID:779051	N.A.	Gastrula zinc finger protein XlCGF66.1 L homeolog
entrep1.L	XB-GENE-5955468	GeneID:779093	N.A.	fendosomal transmembrane epsin interactor 1 L homeolog
stat3.L	XB-GENE-865436	GeneID:779100	N.A.	signal transducer and activator of transcription 3 gene 1 L homeolog
klhl24.S	XB-GENE-6252998	GeneID:779116	N.A.	kelch like family member 24 S homeolog
hycc1.L	XB-GENE-17341242	GeneID:779176	N.A.	hyccin PI4KA lipid kinase complex subunit 1 L homeolog
nhsl3.S	XB-GENE-6252789	GeneID:779249	N.A.	NHS like 3 S homeolog
gstt1l.2.L	XB-GENE-980735	GeneID:779251	N.A.	glutathione S-transferase theta 1 like gene 2 L homeolog
phf23l.L	XB-GENE-6252782	GeneID:779269	N.A.	PHD finger protein 23 like L homeolog
mr1l.L	XB-GENE-6079326	GeneID:779380	N.A.	major histocompatibility complex, class I-related like L homeolog
septin5.S	XB-GENE-5829823	GeneID:779425	N.A.	septin 5 S homeolog
1a11.L	XB-GENE-6254242	GeneID:780751	N.A.	71 kDa protein L homeolog
XB5772961.L	XB-GENE-5773314	GeneID:780754	N.A.	Gastrula zinc finger protein XlCGF53.1 L homeolog
