@startuml proto-node-client

!include ./proto-node.puml

' package internal/pkg/chord/proto {
package "internal/pkg/chord" as internal_pkg_chord {
package proto {
	interface "NodeClient" as cl_proto_NodeClient { }

	note as cl_proto_NodeClient_Note
		Ein generierter
		privater Typ
		liefert die
		Implementation.
	end note

	' cl_proto_NodeClient . cl_proto_NodeClient_Note
	cl_proto_NodeClient_Note .. cl_proto_NodeClient
}
}

cl_proto_node <.. cl_proto_NodeClient
' cl_proto_NodeClient ..> cl_proto_node


@enduml
