@startuml main

!include ./local-node.puml

package "cmd/dht-chord" as cmd_dht_chord {
	stereotype "main" as fn_main <<(F, #FFFFAA)>> { }

	note as fn_main_Note
		Startpunkt für den lokalen Knoten.
	end note

	fn_main . fn_main_Note
	' fn_main_Note . fn_main
}

cl_LocalNode <.down.. fn_main

' internal_pkg_chord -[hidden]-- cmd_dht_chord

@enduml
