@startuml remote-node

!include ./node.puml
!include ./proto-client.puml

package "internal/pkg/chord" as internal_pkg_chord {
	class "remoteNode" as cl_remoteNode {
		' -- Fields --
	}

	note as cl_remoteNode_Note
		Nutzt den lokalen
		Knoten zur Prüfung
		auf bereits bekannte
		Remote-Knoten.
	end note

	cl_remoteNode . cl_remoteNode_Note
}

cl_node <|.. cl_remoteNode
cl_protoClient --* cl_remoteNode

@enduml
