<?xml version="1.0" encoding="UTF-8" standalone="no"?><svg xmlns="http://www.w3.org/2000/svg" xmlns:xlink="http://www.w3.org/1999/xlink" contentScriptType="application/ecmascript" contentStyleType="text/css" height="340px" preserveAspectRatio="none" style="width:577px;height:340px;" version="1.1" viewBox="0 0 577 340" width="577.5px" zoomAndPan="magnify"><defs><filter height="300%" id="f1bq8rtnowhjjs" width="300%" x="-1" y="-1"><feGaussianBlur result="blurOut" stdDeviation="2.5"/><feColorMatrix in="blurOut" result="blurOut2" type="matrix" values="0 0 0 0 0 0 0 0 0 0 0 0 0 0 0 0 0 0 .4 0"/><feOffset dx="5.0" dy="5.0" in="blurOut2" result="blurOut3"/><feBlend in="SourceGraphic" in2="blurOut3" mode="normal"/></filter></defs><g><!--MD5=[e3b72d301b965cbca9f58de8a3361392]
cluster r--><polygon fill="#FFFFFF" filter="url(#f1bq8rtnowhjjs)" points="125,30.625,177.5,30.625,186.25,55.2986,343.75,55.2986,343.75,274.375,125,274.375,125,30.625" style="stroke: #000000; stroke-width: 1.875;"/><line style="stroke: #000000; stroke-width: 1.875;" x1="125" x2="186.25" y1="55.2986" y2="55.2986"/><text fill="#000000" font-family="Iosevka Slab" font-size="13.75" font-weight="bold" lengthAdjust="spacingAndGlyphs" textLength="45" x="130" y="46.5586">aystem</text><ellipse cx="234.6805" cy="96.8628" fill="#FFFFE0" filter="url(#f1bq8rtnowhjjs)" rx="89.6805" ry="25.6128" style="stroke: #000000; stroke-width: 1.875;"/><text fill="#000000" font-family="Iosevka Slab" font-size="13.75" lengthAdjust="spacingAndGlyphs" textLength="135" x="167.1805" y="96.1319">create/modify/view</text><text fill="#000000" font-family="Iosevka Slab" font-size="13.75" lengthAdjust="spacingAndGlyphs" textLength="52.5" x="208.4305" y="113.3055">faculty</text><ellipse cx="234.2526" cy="160.3449" fill="#FFFFE0" filter="url(#f1bq8rtnowhjjs)" rx="88.6276" ry="25.3449" style="stroke: #000000; stroke-width: 1.875;"/><text fill="#000000" font-family="Iosevka Slab" font-size="13.75" lengthAdjust="spacingAndGlyphs" textLength="135" x="166.7526" y="160.0513">create/modify/view</text><text fill="#000000" font-family="Iosevka Slab" font-size="13.75" lengthAdjust="spacingAndGlyphs" textLength="30" x="219.2526" y="177.2249">user</text><ellipse cx="234.6653" cy="226.5658" fill="#FFFFE0" filter="url(#f1bq8rtnowhjjs)" rx="70.2903" ry="27.1908" style="stroke: #000000; stroke-width: 1.875;"/><text fill="#000000" font-family="Iosevka Slab" font-size="13.75" lengthAdjust="spacingAndGlyphs" textLength="97.5" x="185.9153" y="223.4102">impersonate a</text><text fill="#000000" font-family="Iosevka Slab" font-size="13.75" lengthAdjust="spacingAndGlyphs" textLength="82.5" x="193.4153" y="240.5838">normal user</text><!--MD5=[65a041cd1922b3dee6e64063a2213939]
entity administrator--><ellipse cx="56.25" cy="134.375" fill="#FFFFE0" filter="url(#f1bq8rtnowhjjs)" rx="20" ry="20" style="stroke: #000000; stroke-width: 1.875;"/><path d="M56.25,159.375 C61.25,159.375 65,159.375 70,154.375 C80,154.375 90,164.375 90,174.375 L90,179.375 C90,184.375 85,189.375 80,189.375 L32.5,189.375 C27.5,189.375 22.5,184.375 22.5,179.375 L22.5,174.375 C22.5,164.375 32.5,154.375 42.5,154.375 C47.5,159.375 51.25,159.375 56.25,159.375 " fill="#FFFFE0" filter="url(#f1bq8rtnowhjjs)" style="stroke: #000000; stroke-width: 1.875;"/><text fill="#000000" font-family="Iosevka Slab" font-size="13.75" lengthAdjust="spacingAndGlyphs" textLength="97.5" x="7.5" y="204.6836">administrator</text><path d="M386.25,73.75 L386.25,120.5972 L540,120.5972 L540,86.25 L527.5,73.75 L386.25,73.75 " fill="#E0FFFF" filter="url(#f1bq8rtnowhjjs)" style="stroke: #708090; stroke-width: 1.25;"/><path d="M527.5,73.75 L527.5,86.25 L540,86.25 L527.5,73.75 " fill="#E0FFFF" style="stroke: #708090; stroke-width: 1.25;"/><text fill="#000000" font-family="Iosevka Slab" font-size="13.75" lengthAdjust="spacingAndGlyphs" textLength="90" x="393.75" y="93.4336">no deletion,</text><text fill="#000000" font-family="Iosevka Slab" font-size="13.75" lengthAdjust="spacingAndGlyphs" textLength="127.5" x="393.75" y="110.6073">only deactivation</text><path d="M397.5,15 L397.5,49.8875 L301.675,79.725 L397.5,59.8875 L397.5,61.8472 A0,0 0 0 0 397.5,61.8472 L528.75,61.8472 A0,0 0 0 0 528.75,61.8472 L528.75,27.5 L516.25,15 L397.5,15 A0,0 0 0 0 397.5,15 " fill="#E0FFFF" filter="url(#f1bq8rtnowhjjs)" style="stroke: #708090; stroke-width: 1.25;"/><path d="M516.25,15 L516.25,27.5 L528.75,27.5 L516.25,15 " fill="#E0FFFF" style="stroke: #708090; stroke-width: 1.25;"/><ellipse cx="411.875" cy="29.0486" fill="#000000" rx="3.125" ry="3.125" style="stroke: #000000; stroke-width: 0.0;"/><text fill="#000000" font-family="Iosevka Slab" font-size="13.75" lengthAdjust="spacingAndGlyphs" textLength="97.5" x="412.5" y="34.6836"> abbreviation</text><ellipse cx="411.875" cy="46.2222" fill="#000000" rx="3.125" ry="3.125" style="stroke: #000000; stroke-width: 0.0;"/><text fill="#000000" font-family="Iosevka Slab" font-size="13.75" lengthAdjust="spacingAndGlyphs" textLength="37.5" x="412.5" y="51.8573"> name</text><path d="M363.75,133.125 L363.75,177.5 L311.275,173.5875 L363.75,187.5 L363.75,265.8404 A0,0 0 0 0 363.75,265.8404 L562.5,265.8404 A0,0 0 0 0 562.5,265.8404 L562.5,145.625 L550,133.125 L363.75,133.125 A0,0 0 0 0 363.75,133.125 " fill="#E0FFFF" filter="url(#f1bq8rtnowhjjs)" style="stroke: #708090; stroke-width: 1.25;"/><path d="M550,133.125 L550,145.625 L562.5,145.625 L550,133.125 " fill="#E0FFFF" style="stroke: #708090; stroke-width: 1.25;"/><ellipse cx="378.125" cy="147.1736" fill="#000000" rx="3.125" ry="3.125" style="stroke: #000000; stroke-width: 0.0;"/><text fill="#000000" font-family="Iosevka Slab" font-size="13.75" lengthAdjust="spacingAndGlyphs" textLength="45" x="378.75" y="152.8086"> email</text><ellipse cx="378.125" cy="164.3472" fill="#000000" rx="3.125" ry="3.125" style="stroke: #000000; stroke-width: 0.0;"/><text fill="#000000" font-family="Iosevka Slab" font-size="13.75" lengthAdjust="spacingAndGlyphs" textLength="165" x="378.75" y="169.9823"> first name, last name</text><ellipse cx="378.125" cy="181.5209" fill="#000000" rx="3.125" ry="3.125" style="stroke: #000000; stroke-width: 0.0;"/><text fill="#000000" font-family="Iosevka Slab" font-size="13.75" lengthAdjust="spacingAndGlyphs" textLength="75" x="378.75" y="187.1559"> user type</text><ellipse cx="378.125" cy="198.6945" fill="#000000" rx="3.125" ry="3.125" style="stroke: #000000; stroke-width: 0.0;"/><text fill="#000000" font-family="Iosevka Slab" font-size="13.75" lengthAdjust="spacingAndGlyphs" textLength="112.5" x="378.75" y="204.3295"> administrator?</text><ellipse cx="378.125" cy="215.8681" fill="#000000" rx="3.125" ry="3.125" style="stroke: #000000; stroke-width: 0.0;"/><text fill="#000000" font-family="Iosevka Slab" font-size="13.75" lengthAdjust="spacingAndGlyphs" textLength="75" x="378.75" y="221.5031"> (faculty)</text><ellipse cx="378.125" cy="233.0417" fill="#000000" rx="3.125" ry="3.125" style="stroke: #000000; stroke-width: 0.0;"/><text fill="#000000" font-family="Iosevka Slab" font-size="13.75" lengthAdjust="spacingAndGlyphs" textLength="97.5" x="378.75" y="238.6768"> (department)</text><ellipse cx="378.125" cy="250.2154" fill="#000000" rx="3.125" ry="3.125" style="stroke: #000000; stroke-width: 0.0;"/><text fill="#000000" font-family="Iosevka Slab" font-size="13.75" lengthAdjust="spacingAndGlyphs" textLength="157.5" x="378.75" y="255.8504"> (board of examiners)</text><path d="M363.75,278.75 L363.75,325.5972 L562.5,325.5972 L562.5,291.25 L550,278.75 L363.75,278.75 " fill="#E0FFFF" filter="url(#f1bq8rtnowhjjs)" style="stroke: #708090; stroke-width: 1.25;"/><path d="M550,278.75 L550,291.25 L562.5,291.25 L550,278.75 " fill="#E0FFFF" style="stroke: #708090; stroke-width: 1.25;"/><text fill="#000000" font-family="Iosevka Slab" font-size="13.75" lengthAdjust="spacingAndGlyphs" textLength="172.5" x="371.25" y="298.4336">The actions of a normal</text><text fill="#000000" font-family="Iosevka Slab" font-size="13.75" lengthAdjust="spacingAndGlyphs" textLength="157.5" x="371.25" y="315.6073">user become available</text><!--MD5=[301fdb01c179921d200b9ec3a66d5199]
link administrator to adm_faculty--><path d="M105.05,132.55 C108.375,130.9625 111.7125,129.4625 115,128.125 C130.125,121.9625 146.85,116.6875 162.825,112.3125 " fill="none" id="administrator-adm_faculty" style="stroke: #B22222; stroke-width: 1.25;"/><!--MD5=[2f36e0efbdc9baabb3e7985bceb78daa]
link administrator to adm_user--><path d="M105.025,160.625 C117.525,160.625 131.4,160.625 145.2875,160.625 " fill="none" id="administrator-adm_user" style="stroke: #B22222; stroke-width: 1.25;"/><!--MD5=[0eb7949f52724f7911663b4d8fa0cfe2]
link administrator to adm_userImpersonate--><path d="M105.1375,187.4875 C108.4375,189.05 111.75,190.525 115,191.875 C133.9625,199.7375 155.325,206.625 174.6,212.1625 " fill="none" id="administrator-adm_userImpersonate" style="stroke: #B22222; stroke-width: 1.25;"/><!--MD5=[1f6cebd0951b88495dfc254daae34258]
link adm_faculty to adm_deactivation_note--><path d="M324.075,96.875 C344.525,96.875 366.1,96.875 385.9625,96.875 " fill="none" id="adm_faculty-adm_deactivation_note" style="stroke: #B22222; stroke-width: 1.25; stroke-dasharray: 7.0,7.0;"/><!--MD5=[2df66d54fff478c09e9d806ee58fd37f]
link adm_user to adm_deactivation_note--><path d="M300.0375,143.0625 C317.4875,138.2625 336.35,133.0375 353.75,128.125 C364.0875,125.2125 374.9875,122.1 385.7125,119.025 " fill="none" id="adm_user-adm_deactivation_note" style="stroke: #B22222; stroke-width: 1.25; stroke-dasharray: 7.0,7.0;"/><!--MD5=[766db1d09c0c5dc79250099a2fc92f46]
link adm_userImpersonate to GMN19--><path d="M286.5875,245.3125 C310.0125,253.65 338.2125,263.4875 363.75,271.875 C370.525,274.1 377.575,276.3625 384.65,278.5875 " fill="none" id="adm_userImpersonate-GMN19" style="stroke: #B22222; stroke-width: 1.25; stroke-dasharray: 7.0,7.0;"/><!--MD5=[baafde121b336b8e6407dce35f9934c9]
@startuml use-case-administrator-en




skinparam dpi 120





skinparam note {
	BorderColor SlateGrey
	BackgroundColor LightCyan
}

skinparam package {
	Style rectangle
	ArrowColor DarkRed
}

skinparam title {
	FontName "Iosevka Slab"
}

skinparam default {
	FontName "Iosevka Slab"
	FontSize 11
	MonospacedFontName "Iosevka Slab"
	ArrowColor DarkRed
}

skinparam rectangle {
	FontName "Iosevka Slab"
	FontStyle Bold
	BorderColor Black
	BackgroundColor White
	ArrowColor Black
}

skinparam participant {
	FontName "Iosevka Slab"
	BorderColor Black
	BackgroundColor LightYellow
}

skinparam sequence {
	LifeLineBackgroundColor #AntiqueWhite
	LifeLineBorderColor #DimGrey

	Box {
		BorderColor Grey
		BackgroundColor WhiteSmoke
	}
}

skinparam actor {
	FontName "Iosevka Slab"
	BorderColor Black
	BackgroundColor LightYellow
	ArrowColor DarkRed
	Style awesome
}

skinparam usecase {
	FontName "Iosevka Slab"
	BorderColor Black
	BackgroundColor LightYellow
	ArrowColor DarkRed
	Padding 0
}

skinparam activity {
	FontName "Iosevka Slab"
	BorderColor Black
	BackgroundColor LightYellow
	Padding 10
}
skinparam activityDiamond {
	FontName "Iosevka Slab"
	BorderColor Black
	BackgroundColor LightYellow
	Padding 10
}

skinparam state {
	BorderColor Black
}

skinparam node {
	FontName "Iosevka Slab"
	BorderColor Black
	BackgroundColor LightYellow
	ArrowColor Black
	skinparam stereotype {
		FontName "Iosevka Slab"
	}
}

skinparam database {
	FontName "Iosevka Slab"
	BorderColor Black
	BackgroundColor LightYellow
	ArrowColor Black
	skinparam stereotype {
		FontName "Iosevka Slab"
	}
}

skinparam artifact {
	FontName "Iosevka Slab"
	BorderColor Black
	BackgroundColor LightYellow
	ArrowColor Black
	skinparam stereotype {
		FontName "Iosevka Slab"
	}
}



skinparam interface {
	FontName "Iosevka Slab"
	FontStyle Bold
	BorderColor Black
	BackgroundColor LightYellow
	ArrowColor Black
}

skinparam CircledCharacter {
	FontColor Black
}

skinparam class {
	FontName "Iosevka Slab"
	FontStyle Bold
	BorderColor Black
	BackgroundColor LightYellow
	ArrowColor Black
}

skinparam component {
	FontName "Iosevka Slab"
	FontStyle Bold
	BorderColor Black
	BackgroundColor LightYellow
	ArrowColor Black
	Style uml2
}


left to right direction

skinparam nodesep 10
skinparam ranksep 20

skinparam ArrowColor FireBrick
skinparam ArrowFontColor FireBrick

skinparam rectangle<<group>> {
	FontName "CMU Typewriter Text"
	BorderColor Black
	BackgroundColor LightYellow
	ArrowColor DarkRed
}



actor "administrator" as administrator

package "aystem" as r {
	usecase "create/modify/view\nfaculty" as adm_faculty
	usecase "create/modify/view\nuser" as adm_user
	usecase "impersonate a\nnormal user" as adm_userImpersonate
}

administrator - - (adm_faculty)
administrator - - (adm_user)
administrator - - (adm_userImpersonate)

note "no deletion,\nonly deactivation" as adm_deactivation_note

adm_faculty .. adm_deactivation_note
adm_user .. adm_deactivation_note

note right of adm_faculty
	*  abbreviation
	*  name
end note

note right of adm_user
	*  email
	*  first name, last name
	*  user type
	*  administrator?
	*  (faculty)
	*  (department)
	*  (board of examiners)
end note

note right of adm_userImpersonate
	The actions of a normal
	user become available
end note

@enduml

PlantUML version 1.2020.02(Sun Mar 01 11:22:07 CET 2020)
(GPL source distribution)
Java Runtime: OpenJDK Runtime Environment
JVM: OpenJDK 64-Bit Server VM
Java Version: 1.8.0_292-b10
Operating System: Linux
Default Encoding: UTF-8
Language: de
Country: DE
--></g></svg>