<?xml version="1.0" encoding="UTF-8" standalone="no"?><svg xmlns="http://www.w3.org/2000/svg" xmlns:xlink="http://www.w3.org/1999/xlink" contentScriptType="application/ecmascript" contentStyleType="text/css" height="967.5px" preserveAspectRatio="none" style="width:693px;height:967px;" version="1.1" viewBox="0 0 693 967" width="693.75px" zoomAndPan="magnify"><defs><filter height="300%" id="fyz38rj0ggpdo" width="300%" x="-1" y="-1"><feGaussianBlur result="blurOut" stdDeviation="2.5"/><feColorMatrix in="blurOut" result="blurOut2" type="matrix" values="0 0 0 0 0 0 0 0 0 0 0 0 0 0 0 0 0 0 .4 0"/><feOffset dx="5.0" dy="5.0" in="blurOut2" result="blurOut3"/><feBlend in="SourceGraphic" in2="blurOut3" mode="normal"/></filter></defs><g><rect fill="#F5F5F5" height="949.3405" style="stroke: #808080; stroke-width: 1.25;" width="536.875" x="36.25" y="5"/><text fill="#000000" font-family="Iosevka Slab" font-size="13.75" font-weight="bold" lengthAdjust="spacingAndGlyphs" textLength="60" x="274.6875" y="18.4336">Fakultät</text><rect fill="#FAEBD7" filter="url(#fyz38rj0ggpdo)" height="295.8126" style="stroke: #696969; stroke-width: 1.25;" width="12.5" x="70.625" y="458.2571"/><rect fill="#FAEBD7" filter="url(#fyz38rj0ggpdo)" height="246.139" style="stroke: #696969; stroke-width: 1.25;" width="12.5" x="189.375" y="177.4445"/><rect fill="#FAEBD7" filter="url(#fyz38rj0ggpdo)" height="89.3472" style="stroke: #696969; stroke-width: 1.25;" width="12.5" x="189.375" y="708.1461"/><rect fill="#FAEBD7" filter="url(#fyz38rj0ggpdo)" height="34.6736" style="stroke: #696969; stroke-width: 1.25;" width="12.5" x="346.875" y="423.5835"/><rect fill="#FAEBD7" filter="url(#fyz38rj0ggpdo)" height="117.4445" style="stroke: #696969; stroke-width: 1.25;" width="12.5" x="486.875" y="521.3543"/><rect fill="#FAEBD7" filter="url(#fyz38rj0ggpdo)" height="34.6736" style="stroke: #696969; stroke-width: 1.25;" width="12.5" x="626.875" y="797.4933"/><rect fill="#FFFFFF" filter="url(#fyz38rj0ggpdo)" height="71.5209" style="stroke: #000000; stroke-width: 2.5;" width="215" x="28.75" y="196.1945"/><rect fill="#FFFFFF" filter="url(#fyz38rj0ggpdo)" height="87.7709" style="stroke: #000000; stroke-width: 2.5;" width="216.25" x="147.5" y="285.2154"/><rect fill="#FFFFFF" filter="url(#fyz38rj0ggpdo)" height="180.5417" style="stroke: #000000; stroke-width: 2.5;" width="576.875" x="16.25" y="477.0071"/><rect fill="#FFFFFF" filter="url(#fyz38rj0ggpdo)" height="108.6945" style="stroke: #000000; stroke-width: 2.5;" width="551.875" x="28.75" y="540.1043"/><rect fill="#FFFFFF" height="54.3472" style="stroke: none; stroke-width: 1.25;" width="551.875" x="28.75" y="594.4516"/><rect fill="#FFFFFF" filter="url(#fyz38rj0ggpdo)" height="37.1736" style="stroke: #000000; stroke-width: 2.5;" width="238.75" x="28.75" y="726.8961"/><line style="stroke: #696969; stroke-width: 1.25; stroke-dasharray: 5.0,5.0;" x1="76.25" x2="76.25" y1="123.0972" y2="854.6669"/><line style="stroke: #696969; stroke-width: 1.25; stroke-dasharray: 5.0,5.0;" x1="195" x2="195" y1="123.0972" y2="854.6669"/><line style="stroke: #696969; stroke-width: 1.25; stroke-dasharray: 5.0,5.0;" x1="353.125" x2="353.125" y1="123.0972" y2="854.6669"/><line style="stroke: #696969; stroke-width: 1.25; stroke-dasharray: 5.0,5.0;" x1="493.125" x2="493.125" y1="123.0972" y2="854.6669"/><line style="stroke: #696969; stroke-width: 1.25; stroke-dasharray: 5.0,5.0;" x1="633.125" x2="633.125" y1="123.0972" y2="854.6669"/><text fill="#000000" font-family="Iosevka Slab" font-size="13.75" lengthAdjust="spacingAndGlyphs" textLength="52.5" x="46.875" y="119.3573">Student</text><ellipse cx="76.875" cy="49.0486" fill="#FFFFE0" filter="url(#fyz38rj0ggpdo)" rx="20" ry="20" style="stroke: #000000; stroke-width: 1.875;"/><path d="M76.875,74.0486 C81.875,74.0486 85.625,74.0486 90.625,69.0486 C100.625,69.0486 110.625,79.0486 110.625,89.0486 L110.625,94.0486 C110.625,99.0486 105.625,104.0486 100.625,104.0486 L53.125,104.0486 C48.125,104.0486 43.125,99.0486 43.125,94.0486 L43.125,89.0486 C43.125,79.0486 53.125,69.0486 63.125,69.0486 C68.125,74.0486 71.875,74.0486 76.875,74.0486 " fill="#FFFFE0" filter="url(#fyz38rj0ggpdo)" style="stroke: #000000; stroke-width: 1.875;"/><text fill="#000000" font-family="Iosevka Slab" font-size="13.75" lengthAdjust="spacingAndGlyphs" textLength="52.5" x="46.875" y="866.8506">Student</text><ellipse cx="76.875" cy="892.4655" fill="#FFFFE0" filter="url(#fyz38rj0ggpdo)" rx="20" ry="20" style="stroke: #000000; stroke-width: 1.875;"/><path d="M76.875,917.4655 C81.875,917.4655 85.625,917.4655 90.625,912.4655 C100.625,912.4655 110.625,922.4655 110.625,932.4655 L110.625,937.4655 C110.625,942.4655 105.625,947.4655 100.625,947.4655 L53.125,947.4655 C48.125,947.4655 43.125,942.4655 43.125,937.4655 L43.125,932.4655 C43.125,922.4655 53.125,912.4655 63.125,912.4655 C68.125,917.4655 71.875,917.4655 76.875,917.4655 " fill="#FFFFE0" filter="url(#fyz38rj0ggpdo)" style="stroke: #000000; stroke-width: 1.875;"/><text fill="#000000" font-family="Iosevka Slab" font-size="13.75" lengthAdjust="spacingAndGlyphs" textLength="60" x="161.875" y="119.3573">Lehrende</text><ellipse cx="195.625" cy="49.0486" fill="#FFFFE0" filter="url(#fyz38rj0ggpdo)" rx="20" ry="20" style="stroke: #000000; stroke-width: 1.875;"/><path d="M195.625,74.0486 C200.625,74.0486 204.375,74.0486 209.375,69.0486 C219.375,69.0486 229.375,79.0486 229.375,89.0486 L229.375,94.0486 C229.375,99.0486 224.375,104.0486 219.375,104.0486 L171.875,104.0486 C166.875,104.0486 161.875,99.0486 161.875,94.0486 L161.875,89.0486 C161.875,79.0486 171.875,69.0486 181.875,69.0486 C186.875,74.0486 190.625,74.0486 195.625,74.0486 " fill="#FFFFE0" filter="url(#fyz38rj0ggpdo)" style="stroke: #000000; stroke-width: 1.875;"/><text fill="#000000" font-family="Iosevka Slab" font-size="13.75" lengthAdjust="spacingAndGlyphs" textLength="60" x="161.875" y="866.8506">Lehrende</text><ellipse cx="195.625" cy="892.4655" fill="#FFFFE0" filter="url(#fyz38rj0ggpdo)" rx="20" ry="20" style="stroke: #000000; stroke-width: 1.875;"/><path d="M195.625,917.4655 C200.625,917.4655 204.375,917.4655 209.375,912.4655 C219.375,912.4655 229.375,922.4655 229.375,932.4655 L229.375,937.4655 C229.375,942.4655 224.375,947.4655 219.375,947.4655 L171.875,947.4655 C166.875,947.4655 161.875,942.4655 161.875,937.4655 L161.875,932.4655 C161.875,922.4655 171.875,912.4655 181.875,912.4655 C186.875,917.4655 190.625,917.4655 195.625,917.4655 " fill="#FFFFE0" filter="url(#fyz38rj0ggpdo)" style="stroke: #000000; stroke-width: 1.875;"/><rect fill="#FFFFE0" filter="url(#fyz38rj0ggpdo)" height="34.6736" style="stroke: #000000; stroke-width: 1.875;" width="100" x="300.625" y="82.1736"/><text fill="#000000" font-family="Iosevka Slab" font-size="13.75" lengthAdjust="spacingAndGlyphs" textLength="82.5" x="309.375" y="104.3573">Sekretariat</text><rect fill="#FFFFE0" filter="url(#fyz38rj0ggpdo)" height="34.6736" style="stroke: #000000; stroke-width: 1.875;" width="100" x="300.625" y="853.4169"/><text fill="#000000" font-family="Iosevka Slab" font-size="13.75" lengthAdjust="spacingAndGlyphs" textLength="82.5" x="309.375" y="875.6006">Sekretariat</text><rect fill="#FFFFE0" filter="url(#fyz38rj0ggpdo)" height="34.6736" style="stroke: #000000; stroke-width: 1.875;" width="145" x="418.125" y="82.1736"/><text fill="#000000" font-family="Iosevka Slab" font-size="13.75" lengthAdjust="spacingAndGlyphs" textLength="127.5" x="426.875" y="104.3573">Prüfungsausschuss</text><rect fill="#FFFFE0" filter="url(#fyz38rj0ggpdo)" height="34.6736" style="stroke: #000000; stroke-width: 1.875;" width="145" x="418.125" y="853.4169"/><text fill="#000000" font-family="Iosevka Slab" font-size="13.75" lengthAdjust="spacingAndGlyphs" textLength="127.5" x="426.875" y="875.6006">Prüfungsausschuss</text><rect fill="#FFFFE0" filter="url(#fyz38rj0ggpdo)" height="34.6736" style="stroke: #000000; stroke-width: 1.875;" width="100" x="580.625" y="82.1736"/><text fill="#000000" font-family="Iosevka Slab" font-size="13.75" lengthAdjust="spacingAndGlyphs" textLength="82.5" x="589.375" y="104.3573">Prüfungsamt</text><rect fill="#FFFFE0" filter="url(#fyz38rj0ggpdo)" height="34.6736" style="stroke: #000000; stroke-width: 1.875;" width="100" x="580.625" y="853.4169"/><text fill="#000000" font-family="Iosevka Slab" font-size="13.75" lengthAdjust="spacingAndGlyphs" textLength="82.5" x="589.375" y="875.6006">Prüfungsamt</text><rect fill="#FAEBD7" filter="url(#fyz38rj0ggpdo)" height="295.8126" style="stroke: #696969; stroke-width: 1.25;" width="12.5" x="70.625" y="458.2571"/><rect fill="#FAEBD7" filter="url(#fyz38rj0ggpdo)" height="246.139" style="stroke: #696969; stroke-width: 1.25;" width="12.5" x="189.375" y="177.4445"/><rect fill="#FAEBD7" filter="url(#fyz38rj0ggpdo)" height="89.3472" style="stroke: #696969; stroke-width: 1.25;" width="12.5" x="189.375" y="708.1461"/><rect fill="#FAEBD7" filter="url(#fyz38rj0ggpdo)" height="34.6736" style="stroke: #696969; stroke-width: 1.25;" width="12.5" x="346.875" y="423.5835"/><rect fill="#FAEBD7" filter="url(#fyz38rj0ggpdo)" height="117.4445" style="stroke: #696969; stroke-width: 1.25;" width="12.5" x="486.875" y="521.3543"/><rect fill="#FAEBD7" filter="url(#fyz38rj0ggpdo)" height="34.6736" style="stroke: #696969; stroke-width: 1.25;" width="12.5" x="626.875" y="797.4933"/><polygon fill="#B22222" points="174.375,172.4445,186.875,177.4445,174.375,182.4445,179.375,177.4445" style="stroke: #B22222; stroke-width: 1.25;"/><line style="stroke: #B22222; stroke-width: 1.25;" x1="76.875" x2="181.875" y1="177.4445" y2="177.4445"/><text fill="#B22222" font-family="Iosevka Slab" font-size="13.75" lengthAdjust="spacingAndGlyphs" textLength="45" x="85.625" y="154.0309">Antrag</text><text fill="#B22222" font-family="Iosevka Slab" font-size="13.75" lengthAdjust="spacingAndGlyphs" textLength="52.5" x="85.625" y="171.2045">stellen</text><path d="M28.75,196.1945 L107.5,196.1945 L107.5,202.4445 L95,214.9445 L28.75,214.9445 L28.75,196.1945 " fill="#EEEEEE" style="stroke: #000000; stroke-width: 1.25;"/><rect fill="none" height="71.5209" style="stroke: #000000; stroke-width: 2.5;" width="215" x="28.75" y="196.1945"/><text fill="#000000" font-family="Iosevka Slab" font-size="13.75" font-weight="bold" lengthAdjust="spacingAndGlyphs" textLength="22.5" x="47.5" y="210.8781">opt</text><text fill="#000000" font-family="Iosevka Slab" font-size="13.75" font-weight="bold" lengthAdjust="spacingAndGlyphs" textLength="82.5" x="126.25" y="212.1281">[Ablehnung]</text><polygon fill="#B22222" points="90.625,252.7154,78.125,257.7154,90.625,262.7154,85.625,257.7154" style="stroke: #B22222; stroke-width: 1.25;"/><line style="stroke: #B22222; stroke-width: 1.25;" x1="83.125" x2="188.125" y1="257.7154" y2="257.7154"/><text fill="#B22222" font-family="Iosevka Slab" font-size="13.75" lengthAdjust="spacingAndGlyphs" textLength="45" x="98.125" y="234.3018">Antrag</text><text fill="#B22222" font-family="Iosevka Slab" font-size="13.75" lengthAdjust="spacingAndGlyphs" textLength="67.5" x="98.125" y="251.4754">abgelehnt</text><path d="M147.5,285.2154 L226.25,285.2154 L226.25,291.4654 L213.75,303.9654 L147.5,303.9654 L147.5,285.2154 " fill="#EEEEEE" style="stroke: #000000; stroke-width: 1.25;"/><rect fill="none" height="87.7709" style="stroke: #000000; stroke-width: 2.5;" width="216.25" x="147.5" y="285.2154"/><text fill="#000000" font-family="Iosevka Slab" font-size="13.75" font-weight="bold" lengthAdjust="spacingAndGlyphs" textLength="22.5" x="166.25" y="299.899">opt</text><text fill="#000000" font-family="Iosevka Slab" font-size="13.75" font-weight="bold" lengthAdjust="spacingAndGlyphs" textLength="112.5" x="245" y="301.149">[BA-/MA-Arbeit]</text><line style="stroke: #B22222; stroke-width: 1.25;" x1="201.875" x2="254.375" y1="346.7362" y2="346.7362"/><line style="stroke: #B22222; stroke-width: 1.25;" x1="254.375" x2="254.375" y1="346.7362" y2="362.9862"/><line style="stroke: #B22222; stroke-width: 1.25;" x1="203.125" x2="254.375" y1="362.9862" y2="362.9862"/><polygon fill="#B22222" points="215.625,357.9862,203.125,362.9862,215.625,367.9862,210.625,362.9862" style="stroke: #B22222; stroke-width: 1.25;"/><text fill="#B22222" font-family="Iosevka Slab" font-size="13.75" lengthAdjust="spacingAndGlyphs" textLength="120" x="210.625" y="323.3226">Weiterleitung an</text><text fill="#B22222" font-family="Iosevka Slab" font-size="13.75" lengthAdjust="spacingAndGlyphs" textLength="127.5" x="210.625" y="340.4962">zweiten Lehrenden</text><polygon fill="#B22222" points="331.875,418.5835,344.375,423.5835,331.875,428.5835,336.875,423.5835" style="stroke: #B22222; stroke-width: 1.25;"/><line style="stroke: #B22222; stroke-width: 1.25;" x1="195.625" x2="339.375" y1="423.5835" y2="423.5835"/><text fill="#B22222" font-family="Iosevka Slab" font-size="13.75" lengthAdjust="spacingAndGlyphs" textLength="97.5" x="204.375" y="400.1699">Weiterleitung</text><text fill="#B22222" font-family="Iosevka Slab" font-size="13.75" lengthAdjust="spacingAndGlyphs" textLength="105" x="204.375" y="417.3435">an Sekretariat</text><polygon fill="#B22222" points="96.875,453.2571,84.375,458.2571,96.875,463.2571,91.875,458.2571" style="stroke: #B22222; stroke-width: 1.25;"/><line style="stroke: #B22222; stroke-width: 1.25;" x1="89.375" x2="351.875" y1="458.2571" y2="458.2571"/><text fill="#B22222" font-family="Iosevka Slab" font-size="13.75" lengthAdjust="spacingAndGlyphs" textLength="210" x="104.375" y="452.0171">Verbuchung/Formale Anmeldung</text><path d="M16.25,477.0071 L95,477.0071 L95,483.2571 L82.5,495.7571 L16.25,495.7571 L16.25,477.0071 " fill="#EEEEEE" style="stroke: #000000; stroke-width: 1.25;"/><rect fill="none" height="180.5417" style="stroke: #000000; stroke-width: 2.5;" width="576.875" x="16.25" y="477.0071"/><text fill="#000000" font-family="Iosevka Slab" font-size="13.75" font-weight="bold" lengthAdjust="spacingAndGlyphs" textLength="22.5" x="35" y="491.6907">opt</text><text fill="#000000" font-family="Iosevka Slab" font-size="13.75" font-weight="bold" lengthAdjust="spacingAndGlyphs" textLength="105" x="113.75" y="492.9407">[Verlängerung]</text><polygon fill="#B22222" points="471.875,516.3543,484.375,521.3543,471.875,526.3543,476.875,521.3543" style="stroke: #B22222; stroke-width: 1.25;"/><line style="stroke: #B22222; stroke-width: 1.25;" x1="83.125" x2="479.375" y1="521.3543" y2="521.3543"/><text fill="#B22222" font-family="Iosevka Slab" font-size="13.75" lengthAdjust="spacingAndGlyphs" textLength="172.5" x="91.875" y="515.1144">Antrag auf Verlängerung</text><path d="M28.75,540.1043 L107.5,540.1043 L107.5,546.3543 L95,558.8543 L28.75,558.8543 L28.75,540.1043 " fill="#EEEEEE" style="stroke: #000000; stroke-width: 1.25;"/><rect fill="none" height="108.6945" style="stroke: #000000; stroke-width: 2.5;" width="551.875" x="28.75" y="540.1043"/><text fill="#000000" font-family="Iosevka Slab" font-size="13.75" font-weight="bold" lengthAdjust="spacingAndGlyphs" textLength="22.5" x="47.5" y="554.788">alt</text><text fill="#000000" font-family="Iosevka Slab" font-size="13.75" font-weight="bold" lengthAdjust="spacingAndGlyphs" textLength="67.5" x="126.25" y="556.038">[Annahme]</text><polygon fill="#B22222" points="96.875,579.4516,84.375,584.4516,96.875,589.4516,91.875,584.4516" style="stroke: #B22222; stroke-width: 1.25;"/><line style="stroke: #B22222; stroke-width: 1.25;" x1="89.375" x2="485.625" y1="584.4516" y2="584.4516"/><text fill="#B22222" font-family="Iosevka Slab" font-size="13.75" lengthAdjust="spacingAndGlyphs" textLength="255" x="104.375" y="578.2116">Antrag auf Verlängerung angenommen</text><line style="stroke: #000000; stroke-width: 1.25; stroke-dasharray: 2.0,2.0;" x1="28.75" x2="580.625" y1="595.7016" y2="595.7016"/><text fill="#000000" font-family="Iosevka Slab" font-size="13.75" font-weight="bold" lengthAdjust="spacingAndGlyphs" textLength="82.5" x="35" y="609.1352">[Ablehnung]</text><polygon fill="#B22222" points="96.875,633.7988,84.375,638.7988,96.875,643.7988,91.875,638.7988" style="stroke: #B22222; stroke-width: 1.25;"/><line style="stroke: #B22222; stroke-width: 1.25;" x1="89.375" x2="491.875" y1="638.7988" y2="638.7988"/><text fill="#B22222" font-family="Iosevka Slab" font-size="13.75" lengthAdjust="spacingAndGlyphs" textLength="247.5" x="104.375" y="632.5588">Antrag auf Verlängerung abgelehnt</text><polygon fill="#B22222" points="174.375,703.1461,186.875,708.1461,174.375,713.1461,179.375,708.1461" style="stroke: #B22222; stroke-width: 1.25;"/><line style="stroke: #B22222; stroke-width: 1.25;" x1="83.125" x2="181.875" y1="708.1461" y2="708.1461"/><text fill="#B22222" font-family="Iosevka Slab" font-size="13.75" lengthAdjust="spacingAndGlyphs" textLength="67.5" x="91.875" y="684.7325">Dokumente</text><text fill="#B22222" font-family="Iosevka Slab" font-size="13.75" lengthAdjust="spacingAndGlyphs" textLength="82.5" x="91.875" y="701.9061">hinterlegen</text><path d="M28.75,726.8961 L107.5,726.8961 L107.5,733.1461 L95,745.6461 L28.75,745.6461 L28.75,726.8961 " fill="#EEEEEE" style="stroke: #000000; stroke-width: 1.25;"/><rect fill="none" height="37.1736" style="stroke: #000000; stroke-width: 2.5;" width="238.75" x="28.75" y="726.8961"/><text fill="#000000" font-family="Iosevka Slab" font-size="13.75" font-weight="bold" lengthAdjust="spacingAndGlyphs" textLength="22.5" x="47.5" y="741.5797">opt</text><text fill="#000000" font-family="Iosevka Slab" font-size="13.75" font-weight="bold" lengthAdjust="spacingAndGlyphs" textLength="135" x="126.25" y="742.8297">[Frist abgelaufen]</text><polygon fill="#B22222" points="174.375,749.0697,186.875,754.0697,174.375,759.0697,179.375,754.0697" style="stroke: #B22222; stroke-width: 1.25;"/><line style="stroke: #B22222; stroke-width: 1.25;" x1="76.875" x2="181.875" y1="754.0697" y2="754.0697"/><polygon fill="#B22222" points="611.875,792.4933,624.375,797.4933,611.875,802.4933,616.875,797.4933" style="stroke: #B22222; stroke-width: 1.25;"/><line style="stroke: #B22222; stroke-width: 1.25;" x1="195.625" x2="619.375" y1="797.4933" y2="797.4933"/><text fill="#B22222" font-family="Iosevka Slab" font-size="13.75" lengthAdjust="spacingAndGlyphs" textLength="270" x="204.375" y="791.2533">Bewertung hinterlegen &amp; weiterleiten</text><polygon fill="#B22222" points="90.625,827.1669,78.125,832.1669,90.625,837.1669,85.625,832.1669" style="stroke: #B22222; stroke-width: 1.25;"/><line style="stroke: #B22222; stroke-width: 1.25;" x1="83.125" x2="631.875" y1="832.1669" y2="832.1669"/><text fill="#B22222" font-family="Iosevka Slab" font-size="13.75" lengthAdjust="spacingAndGlyphs" textLength="172.5" x="98.125" y="825.9269">Im Notensystem verbucht</text><!--MD5=[bce772f4cfdc61980741d92f63d427af]
@startuml sequence-de




skinparam dpi 120





skinparam note {
	BorderColor SlateGrey
	BackgroundColor LightCyan
}

skinparam package {
	Style rectangle
	ArrowColor DarkRed
}

skinparam title {
	FontName "Iosevka Slab"
}

skinparam default {
	FontName "Iosevka Slab"
	FontSize 11
	MonospacedFontName "Iosevka Slab"
	ArrowColor DarkRed
}

skinparam rectangle {
	FontName "Iosevka Slab"
	FontStyle Bold
	BorderColor Black
	BackgroundColor White
	ArrowColor Black
}

skinparam participant {
	FontName "Iosevka Slab"
	BorderColor Black
	BackgroundColor LightYellow
}

skinparam sequence {
	LifeLineBackgroundColor #AntiqueWhite
	LifeLineBorderColor #DimGrey

	Box {
		BorderColor Grey
		BackgroundColor WhiteSmoke
	}
}

skinparam actor {
	FontName "Iosevka Slab"
	BorderColor Black
	BackgroundColor LightYellow
	ArrowColor DarkRed
	Style awesome
}

skinparam usecase {
	FontName "Iosevka Slab"
	BorderColor Black
	BackgroundColor LightYellow
	ArrowColor DarkRed
	Padding 0
}

skinparam activity {
	FontName "Iosevka Slab"
	BorderColor Black
	BackgroundColor LightYellow
	Padding 10
}
skinparam activityDiamond {
	FontName "Iosevka Slab"
	BorderColor Black
	BackgroundColor LightYellow
	Padding 10
}

skinparam state {
	BorderColor Black
}

skinparam node {
	FontName "Iosevka Slab"
	BorderColor Black
	BackgroundColor LightYellow
	ArrowColor Black
	skinparam stereotype {
		FontName "Iosevka Slab"
	}
}

skinparam database {
	FontName "Iosevka Slab"
	BorderColor Black
	BackgroundColor LightYellow
	ArrowColor Black
	skinparam stereotype {
		FontName "Iosevka Slab"
	}
}

skinparam artifact {
	FontName "Iosevka Slab"
	BorderColor Black
	BackgroundColor LightYellow
	ArrowColor Black
	skinparam stereotype {
		FontName "Iosevka Slab"
	}
}



skinparam interface {
	FontName "Iosevka Slab"
	FontStyle Bold
	BorderColor Black
	BackgroundColor LightYellow
	ArrowColor Black
}

skinparam CircledCharacter {
	FontColor Black
}

skinparam class {
	FontName "Iosevka Slab"
	FontStyle Bold
	BorderColor Black
	BackgroundColor LightYellow
	ArrowColor Black
}

skinparam component {
	FontName "Iosevka Slab"
	FontStyle Bold
	BorderColor Black
	BackgroundColor LightYellow
	ArrowColor Black
	Style uml2
}


skinparam ArrowColor FireBrick
skinparam ArrowFontColor FireBrick




box "Fakultät"
	actor "Student" as wf_student
	actor "Lehrende" as wf_lecturer
	participant "Sekretariat" as wf_secretariat
	participant "Prüfungsausschuss" as wf_boardOfExaminersForFaculty
end box

participant "Prüfungsamt" as wf_examinationAuthority

wf_student -> wf_lecturer: Antrag\nstellen
activate wf_lecturer

opt Ablehnung
	wf_lecturer -> wf_student: Antrag\nabgelehnt
end


opt BA-/MA-Arbeit
	wf_lecturer -> wf_lecturer: Weiterleitung an\nzweiten Lehrenden
end


wf_lecturer -> wf_secretariat: Weiterleitung\nan Sekretariat
deactivate wf_lecturer
activate wf_secretariat


wf_secretariat -> wf_student: Verbuchung/Formale Anmeldung
deactivate wf_secretariat
activate wf_student


opt Verlängerung
	wf_student -> wf_boardOfExaminersForFaculty: Antrag auf Verlängerung
	activate wf_boardOfExaminersForFaculty

	alt Annahme
		wf_boardOfExaminersForFaculty -> wf_student: Antrag auf Verlängerung angenommen
	else Ablehnung
		wf_boardOfExaminersForFaculty -> wf_student: Antrag auf Verlängerung abgelehnt
		deactivate wf_boardOfExaminersForFaculty
	end
end


wf_student -> wf_lecturer: Dokumente\nhinterlegen
activate wf_lecturer

opt Frist abgelaufen
	wf_student -> wf_lecturer
	deactivate wf_student
end


wf_lecturer -> wf_examinationAuthority: Bewertung hinterlegen & weiterleiten
deactivate wf_lecturer
activate wf_examinationAuthority


wf_examinationAuthority -> wf_student: Im Notensystem verbucht
deactivate wf_examinationAuthority

@enduml

PlantUML version 1.2020.02(Sun Mar 01 11:22:07 CET 2020)
(GPL source distribution)
Java Runtime: OpenJDK Runtime Environment
JVM: OpenJDK 64-Bit Server VM
Java Version: 1.8.0_292-b10
Operating System: Linux
Default Encoding: UTF-8
Language: de
Country: DE
--></g></svg>