@startuml project

' !include ./entity.puml
!include ./project-status.puml
!include ./project-document.puml

class "Project  " as cl_project {
	' -- Fields  --
	{field} -projectID: UUID <<PK>>
	{field} -creationInstant: Instant
	{field} -modificationInstant: Instant
	' {field} -studentID: UUID <<FK>>
	' {field} -supervisingTutor1ID: UUID
	' {field} -supervisingTutor2ID: UUID
	{field} -student: User
	{field} -supervisingTutor1: User
	{field} -supervisingTutor2: User?
	{field} -supervisingTutor1Accepted: Boolean
	{field} -supervisingTutor2Accepted: Boolean
	{field} -studentSignature: ByteArray
	{field} -supervisingTutor1Signature: ByteArray
	{field} -supervisingTutor2Signature: ByteArray
	{field} -title: String
	{field} -grade: BigDecimal
	{field} -deadline: LocalDate
	{field} -status: ProjectStatus
	{field} -documents: List<Documents>
}

' cl_entity <|-- cl_project

cl_project ..> cl_projectStatus
' cl_projectStatus <. cl_project
' cl_projectDocument --* cl_project
cl_project *-- cl_projectDocument

@enduml
