module AlchemyTest

go 1.17

require (
	github.com/dgrijalva/jwt-go v3.2.0+incompatible
	github.com/go-sql-driver/mysql v1.6.0
	github.com/gorilla/handlers v1.5.1
	github.com/gorilla/mux v1.8.0
)

require github.com/felixge/httpsnoop v1.0.1 // indirect
