<?xml version="1.0" encoding="UTF-8" standalone="no"?>
<!-- Created with Inkscape (http://www.inkscape.org/) -->

<svg
   xmlns:dc="http://purl.org/dc/elements/1.1/"
   xmlns:cc="http://creativecommons.org/ns#"
   xmlns:rdf="http://www.w3.org/1999/02/22-rdf-syntax-ns#"
   xmlns:svg="http://www.w3.org/2000/svg"
   xmlns="http://www.w3.org/2000/svg"
   xmlns:sodipodi="http://sodipodi.sourceforge.net/DTD/sodipodi-0.dtd"
   xmlns:inkscape="http://www.inkscape.org/namespaces/inkscape"
   width="700"
   height="700"
   viewBox="0 0 185.206 185.206"
   version="1.1"
   id="svg8"
   inkscape:version="0.92.4 (5da689c313, 2019-01-14)"
   sodipodi:docname="top.svg">
  <defs
     id="defs2" />
  <sodipodi:namedview
     id="base"
     pagecolor="#ffffff"
     bordercolor="#666666"
     borderopacity="1.0"
     inkscape:pageopacity="0.0"
     inkscape:pageshadow="2"
     inkscape:zoom="0.175"
     inkscape:cx="-981.37875"
     inkscape:cy="-301.32046"
     inkscape:document-units="px"
     inkscape:current-layer="g4546"
     showgrid="false"
     units="px"
     inkscape:pagecheckerboard="true"
     showguides="true"
     inkscape:guide-bbox="true"
     inkscape:snap-global="false"
     inkscape:window-width="1280"
     inkscape:window-height="657"
     inkscape:window-x="-8"
     inkscape:window-y="-8"
     inkscape:window-maximized="1" />
  <metadata
     id="metadata5">
    <rdf:RDF>
      <cc:Work
         rdf:about="">
        <dc:format>image/svg+xml</dc:format>
        <dc:type
           rdf:resource="http://purl.org/dc/dcmitype/StillImage" />
        <dc:title></dc:title>
      </cc:Work>
    </rdf:RDF>
  </metadata>
  <g
     inkscape:label="Camada 1"
     inkscape:groupmode="layer"
     id="layer1"
     transform="translate(0,-111.79266)">
    <g
       id="g4546"
       transform="matrix(2.3899849,0,0,2.3899849,-2.2495269,-408.36336)">
      <rect
         style="opacity:0.8;fill:#ffffff;fill-opacity:1;stroke:none;stroke-width:0.61706573;stroke-miterlimit:4;stroke-dasharray:none;stroke-opacity:1"
         id="rect4520"
         width="6.8796067"
         height="13.759213"
         x="36.247696"
         y="260.60132" />
      <rect
         y="242.40971"
         x="36.247696"
         height="13.759213"
         width="6.8796067"
         id="rect4522"
         style="opacity:0.8;fill:#ffffff;fill-opacity:1;stroke:none;stroke-width:0.61706573;stroke-miterlimit:4;stroke-dasharray:none;stroke-opacity:1" />
      <path
         sodipodi:nodetypes="ccccccccccccc"
         inkscape:connector-curvature="0"
         id="rect4524"
         d="m 39.867037,220.22014 -4.598417,4.59897 0.01389,0.0139 -16.460232,17.14228 h 8.515338 l 12.543312,-12.54331 12.543311,12.54331 8.128484,-0.0106 -16.072823,-17.13168 0.01389,-0.0139 -4.598973,-4.59896 -0.01389,0.0139 z"
         style="opacity:0.8;fill:#ffffff;fill-opacity:1;stroke:none;stroke-width:0.58131677;stroke-miterlimit:4;stroke-dasharray:none;stroke-opacity:1" />
      <rect
         y="278.79294"
         x="36.247696"
         height="13.759213"
         width="6.8796067"
         id="rect4540"
         style="opacity:0.8;fill:#ffffff;fill-opacity:1;stroke:none;stroke-width:0.61706573;stroke-miterlimit:4;stroke-dasharray:none;stroke-opacity:1" />
    </g>
  </g>
</svg>
