[gd_scene load_steps=4 format=2]

[ext_resource path="res://assets/scenes/Mob.gd" type="Script" id=1]

[sub_resource type="SpriteFrames" id=1]

animations = [ {
"frames": [  ],
"loop": true,
"name": "default",
"speed": 5.0
} ]

[sub_resource type="CapsuleShape" id=2]

radius = 1.0
height = 1.0

[node name="Mob" type="Node" index="0"]

script = ExtResource( 1 )
isDead = false

[node name="body" type="RigidBody" parent="." index="0"]

editor/display_folded = true
input_ray_pickable = true
input_capture_on_drag = false
collision_layer = 1
collision_mask = 1
mode = 0
mass = 1.0
friction = 1.0
bounce = 0.0
gravity_scale = 1.0
custom_integrator = false
continuous_cd = false
contacts_reported = 0
contact_monitor = false
sleeping = false
can_sleep = true
axis_lock_linear_x = false
axis_lock_linear_y = false
axis_lock_linear_z = false
axis_lock_angular_x = false
axis_lock_angular_y = false
axis_lock_angular_z = false
linear_velocity = Vector3( 0, 0, 0 )
linear_damp = -1.0
angular_velocity = Vector3( 0, 0, 0 )
angular_damp = -1.0

[node name="Animation" type="AnimatedSprite" parent="body" index="0"]

frames = SubResource( 1 )
animation = "default"

[node name="Collision" type="CollisionShape" parent="body" index="1"]

shape = SubResource( 2 )
disabled = false

[node name="VisibilityNotifier" type="VisibilityNotifier" parent="body" index="2"]

aabb = AABB( -1, -1, -1, 2, 2, 2 )


