\relax 
\providecommand\hyper@newdestlabel[2]{}
\providecommand\HyperFirstAtBeginDocument{\AtBeginDocument}
\HyperFirstAtBeginDocument{\ifx\hyper@anchor\@undefined
\global\let\oldcontentsline\contentsline
\gdef\contentsline#1#2#3#4{\oldcontentsline{#1}{#2}{#3}}
\global\let\oldnewlabel\newlabel
\gdef\newlabel#1#2{\newlabelxx{#1}#2}
\gdef\newlabelxx#1#2#3#4#5#6{\oldnewlabel{#1}{{#2}{#3}}}
\AtEndDocument{\ifx\hyper@anchor\@undefined
\let\contentsline\oldcontentsline
\let\newlabel\oldnewlabel
\fi}
\fi}
\global\let\hyper@last\relax 
\gdef\HyperFirstAtBeginDocument#1{#1}
\providecommand\HyField@AuxAddToFields[1]{}
\providecommand\HyField@AuxAddToCoFields[2]{}
\@writefile{toc}{\contentsline {section}{\numberline {1}Introduction}{2}{section.1}}
\@writefile{toc}{\contentsline {subsection}{\numberline {1.1}Summary}{2}{subsection.1.1}}
\@writefile{toc}{\contentsline {subsection}{\numberline {1.2}NLO sector antenna functions}{2}{subsection.1.2}}
\@writefile{toc}{\contentsline {subsection}{\numberline {1.3}NNLO sector antenna functions}{4}{subsection.1.3}}
\citation{Czakon:2010td,Caola:2017dug}
\@writefile{toc}{\contentsline {section}{\numberline {2}Antenna functions at NLO}{5}{section.2}}
\@writefile{toc}{\contentsline {subsection}{\numberline {2.1}Amplitude squared level}{5}{subsection.2.1}}
\citation{Berends:1987me,Berends:1988zn}
\@writefile{toc}{\contentsline {subsection}{\numberline {2.2}Amplitude level}{7}{subsection.2.2}}
\citation{Berends:1988zn}
\@writefile{toc}{\contentsline {section}{\numberline {3}Antenna functions at NNLO}{8}{section.3}}
\@writefile{toc}{\contentsline {subsection}{\numberline {3.1}Amplitude squared level}{8}{subsection.3.1}}
\citation{Berends:1987me}
\@writefile{toc}{\contentsline {subsection}{\numberline {3.2}Amplitude level}{10}{subsection.3.2}}
\@writefile{toc}{\contentsline {subsection}{\numberline {3.3}Triple-collinear amplitude level splitting functions (under construction)}{10}{subsection.3.3}}
\@writefile{toc}{\contentsline {section}{\numberline {4}Generalized subtraction}{12}{section.4}}
\@writefile{toc}{\contentsline {subsection}{\numberline {4.1}Single Pole}{14}{subsection.4.1}}
\@writefile{toc}{\contentsline {subsection}{\numberline {4.2}One-gluon unresolved}{14}{subsection.4.2}}
\@writefile{toc}{\contentsline {subsection}{\numberline {4.3}Two-gluon unresolved}{14}{subsection.4.3}}
\citation{Kosower:2002su}
\citation{Czakon:2010td,Caola:2017dug}
\@writefile{toc}{\contentsline {section}{\numberline {5}Obsolete stuff}{16}{section.5}}
\@writefile{toc}{\contentsline {section}{\numberline {A}Subtraction functions at NNLO}{16}{appendix.A}}
\citation{Kosower:2002su}
\@writefile{toc}{\contentsline {section}{\numberline {B}Antenna functions at NLO}{17}{appendix.B}}
\@writefile{toc}{\contentsline {subsection}{\numberline {B.1}Kosower method}{17}{subsection.B.1}}
\newlabel{ampdecom}{{B.1}{17}{Kosower method}{equation.B.1}{}}
\newlabel{lightgauge}{{B.2}{17}{Kosower method}{equation.B.2}{}}
\newlabel{momlim}{{B.3}{17}{Kosower method}{equation.B.3}{}}
\newlabel{baseant}{{B.4}{17}{Kosower method}{equation.B.4}{}}
\citation{Kosower:2002su}
\citation{Czakon:2010td,Caola:2017dug}
\@writefile{toc}{\contentsline {subsection}{\numberline {B.2}Czakon-Melnikov method}{18}{subsection.B.2}}
\newlabel{softcolop}{{B.6}{18}{Czakon-Melnikov method}{equation.B.6}{}}
\newlabel{NLOfin}{{B.8}{18}{Czakon-Melnikov method}{equation.B.8}{}}
\@writefile{toc}{\contentsline {subsection}{\numberline {B.3}Method 3}{19}{subsection.B.3}}
\@writefile{toc}{\contentsline {subsection}{\numberline {B.4}Method 3 on amplitude level for all flavor cases}{20}{subsection.B.4}}
\citation{Berends:1987me,Berends:1988zn}
\citation{Czakon:2010td,Caola:2017dug}
\@writefile{toc}{\contentsline {section}{\numberline {C}Antenna functions at NNLO}{21}{appendix.C}}
\@writefile{toc}{\contentsline {subsection}{\numberline {C.1}Kosower method}{21}{subsection.C.1}}
\@writefile{toc}{\contentsline {subsection}{\numberline {C.2}Czakon-Melnikov method}{21}{subsection.C.2}}
\citation{Berends:1988zn}
\citation{Campbell:1997hg}
\@writefile{toc}{\contentsline {subsection}{\numberline {C.3}Method 3}{22}{subsection.C.3}}
\citation{Berends:1987cv}
\newlabel{indeplim}{{C.7}{23}{Method 3}{equation.C.7}{}}
\bibstyle{JHEP}
\bibdata{subtractions.bib}
\bibcite{Kosower:2002su}{{1}{}{{}}{{}}}
\bibcite{Czakon:2010td}{{2}{}{{}}{{}}}
\bibcite{Caola:2017dug}{{3}{}{{}}{{}}}
\bibcite{Berends:1988zn}{{4}{}{{}}{{}}}
\bibcite{Campbell:1997hg}{{5}{}{{}}{{}}}
\bibcite{Berends:1987cv}{{6}{}{{}}{{}}}
\bibcite{Berends:1987me}{{7}{}{{}}{{}}}
\providecommand\NAT@force@numbers{}\NAT@force@numbers
