\relax 
\providecommand\hyper@newdestlabel[2]{}
\providecommand\HyperFirstAtBeginDocument{\AtBeginDocument}
\HyperFirstAtBeginDocument{\ifx\hyper@anchor\@undefined
\global\let\oldcontentsline\contentsline
\gdef\contentsline#1#2#3#4{\oldcontentsline{#1}{#2}{#3}}
\global\let\oldnewlabel\newlabel
\gdef\newlabel#1#2{\newlabelxx{#1}#2}
\gdef\newlabelxx#1#2#3#4#5#6{\oldnewlabel{#1}{{#2}{#3}}}
\AtEndDocument{\ifx\hyper@anchor\@undefined
\let\contentsline\oldcontentsline
\let\newlabel\oldnewlabel
\fi}
\fi}
\global\let\hyper@last\relax 
\gdef\HyperFirstAtBeginDocument#1{#1}
\providecommand\HyField@AuxAddToFields[1]{}
\providecommand\HyField@AuxAddToCoFields[2]{}
\citation{Figy:2018imt,Chen:2019flj}
\@writefile{toc}{\contentsline {section}{\numberline {1}A very brief introduction to FBPS}{2}{section.1}}
\citation{Czakon:2010td,Caola:2017dug}
\citation{Caola:2017dug}
\citation{Caola:2017dug}
\@writefile{toc}{\contentsline {section}{\numberline {2}Processes}{3}{section.2}}
\@writefile{toc}{\contentsline {subsection}{\numberline {2.1}$PP\rightarrow V$}{3}{subsection.2.1}}
\@writefile{toc}{\contentsline {subsubsection}{\numberline {2.1.1}NLO}{3}{subsubsection.2.1.1}}
\citation{Catani:1998bh}
\bibstyle{JHEP}
\bibdata{mcfm_fbps.bib}
\bibcite{Figy:2018imt}{{1}{}{{}}{{}}}
\bibcite{Chen:2019flj}{{2}{}{{}}{{}}}
\bibcite{Czakon:2010td}{{3}{}{{}}{{}}}
\bibcite{Caola:2017dug}{{4}{}{{}}{{}}}
\bibcite{Catani:1998bh}{{5}{}{{}}{{}}}
\providecommand\NAT@force@numbers{}\NAT@force@numbers
\@writefile{toc}{\contentsline {subsubsection}{\numberline {2.1.2}NNLO}{7}{subsubsection.2.1.2}}
\@writefile{toc}{\contentsline {subsection}{\numberline {2.2}$PP\rightarrow V+$ jet}{7}{subsection.2.2}}
\@writefile{toc}{\contentsline {subsubsection}{\numberline {2.2.1}NLO}{7}{subsubsection.2.2.1}}
\@writefile{toc}{\contentsline {subsubsection}{\numberline {2.2.2}NNLO}{7}{subsubsection.2.2.2}}
\@writefile{toc}{\contentsline {subsection}{\numberline {2.3}$PP\rightarrow 2$ jets}{7}{subsection.2.3}}
\@writefile{toc}{\contentsline {subsubsection}{\numberline {2.3.1}NLO}{7}{subsubsection.2.3.1}}
\@writefile{toc}{\contentsline {subsubsection}{\numberline {2.3.2}NNLO}{7}{subsubsection.2.3.2}}
\@writefile{toc}{\contentsline {subsection}{\numberline {2.4}$PP\rightarrow V+2$ jets}{7}{subsection.2.4}}
\@writefile{toc}{\contentsline {subsubsection}{\numberline {2.4.1}NLO}{7}{subsubsection.2.4.1}}
\@writefile{toc}{\contentsline {subsubsection}{\numberline {2.4.2}NNLO}{7}{subsubsection.2.4.2}}
\@writefile{toc}{\contentsline {subsection}{\numberline {2.5}$PP\rightarrow 3$ jets}{7}{subsection.2.5}}
\@writefile{toc}{\contentsline {subsubsection}{\numberline {2.5.1}NLO}{7}{subsubsection.2.5.1}}
\@writefile{toc}{\contentsline {subsubsection}{\numberline {2.5.2}NNLO}{7}{subsubsection.2.5.2}}
