Beschreibung,Betrag,Datum,Gesamtkilometer,Liter,Tageskilometer,Tags
Tankstelle,"85,23",02.05.24,211993,"45,12",595
Jet,"80,83",12.08.23,210273,"43,02",619,
Tankstelle,"70,45",18.11.23,211394,"38,31",525,
Tankstelle,"83,08",13.07.23,209655,"44,69",619,
Hessol,"77,11",15.06.24,212618,"41,97",625,
HEM,"70,20",19.03.23,208401,"39,24",533,
Tankstelle,"76,98",27.06.24,213268,"43,03",650,