<?xml version="1.0" encoding="UTF-8" standalone="no"?>
<svg
   xmlns:dc="http://purl.org/dc/elements/1.1/"
   xmlns:cc="http://creativecommons.org/ns#"
   xmlns:rdf="http://www.w3.org/1999/02/22-rdf-syntax-ns#"
   xmlns:svg="http://www.w3.org/2000/svg"
   xmlns="http://www.w3.org/2000/svg"
   xmlns:sodipodi="http://sodipodi.sourceforge.net/DTD/sodipodi-0.dtd"
   xmlns:inkscape="http://www.inkscape.org/namespaces/inkscape"
   width="16"
   height="16"
   viewBox="0 0 4.2333333 4.2333333"
   version="1.1"
   id="svg8"
   inkscape:version="1.0.1 (c497b03c, 2020-09-10)"
   sodipodi:docname="federdill.svg">
  <defs
     id="defs2" />
  <sodipodi:namedview
     id="base"
     pagecolor="#ffffff"
     bordercolor="#666666"
     borderopacity="1.0"
     inkscape:pageopacity="0.0"
     inkscape:pageshadow="2"
     inkscape:zoom="19.274198"
     inkscape:cx="16.955211"
     inkscape:cy="13.313688"
     inkscape:document-units="mm"
     inkscape:current-layer="layer1"
     inkscape:document-rotation="0"
     showgrid="false"
     units="px"
     inkscape:window-width="1248"
     inkscape:window-height="755"
     inkscape:window-x="0"
     inkscape:window-y="23"
     inkscape:window-maximized="0" />
  <metadata
     id="metadata5">
    <rdf:RDF>
      <cc:Work
         rdf:about="">
        <dc:format>image/svg+xml</dc:format>
        <dc:type
           rdf:resource="http://purl.org/dc/dcmitype/StillImage" />
        <dc:title></dc:title>
      </cc:Work>
    </rdf:RDF>
  </metadata>
  <g
     inkscape:label="Ebene 1"
     inkscape:groupmode="layer"
     id="layer1">
    <g
       id="layer101"
       fill="#040404"
       stroke="none"
       transform="matrix(0.38529101,0,0,0.38529101,-0.75654582,-0.00896071)"
       inkscape:transform-center-x="0.19218266"
       inkscape:transform-center-y="-0.05490933">
      <path
         d="M 12.5067,11 C 12.3174,10.8987 10.0374,9.9867 9.8667,9.9413 9.7574,9.9146 9.52,9.88 9.3414,9.8693 9.0401,9.8506 8.9574,9.8346 8.9921,9.8 9.0001,9.792 9.1014,9.7787 9.2188,9.768 c 0.416,-0.032 0.968,0.0907 1.592,0.352 0.1147,0.048 -0.288,-0.2853 -0.5813,-0.4827 C 9.8162,9.36 9.8188,9.36 9.6775,9.36 9.4722,9.36 9.3175,9.424 9.1602,9.5707 9.0349,9.688 9.0029,9.7067 8.9095,9.7067 8.7655,9.7067 8.7708,9.6747 8.9282,9.6214 8.9975,9.5947 9.0962,9.5334 9.1469,9.4801 L 9.2376,9.3868 H 9.0483 c -0.128,0 -0.224,0.016 -0.3067,0.0533 -0.1813,0.08 -0.3867,0.0933 -0.4987,0.0347 -0.12,-0.0613 -0.144,-0.1253 -0.0373,-0.0987 0.12,0.032 0.3867,0.024 0.4747,-0.0133 L 8.7603,9.3281 8.5736,9.2774 C 8.4723,9.2481 8.2803,9.2187 8.1469,9.2107 8.0162,9.2054 7.8429,9.1814 7.7629,9.1574 7.5656,9.1014 7.3336,8.9947 7.3336,8.9627 c 0,-0.04 0.0027,-0.04 0.288,0.0507 0.1387,0.0453 0.2667,0.0773 0.2827,0.072 C 7.9203,9.0801 7.8856,9.0614 7.827,9.0427 7.7683,9.0267 7.675,8.9974 7.6217,8.9814 7.5257,8.9521 7.4004,8.8534 7.4617,8.8534 7.491,8.8534 8.747,9.2054 8.8404,9.2401 8.8697,9.2508 8.8111,9.2028 8.7124,9.1361 8.5444,9.0241 8.5097,9.0108 8.2911,8.9868 8.0724,8.9628 7.7018,8.8828 7.5951,8.8401 7.5684,8.8294 7.5471,8.8028 7.5471,8.7814 c 0,-0.0293 0.0133,-0.0347 0.048,-0.0213 0.144,0.0587 0.656,0.1467 0.6133,0.1067 C 8.2004,8.8561 8.1044,8.8161 7.9977,8.7735 7.811,8.7015 7.7337,8.6402 7.8244,8.6402 c 0.0933,0 0.672,0.256 0.8907,0.392 0.264,0.1653 0.312,0.1893 0.4987,0.224 0.0907,0.016 0.1787,0.016 0.2747,-0.0053 L 9.6325,9.2216 9.5045,9.1363 C 9.3632,9.0403 8.6005,8.5816 8.4832,8.5203 c -0.064,-0.032 -0.104,-0.032 -0.2853,0 -0.1147,0.0213 -0.2853,0.0373 -0.376,0.04 -0.1653,0 -0.3253,-0.04 -0.2907,-0.072 C 7.5419,8.4776 7.7125,8.4563 7.9152,8.4403 8.2485,8.4136 8.2752,8.4083 8.2085,8.3736 8.1498,8.3469 8.1045,8.3443 7.9818,8.3709 7.6965,8.4269 7.3125,8.4349 7.0965,8.3896 6.9312,8.3549 6.8325,8.3069 6.8645,8.2749 6.8672,8.2722 6.9418,8.2802 7.0298,8.2936 7.1151,8.3069 7.2485,8.3229 7.3205,8.3309 7.5525,8.3522 7.4005,8.2856 7.0298,8.2002 6.8458,8.1602 6.6938,8.1149 6.6938,8.1015 c 0,-0.0427 0.208,-0.0187 0.6373,0.072 0.632,0.136 0.6693,0.1013 0.0587,-0.0507 L 6.8725,7.9948 6.7178,8.0375 C 6.5818,8.0748 6.5445,8.0748 6.3445,8.0402 6.2218,8.0189 6.0832,7.9895 6.0405,7.9762 5.9952,7.9655 5.9232,7.9602 5.8805,7.9655 5.8352,7.9735 5.7658,7.9628 5.7205,7.9468 5.6485,7.9175 5.6458,7.9121 5.6938,7.8935 5.7391,7.8775 5.7311,7.8695 5.6458,7.8428 5.5285,7.8028 5.5125,7.7495 5.6245,7.7655 5.6832,7.7735 5.6992,7.7682 5.6858,7.7388 5.6751,7.7068 5.6991,7.7015 5.8298,7.7148 L 5.9871,7.7308 5.8938,7.6881 C 5.8325,7.6588 5.7205,7.6454 5.5685,7.6428 5.2992,7.6401 5.2672,7.5975 5.5098,7.5655 5.5951,7.5522 5.6751,7.5282 5.6858,7.5122 5.6991,7.4935 5.7738,7.4802 5.8831,7.4829 l 0.176,0.0027 -0.2293,-0.12 C 5.7045,7.3016 5.6005,7.2376 5.6005,7.2216 c 0,-0.0613 0.2027,0.0267 0.6667,0.2853 0.544,0.304 0.5733,0.3173 0.8347,0.3867 L 7.2859,7.9416 7.2352,7.8883 C 7.1819,7.827 6.8085,7.6056 6.5152,7.4536 6.4085,7.4003 6.3205,7.3469 6.3205,7.3336 c 0,-0.0693 0.36,0.0667 0.5787,0.216 L 7.0272,7.6376 6.9579,7.5443 C 6.9206,7.4963 6.7766,7.379 6.6379,7.2856 6.3766,7.1096 6.3339,7.0669 6.4219,7.0669 c 0.096,0 0.4533,0.264 0.624,0.4613 0.2987,0.3387 0.376,0.4053 0.5707,0.4853 0.1013,0.04 0.3253,0.1333 0.496,0.2053 0.3253,0.136 0.36,0.1387 0.448,0.032 C 8.5953,8.2135 8.5899,8.2001 8.5286,8.1468 8.4886,8.1121 8.4033,8.0775 8.3286,8.0668 8.2593,8.0588 8.0726,8.0188 7.9153,7.9815 7.6753,7.9282 7.5953,7.8935 7.4273,7.7842 7.238,7.6589 7.1846,7.6002 7.262,7.6002 c 0.0293,0 0.072,0.0213 0.3067,0.1653 0.16,0.096 0.088,0.0267 -0.1413,-0.1387 C 7.2301,7.4855 7.1607,7.4135 7.2167,7.4135 c 0.032,0 0.2747,0.1493 0.496,0.3093 0.192,0.136 0.2613,0.1707 0.408,0.1973 0.096,0.0187 0.1813,0.0267 0.1867,0.0213 0.024,-0.024 -0.176,-0.2027 -0.2613,-0.2373 -0.192,-0.0747 -0.632,-0.328 -0.632,-0.3627 0,-0.0453 -0.0107,-0.0507 0.2587,0.0747 0.2107,0.096 0.2293,0.1013 0.168,0.04 C 7.8035,7.4188 7.6355,7.3148 7.4675,7.2241 7.0275,6.9894 6.6648,6.7681 6.6488,6.7281 6.6275,6.6721 6.3608,6.5334 6.2755,6.5334 6.2275,6.5334 6.1742,6.5574 6.1342,6.6001 6.0569,6.6801 5.9689,6.7094 5.6809,6.7441 5.5556,6.7601 5.3582,6.7894 5.2409,6.8134 4.8569,6.8827 4.4142,6.8507 4.3796,6.7467 4.3716,6.7227 4.3823,6.7174 4.4169,6.7307 4.4462,6.744 4.5449,6.7574 4.6409,6.7627 L 4.8142,6.7734 4.6622,6.7174 C 4.5102,6.6641 4.4595,6.6134 4.5555,6.6134 c 0.0267,0 0.1387,0.0293 0.248,0.0667 0.184,0.064 0.2107,0.0667 0.4107,0.04 C 5.3315,6.7068 5.4409,6.6774 5.4622,6.6588 5.4969,6.6215 5.4889,6.6215 5.1289,6.6055 c -0.04,0 -0.0453,-0.0347 -0.008,-0.0587 0.0133,-0.008 0.0187,-0.032 0.008,-0.0533 -0.0187,-0.0533 0.016,-0.0507 0.2133,0.016 0.176,0.0587 0.344,0.056 0.5733,-0.0107 l 0.112,-0.0347 -0.12,-0.0853 c -0.0693,-0.048 -0.1547,-0.0853 -0.2,-0.0853 -0.1947,0 -0.64,-0.1493 -0.64,-0.216 0,-0.0347 0.0213,-0.032 0.1733,0.0267 0.0747,0.0267 0.1947,0.0587 0.2667,0.0667 0.128,0.0187 0.1307,0.016 0.0667,-0.0213 C 5.5369,6.1283 5.4435,6.1016 5.3662,6.0909 5.2622,6.0776 5.2275,6.0642 5.2382,6.0376 5.2462,6.0136 5.2169,5.9923 5.1422,5.9709 5.0809,5.9549 4.9795,5.9069 4.9182,5.8642 4.8542,5.8215 4.7742,5.7869 4.7369,5.7869 4.6649,5.7869 4.6382,5.7229 4.7022,5.6989 4.7209,5.6909 4.7155,5.6829 4.6862,5.6829 4.6595,5.6802 4.5635,5.7122 4.4729,5.7522 4.2889,5.8295 4.0302,5.8989 3.9956,5.8775 3.9449,5.8455 3.9823,5.8188 4.1289,5.7842 L 4.2809,5.7495 4.1716,5.7308 C 4.0303,5.7041 3.8676,5.6375 3.8676,5.6028 c 0,-0.04 0.0427,-0.0373 0.1973,0.0107 0.1547,0.048 0.3573,0.0507 0.4613,0.0107 L 4.6009,5.5922 4.4809,5.5389 C 4.3182,5.4642 4.1582,5.4722 3.7689,5.5709 3.4142,5.6616 3.3716,5.6669 3.3476,5.6242 3.3209,5.5815 3.3396,5.5735 3.5236,5.5442 3.6169,5.5309 3.7796,5.4935 3.8809,5.4615 L 4.0676,5.4055 3.9476,5.3682 C 3.8703,5.3442 3.7769,5.3362 3.6809,5.3469 3.4062,5.3789 3.3556,5.3736 3.3022,5.3042 3.2382,5.2295 3.2702,5.2109 3.3715,5.2642 c 0.064,0.032 0.0933,0.032 0.1947,0.0027 0.0907,-0.0267 0.16,-0.0293 0.2827,-0.0107 0.088,0.016 0.1707,0.032 0.184,0.04 0.0107,0.008 0.0213,0.0053 0.0213,-0.0027 0,-0.0267 -0.4293,-0.2187 -0.5333,-0.24 -0.1413,-0.0293 -0.3733,-0.12 -0.3733,-0.1467 0,-0.0533 0.0613,-0.0507 0.256,0.0107 0.1147,0.0373 0.2133,0.064 0.2187,0.0587 C 3.6276,4.9709 3.5423,4.9335 3.4356,4.8935 3.3289,4.8535 3.2303,4.8082 3.2169,4.7975 3.1609,4.7468 3.2302,4.7495 3.4356,4.8108 L 3.6516,4.8721 3.6063,4.8108 C 3.5823,4.7761 3.553,4.7468 3.5423,4.7468 c -0.032,0 -0.024,-0.08 0.0053,-0.08 0.0133,0 0.0747,0.0427 0.1333,0.096 0.0587,0.0533 0.1067,0.0827 0.1067,0.0667 0,-0.0373 0.1253,-0.04 0.1467,-0.0027 0.008,0.016 0.0293,0.0267 0.0427,0.0267 0.016,0 -0.056,-0.0667 -0.16,-0.1493 -0.1813,-0.144 -0.224,-0.1973 -0.16,-0.1973 0.04,0 0.3387,0.2267 0.4373,0.3307 0.0453,0.048 0.1627,0.1333 0.2667,0.1893 L 4.545,5.1309 4.489,5.0536 C 4.457,5.0083 4.3717,4.9149 4.297,4.8403 4.1557,4.7043 4.1343,4.667 4.1983,4.667 c 0.04,0 0.3627,0.3253 0.5813,0.5867 0.1333,0.16 0.4213,0.3867 0.744,0.5867 0.1093,0.0667 0.1227,0.0693 0.112,0.024 -0.0213,-0.08 0.0187,-0.0613 0.12,0.0587 0.0827,0.096 0.344,0.2907 0.392,0.2907 0.0213,0 -0.12,-0.2133 -0.1973,-0.3013 C 5.913,5.8698 5.7983,5.7925 5.6943,5.7418 5.4676,5.6271 5.369,5.5498 4.8463,5.0645 4.6756,4.9098 4.617,4.8272 4.673,4.8272 c 0.0187,0 0.1413,0.0987 0.272,0.2213 l 0.24,0.2187 -0.136,-0.2 C 4.817,4.7259 4.6623,4.6245 4.4997,4.7072 4.4277,4.7445 4.4117,4.7419 4.3504,4.7045 4.3131,4.6805 4.2464,4.6218 4.2011,4.5738 4.1398,4.5098 4.0544,4.4671 3.8464,4.4031 3.6971,4.3551 3.5691,4.3044 3.5611,4.2938 3.5531,4.2805 3.5024,4.2565 3.4464,4.2378 3.2864,4.1845 3.1344,4.0538 3.2331,4.0538 c 0.0187,0 0.1253,0.048 0.24,0.1093 0.1173,0.0587 0.2933,0.1253 0.4027,0.1467 0.104,0.0213 0.216,0.0453 0.2453,0.0533 C 4.1958,4.3791 3.9318,4.2564 3.6144,4.1284 3.3611,4.0244 3.2571,3.9631 3.2837,3.9364 3.297,3.9231 3.7957,4.0911 3.9877,4.1711 L 4.0944,4.2164 4.0144,4.1337 C 3.9691,4.0884 3.8491,4.0084 3.7451,3.9577 L 3.5531,3.867 3.1851,3.883 C 2.7984,3.899 2.6198,3.8723 2.5931,3.7897 c -0.008,-0.0267 0,-0.032 0.0373,-0.0187 0.1013,0.04 0.224,0.048 0.4027,0.0293 L 3.2144,3.779 2.9877,3.7043 C 2.865,3.6616 2.737,3.627 2.705,3.627 2.673,3.627 2.6277,3.619 2.6037,3.611 2.529,3.5817 2.5584,3.547 2.657,3.547 2.7957,3.547 2.7477,3.5043 2.4303,3.347 2.281,3.275 2.161,3.2057 2.161,3.1923 c 0,-0.0347 0.1573,0.0053 0.3013,0.0773 0.0693,0.0373 0.1947,0.0827 0.28,0.1013 0.1653,0.04 0.4053,0.0747 0.4053,0.0587 0,-0.0187 -0.2133,-0.0907 -0.4453,-0.152 C 2.5583,3.2403 2.481,3.2083 2.481,3.1843 2.481,3.131 2.5637,3.139 2.8303,3.211 c 0.2853,0.0773 0.448,0.1653 0.7093,0.3813 0.112,0.0933 0.2213,0.168 0.2453,0.168 0.0293,0 0.016,-0.0267 -0.0427,-0.08 C 3.6595,3.6056 3.6302,3.547 3.6755,3.547 c 0.0347,0 0.1467,0.0827 0.2613,0.192 0.08,0.0773 0.168,0.1253 0.344,0.184 0.1307,0.0427 0.2453,0.0773 0.2587,0.0773 0.0133,0 -0.0267,-0.0667 -0.0907,-0.1467 C 4.3581,3.7363 4.3075,3.6989 4.2008,3.6643 4.1288,3.6403 4.0568,3.611 4.0408,3.6003 4.0275,3.5896 3.9555,3.571 3.8835,3.5603 3.6515,3.5283 2.7928,3.035 2.7528,2.915 2.7421,2.8777 2.8168,2.867 2.8328,2.9017 c 0.016,0.048 0.2827,0.216 0.5013,0.3227 L 3.5608,3.3364 3.4088,3.1817 C 3.3235,3.0964 3.2541,3.019 3.2541,3.011 3.2541,3.003 3.2968,2.995 3.3474,2.9923 3.5581,2.9843 3.5314,2.9496 3.1847,2.771 2.8807,2.619 2.7634,2.5337 2.8007,2.4963 2.8087,2.491 2.9234,2.5363 3.054,2.603 3.1873,2.667 3.3473,2.7283 3.414,2.7363 L 3.534,2.7523 3.3687,2.6456 C 3.278,2.5869 3.19,2.5123 3.174,2.4829 3.134,2.4029 3.1793,2.4109 3.31,2.5069 3.3713,2.5496 3.43,2.5789 3.4433,2.5709 3.4566,2.5629 3.5046,2.5816 3.5473,2.6136 3.606,2.6563 3.622,2.6589 3.6113,2.6296 3.5873,2.5656 3.646,2.5789 3.7793,2.6669 3.8913,2.7442 3.974,2.7682 3.974,2.7282 3.9713,2.6935 3.5793,2.4775 3.4487,2.4375 3.3714,2.4135 3.198,2.4002 2.9847,2.4002 c -0.36,0 -0.424,-0.0107 -0.424,-0.0693 0,-0.0293 0.0667,-0.0373 0.328,-0.04 H 3.214 L 3.014,2.2376 C 2.9047,2.2109 2.7553,2.1549 2.6807,2.1176 2.5207,2.0376 2.1607,1.7469 2.1607,1.6963 2.1607,1.675 2.198,1.6616 2.2647,1.659 2.3554,1.6537 2.4007,1.6777 2.5794,1.811 2.6941,1.899 2.8301,2.0057 2.8807,2.051 2.958,2.1177 3.142,2.203 3.1634,2.179 3.1661,2.1763 3.0327,2.083 2.8647,1.9737 2.6994,1.8644 2.5607,1.7657 2.5607,1.755 c 0,-0.04 0.072,-0.0213 0.2187,0.0533 L 2.9261,1.883 2.8728,1.8083 C 2.7715,1.6696 2.6248,1.5976 2.3395,1.547 2.0995,1.5043 2.0302,1.4723 2.0275,1.403 c 0,-0.0107 0.032,-0.016 0.072,-0.0053 0.0427,0.008 0.0587,0.008 0.0427,0 C 2.1022,1.379 2.0969,1.307 2.1342,1.307 c 0.016,0 0.128,0.04 0.2507,0.0907 L 2.6089,1.4884 2.4649,1.2857 C 2.3262,1.0884 2.2996,1.0217 2.3902,1.0964 c 0.024,0.0187 0.1067,0.12 0.184,0.224 0.176,0.232 0.288,0.3413 0.8373,0.7973 0.4827,0.4 0.632,0.496 0.768,0.496 H 4.2702 L 4.2275,2.5417 C 4.2062,2.499 4.1288,2.395 4.0595,2.307 3.9528,2.1737 3.8782,2.1177 3.6222,1.9737 3.2649,1.7737 3.2275,1.7444 3.2275,1.6777 c 0,-0.0667 0.032,-0.064 0.096,0.0053 0.0267,0.032 0.112,0.0853 0.184,0.1227 C 3.6622,1.883 3.6542,1.875 3.3955,1.6724 3.2008,1.5177 3.1582,1.4751 3.1822,1.4511 c 0.024,-0.024 0.12,0.04 0.3707,0.232 0.2507,0.1973 0.3227,0.2107 0.1013,0.0187 -0.072,-0.064 -0.1333,-0.1307 -0.1333,-0.1467 0,-0.048 0.04,-0.0427 0.08,0.0053 0.0293,0.0347 0.04,0.0347 0.056,0.008 0.016,-0.0267 0.0507,-0.0053 0.1227,0.0747 0.096,0.104 0.1387,0.1253 0.5147,0.2453 C 4.3156,1.8937 4.2276,1.8324 4.0943,1.7471 3.9636,1.6618 3.8356,1.5764 3.8143,1.5578 3.7823,1.5258 3.7823,1.5205 3.8223,1.5205 c 0.0613,0 0.2347,0.088 0.4187,0.2133 0.08,0.056 0.224,0.1467 0.32,0.2027 0.096,0.056 0.264,0.1893 0.3733,0.2987 0.1973,0.1947 0.312,0.288 0.3307,0.2693 C 5.2863,2.4832 4.5983,1.7312 4.4943,1.6592 4.4356,1.6165 4.2676,1.5312 4.121,1.4645 3.681,1.2698 3.4837,1.1498 3.5263,1.1045 c 0.008,-0.0053 0.0987,0.0293 0.2,0.08 0.104,0.0533 0.2213,0.1067 0.264,0.1227 0.0693,0.0267 0.064,0.016 -0.056,-0.1067 C 3.8623,1.1258 3.753,1.0378 3.6943,1.0085 3.5343,0.9258 3.2276,0.6885 3.2276,0.6485 3.2276,0.5952 3.2463,0.6032 3.4463,0.7498 3.5876,0.8538 3.6196,0.8671 3.585,0.8165 3.561,0.7792 3.5477,0.7312 3.5557,0.7098 3.5664,0.6858 3.5397,0.6511 3.481,0.6165 3.4037,0.5712 3.3077,0.4538 3.3477,0.4538 c 0.008,0 0.064,0.0267 0.1253,0.056 L 3.585,0.5658 3.5343,0.4911 C 3.3876,0.2671 3.329,0.1578 3.3423,0.1418 3.353,0.1338 3.3636,0.1311 3.369,0.1365 3.4437,0.2405 3.6623,0.5072 3.6703,0.5072 3.6756,0.5072 3.625,0.4245 3.561,0.3232 3.449,0.1525 3.4117,0.0512 3.4623,0.0539 3.4836,0.0566 3.5903,0.1926 3.7343,0.4139 3.793,0.5019 3.897,0.6352 3.961,0.7072 L 4.0837,0.8405 4.001,0.6618 C 3.9477,0.5391 3.921,0.4405 3.921,0.3525 3.921,0.2565 3.9077,0.2085 3.8677,0.1738 3.8037,0.1151 3.7984,0.0805 3.857,0.0805 c 0.0773,0 0.144,0.1067 0.144,0.2267 0,0.0613 0.0133,0.152 0.032,0.2027 0.04,0.1147 0.1307,0.2693 0.1467,0.2533 C 4.201,0.7419 4.1904,0.2832 4.1637,0.1525 4.145,0.0538 4.1477,0.0272 4.177,0.0272 c 0.0613,0 0.0907,0.096 0.0933,0.312 0,0.1147 0.0107,0.3067 0.0213,0.4267 0.0187,0.1867 0.0347,0.24 0.112,0.352 0.0507,0.0747 0.0987,0.136 0.112,0.136 0.0347,0 0.0213,-0.1813 -0.024,-0.312 C 4.4676,0.8726 4.4143,0.7632 4.3716,0.6992 4.2836,0.5685 4.2809,0.5605 4.3316,0.5605 c 0.0427,0 0.1627,0.1493 0.2187,0.272 0.0373,0.088 0.0373,0.088 0.032,-0.08 C 4.577,0.6352 4.585,0.5872 4.609,0.5872 c 0.016,0 0.032,0.0293 0.032,0.0667 0,0.048 0.0107,0.0613 0.04,0.0507 0.0293,-0.0107 0.0533,0.0133 0.0827,0.0853 0.1627,0.4133 0.2027,0.4827 0.288,0.5227 0.1547,0.0747 0.4987,0.3733 0.6667,0.576 0.2587,0.3173 0.3653,0.432 0.408,0.432 0.0533,0 -0.0267,-0.1067 -0.2667,-0.3627 C 5.529,1.6059 5.585,1.6139 5.9877,1.9739 6.297,2.2486 6.4624,2.3632 6.201,2.1232 6.113,2.0432 6.0543,1.9765 6.0703,1.9739 c 0.0133,0 0.0453,0.016 0.064,0.032 C 6.1556,2.0246 6.1316,1.9952 6.081,1.9392 5.961,1.8059 5.5663,1.5285 5.465,1.5072 5.4197,1.4965 5.3877,1.4725 5.3877,1.4485 5.3877,1.4165 5.409,1.4112 5.4837,1.4218 5.537,1.4298 5.577,1.4351 5.5717,1.4298 5.5664,1.4245 5.4304,1.3391 5.2677,1.2405 5.1077,1.1418 4.9664,1.0458 4.9557,1.0298 4.929,0.9898 4.977,0.9765 5.0197,1.0138 5.0384,1.0298 5.145,1.0965 5.2544,1.1631 l 0.2,0.1227 -0.104,-0.1093 C 5.2917,1.1152 5.2224,1.0618 5.1957,1.0512 5.1424,1.0352 5.129,0.9605 5.1797,0.9605 5.1957,0.9605 5.161,0.9258 5.1024,0.8832 5.0384,0.8352 4.9797,0.7632 4.9504,0.6965 4.8704,0.4912 4.9157,0.4725 5.0331,0.6618 c 0.0453,0.072 0.12,0.1573 0.1707,0.192 l 0.0907,0.064 -0.064,-0.072 C 5.1932,0.8058 5.1718,0.7658 5.1825,0.7578 5.2012,0.7365 5.1932,0.7311 5.4732,0.9551 5.6972,1.1338 5.7079,1.1204 5.5585,0.8644 5.5185,0.7977 5.4945,0.7364 5.5052,0.7284 5.5292,0.7017 5.6519,0.8271 5.7265,0.9551 5.7638,1.0164 5.7958,1.0671 5.8012,1.0671 5.8039,1.0671 5.7959,1.0111 5.7825,0.9444 5.7558,0.8191 5.7638,0.7817 5.8118,0.8137 c 0.0453,0.0267 0.1147,0.2933 0.096,0.368 -0.0133,0.048 0.016,0.12 0.1147,0.288 0.2027,0.3413 0.5573,0.832 0.5733,0.792 C 6.6065,2.2377 6.6171,2.235 6.6331,2.2537 6.6438,2.2697 6.7158,2.3284 6.7878,2.387 L 6.9211,2.491 6.8144,2.3763 C 6.7557,2.3123 6.6304,2.187 6.5371,2.0963 6.3958,1.9603 6.1611,1.6296 6.1611,1.5656 c 0,-0.056 0.064,0 0.1627,0.1467 0.1387,0.2027 0.2533,0.3307 0.4533,0.504 l 0.1547,0.1333 -0.064,-0.16 C 6.7531,1.8936 6.4758,1.4883 6.1505,1.1336 6.0092,0.9816 5.9638,0.8803 6.0358,0.8803 c 0.016,0 0.0907,0.072 0.1627,0.16 0.0747,0.088 0.136,0.16 0.1413,0.16 0.0213,0 -0.128,-0.2667 -0.1893,-0.3413 -0.08,-0.0907 -0.0853,-0.112 -0.032,-0.112 0.0667,0 0.2,0.184 0.3467,0.4747 0.08,0.1573 0.1813,0.352 0.2267,0.432 L 6.7719,1.8004 6.7586,1.6937 C 6.7266,1.475 6.6599,1.2857 6.5319,1.0644 6.4599,0.9364 6.4012,0.8271 6.4012,0.8164 c 0,-0.056 0.064,0.0107 0.2,0.2107 0.0853,0.1253 0.16,0.2267 0.1627,0.2267 0.0187,0 -0.072,-0.2213 -0.1733,-0.4213 -0.0587,-0.12 -0.1093,-0.224 -0.1093,-0.232 0,-0.0453 0.0613,0.0027 0.1227,0.0933 0.04,0.0587 0.08,0.1013 0.0907,0.0933 0.0107,-0.008 0.0693,0.04 0.1253,0.1013 0.1013,0.1093 0.1093,0.112 0.1387,0.064 C 6.98,0.9204 6.9854,0.8537 6.9747,0.7604 6.956,0.6137 6.988,0.5471 7.0387,0.6324 7.0627,0.6751 7.0654,0.6751 7.068,0.6217 c 0,-0.0667 0.0373,-0.08 0.0693,-0.0293 0.0107,0.016 0.016,0.1573 0.0133,0.312 -0.0053,0.2693 -0.0027,0.2907 0.08,0.4507 0.0907,0.184 0.1227,0.2 0.08,0.04 C 7.2733,1.2618 7.2733,1.1124 7.3106,1.1338 7.3239,1.1445 7.3186,1.1071 7.2946,1.0485 7.2573,0.9632 7.2573,0.9312 7.2839,0.8458 7.3026,0.7898 7.3292,0.7498 7.3452,0.7551 c 0.016,0.0053 0.064,0.0693 0.104,0.1413 0.0667,0.1173 0.0853,0.104 0.032,-0.0213 -0.0133,-0.0347 -0.0053,-0.048 0.0213,-0.048 0.024,0 0.0507,0.0267 0.0587,0.056 0.016,0.0427 0.024,0.048 0.04,0.0213 0.0267,-0.0373 0.1013,0.0347 0.1733,0.1707 0.0507,0.0907 0.0747,0.0933 0.04,0.0053 C 7.7585,0.9337 7.6785,0.8057 7.5612,0.6831 7.4945,0.6111 7.4439,0.5471 7.4519,0.5391 c 0.008,-0.0053 0.0747,0.04 0.152,0.104 0.0747,0.0613 0.1627,0.1173 0.192,0.1173 0.0533,0.0053 0.12,0.0693 0.2107,0.2 0.0427,0.064 0.0427,0.0587 0.008,-0.0933 C 7.9933,0.7791 7.9639,0.6644 7.9479,0.6138 7.9132,0.4965 7.9132,0.4805 7.9506,0.4805 c 0.0533,0 0.1253,0.2293 0.248,0.7733 0.0933,0.4187 0.1467,0.592 0.224,0.744 C 8.5159,2.1871 8.5213,2.1925 8.5293,2.1125 8.54,2.0192 8.4546,1.5712 8.3746,1.2885 8.3133,1.0752 8.3133,1.0938 8.3479,1.0938 c 0.048,0 0.1813,0.3147 0.2187,0.5147 l 0.0347,0.192 0.008,-0.1707 c 0.008,-0.152 -0.024,-0.4427 -0.0667,-0.608 -0.024,-0.0987 0.064,-0.0747 0.096,0.0267 0.048,0.1467 0.0773,0.5307 0.0533,0.6987 -0.064,0.448 -0.0613,0.5493 0.016,0.76 0.04,0.1093 0.1227,0.344 0.184,0.52 l 0.1093,0.32 0.1013,0.016 c 0.088,0.0133 0.0987,0.008 0.104,-0.04 C 9.2145,3.2059 9.1958,3.1659 9.0225,2.8725 8.9238,2.7098 8.8225,2.5152 8.7985,2.4405 8.7398,2.2698 8.7052,1.9472 8.7425,1.9472 c 0.0347,0 0.072,0.1173 0.1093,0.3307 0.016,0.088 0.0373,0.1653 0.0453,0.1733 0.0107,0.008 0.0107,-0.0187 0.0027,-0.064 -0.0107,-0.0427 -0.024,-0.152 -0.032,-0.24 -0.008,-0.088 -0.0213,-0.2 -0.0293,-0.2453 -0.0107,-0.064 -0.0027,-0.088 0.024,-0.088 0.0373,0 0.104,0.32 0.1413,0.6853 0.0107,0.12 0.04,0.2053 0.112,0.3253 0.0533,0.0907 0.104,0.1627 0.1173,0.1627 0.0373,0 0.024,-0.28 -0.0187,-0.3973 C 9.1291,2.3419 9.0384,1.9392 9.0677,1.9099 9.081,1.8966 9.0997,1.8886 9.105,1.8966 9.1103,1.9019 9.153,2.0273 9.1957,2.1713 L 9.273,2.438 9.2597,2.1127 C 9.2517,1.8807 9.2544,1.7874 9.2784,1.7874 c 0.016,0 0.032,0.0027 0.0347,0.008 0.0027,0.0027 0.0133,0.4427 0.0213,0.9733 l 0.0133,0.9707 0.12,-0.3547 c 0.112,-0.3307 0.12,-0.3733 0.12,-0.6293 0,-0.152 0.008,-0.2747 0.0187,-0.2747 0.0347,0 0.0827,0.2027 0.0827,0.3493 C 9.6864,2.9607 9.6438,3.1633 9.5824,3.326 9.5664,3.3687 9.5691,3.3713 9.6144,3.334 9.7211,3.246 9.8677,3.0327 9.8677,2.9633 9.8677,2.926 9.8917,2.8726 9.921,2.846 9.9557,2.8167 9.9743,2.7687 9.9743,2.71 c 0,-0.1067 0.0213,-0.176 0.056,-0.176 0.0427,0 0.0267,0.2293 -0.032,0.4107 C 9.969,3.0434 9.9476,3.1687 9.953,3.222 l 0.008,0.0987 0.1333,-0.192 C 10.169,3.022 10.2356,2.934 10.249,2.934 c 0.0427,0 0.0107,0.0773 -0.1147,0.2747 -0.0747,0.1147 -0.1333,0.224 -0.1333,0.2453 0,0.0507 0.0453,0.0747 0.0613,0.0293 0.0267,-0.0667 0.344,-0.496 0.368,-0.496 0.0133,0 0.024,0.008 0.024,0.016 0,0.0347 -0.2827,0.5413 -0.5387,0.9653 -0.144,0.24 -0.2613,0.44 -0.2613,0.4453 0,0.024 0.3467,-0.208 0.416,-0.2747 0.0853,-0.0853 0.16,-0.24 0.1973,-0.4213 0.0293,-0.1413 0.0667,-0.2187 0.0933,-0.192 0.0267,0.0267 -0.04,0.3733 -0.096,0.5013 l -0.0533,0.12 0.088,-0.088 c 0.0507,-0.0453 0.12,-0.1333 0.1573,-0.192 0.0693,-0.1147 0.104,-0.1333 0.104,-0.0587 0,0.08 -0.096,0.208 -0.2267,0.3013 C 10.2409,4.1765 10.1875,4.2431 10.1289,4.3685 10.0782,4.4752 9.9876,4.5978 9.8809,4.7045 9.7876,4.7978 9.6916,4.9178 9.6702,4.9712 9.6489,5.0245 9.6169,5.1925 9.6009,5.3419 9.5556,5.7872 9.4702,6.3312 9.3689,6.8272 c -0.0747,0.368 -0.096,0.552 -0.1067,0.872 -0.0133,0.4 -0.0133,0.4107 0.056,0.5493 0.0693,0.144 0.2133,0.312 0.1627,0.192 C 9.4542,8.3765 9.4462,7.3632 9.4729,7.3552 9.4836,7.3499 9.5342,7.0512 9.5876,6.6859 c 0.0533,-0.3627 0.12,-0.7413 0.152,-0.84 0.0533,-0.1787 0.168,-0.4267 0.2427,-0.5253 0.08,-0.1067 0.0773,-0.0107 -0.0027,0.1653 -0.0827,0.184 -0.1467,0.4 -0.1787,0.6213 l -0.0187,0.12 0.0827,-0.1253 c 0.1227,-0.1813 0.3493,-0.376 0.3493,-0.2987 0,0.008 -0.056,0.08 -0.1253,0.1573 -0.072,0.0773 -0.152,0.1787 -0.1787,0.2293 L 9.8595,6.2805 9.9715,6.1738 c 0.104,-0.096 0.2587,-0.312 0.4267,-0.5973 0.0667,-0.1093 0.1413,-0.1627 0.1573,-0.112 0.0053,0.016 0.0267,0.0293 0.048,0.0293 0.056,0 0.048,0.016 -0.0827,0.2293 -0.0773,0.1227 -0.2053,0.272 -0.3493,0.4027 l -0.2293,0.2107 0.0267,0.1733 0.024,0.1707 0.0053,-0.152 c 0.0027,-0.1707 0.056,-0.216 0.056,-0.048 0,0.0587 0.016,0.112 0.0373,0.1253 0.0187,0.0107 0.056,0.0587 0.08,0.1013 l 0.0453,0.08 -0.0133,-0.12 c -0.008,-0.0667 -0.0213,-0.144 -0.032,-0.168 -0.0107,-0.032 -0.0027,-0.0453 0.0267,-0.0453 0.0507,0 0.0773,0.0853 0.1867,0.6533 l 0.0907,0.4533 0.0027,-0.2933 c 0.0027,-0.304 -0.0027,-0.3253 -0.1867,-0.7787 -0.04,-0.096 -0.0107,-0.1547 0.0373,-0.0747 0.0187,0.0293 0.064,0.1253 0.104,0.2133 0.0613,0.1333 0.072,0.1467 0.0747,0.0853 0,-0.0427 -0.0187,-0.1173 -0.0427,-0.168 -0.0507,-0.104 -0.032,-0.1493 0.0347,-0.0827 0.0613,0.0613 0.0613,0.064 0.0853,0.9787 0.0133,0.448 0.0373,0.9707 0.0587,1.16 l 0.0347,0.3467 0.04,-0.248 C 10.7556,8.4537 10.7556,8.451 10.6863,8.2537 10.6436,8.1284 10.6276,8.0484 10.6436,8.0377 10.6756,8.019 10.6756,8.019 10.7289,8.1204 l 0.0427,0.08 v -0.08 c 0,-0.0427 -0.0107,-0.1333 -0.0267,-0.1973 -0.0293,-0.128 -0.0187,-0.16 0.04,-0.112 0.0267,0.0213 0.0453,0.1147 0.0587,0.2747 0.0107,0.1387 0.0267,0.224 0.04,0.2053 0.0533,-0.088 0.056,0.024 0.0027,0.2613 -0.1173,0.536 -0.1253,0.6693 -0.072,1.0267 0.064,0.44 0.1147,0.5147 0.4773,0.7093 l 0.1627,0.088 -0.0907,-0.0933 c -0.0693,-0.0693 -0.12,-0.1707 -0.192,-0.3813 -0.0533,-0.16 -0.1307,-0.3787 -0.1707,-0.488 -0.0907,-0.2533 -0.144,-0.5493 -0.1227,-0.68 0.0213,-0.1387 0.0827,-0.1573 0.0667,-0.0213 -0.008,0.056 -0.0027,0.1547 0.0107,0.2213 l 0.024,0.12 0.0187,-0.1333 c 0.0267,-0.1733 0.0347,-0.2 0.072,-0.2 0.0213,0 0.024,0.0613 0.008,0.2213 -0.032,0.3093 -0.0267,0.3627 0.04,0.512 0.08,0.1813 0.1173,0.2533 0.1253,0.2453 0.0027,-0.0027 -0.0027,-0.088 -0.016,-0.192 -0.0107,-0.1013 -0.0133,-0.1947 -0.0027,-0.2053 0.008,-0.0107 0.0427,-0.0133 0.0747,-0.0053 0.056,0.016 0.0587,0.0267 0.0427,0.24 -0.016,0.232 0.016,0.368 0.128,0.5547 l 0.048,0.0773 0.0453,-0.104 c 0.0347,-0.0773 0.048,-0.1787 0.0507,-0.384 0.0027,-0.2987 0.0453,-0.5067 0.104,-0.5067 0.0293,0 0.032,0.0213 0.0133,0.1013 -0.0293,0.128 -0.0267,0.5013 0.0027,0.4053 0.0107,-0.0373 0.0213,-0.1307 0.024,-0.208 0.0027,-0.1653 0.0427,-0.176 0.096,-0.0213 0.0347,0.0987 0.0293,0.1173 -0.1067,0.464 l -0.1413,0.3653 0.0667,0.08 c 0.1067,0.128 0.336,0.2693 0.5867,0.36 0.248,0.088 0.4187,0.2107 0.392,0.28 -0.0187,0.048 -0.0533,0.048 -0.144,0 z M 10.5974,9.616 C 10.5334,9.44 10.4694,9.12 10.4401,8.8373 10.4241,8.6906 10.4108,8.664 10.3121,8.568 10.1974,8.456 10.0534,8.3973 10.0534,8.4587 c 0,0.0747 0.16,0.6373 0.24,0.8427 0.064,0.1627 0.1173,0.2533 0.2133,0.352 0.072,0.0747 0.136,0.1333 0.1413,0.1333 0.008,0 -0.016,-0.0773 -0.0507,-0.1707 z M 9.9761,8.992 C 9.9468,8.9013 9.9041,8.712 9.8774,8.568 9.8401,8.3573 9.8187,8.3013 9.7627,8.2507 9.6827,8.184 9.7067,8.1307 9.792,8.184 9.84,8.2133 9.8453,8.2133 9.8293,8.1733 9.8213,8.1493 9.8133,8.0666 9.8133,7.992 9.8106,7.8667 9.8,7.84 9.7013,7.7333 L 9.592,7.6133 9.608,7.9466 c 0.0133,0.344 0.08,0.6427 0.2,0.912 0.0507,0.1147 0.1947,0.3227 0.2107,0.3067 C 10.0214,9.16 10.0027,9.0826 9.976,8.992 Z M 9.5894,8.888 C 9.5681,8.8453 9.4507,8.712 9.3281,8.5867 9.1201,8.376 9.0561,8.2774 8.9521,8.0214 8.9281,7.9627 8.8694,7.8961 8.8081,7.8561 8.7254,7.8001 7.9601,7.4401 7.9281,7.4401 7.9148,7.4401 8.8534,8.3014 8.9068,8.3388 8.9495,8.3681 8.9521,8.3655 8.9415,8.3201 8.9335,8.2908 8.9388,8.2668 8.9548,8.2668 c 0.0533,0 0.144,0.0987 0.3067,0.3333 0.136,0.1947 0.2987,0.36 0.3573,0.36 0.0053,0 -0.008,-0.032 -0.0293,-0.072 z M 9.1414,8.664 C 9.0774,8.5493 8.9947,8.4773 8.8001,8.3653 L 8.6801,8.296 8.5894,8.352 8.4987,8.4107 8.5627,8.4374 c 0.0347,0.016 0.1893,0.096 0.344,0.1813 0.152,0.0853 0.2827,0.1547 0.288,0.1547 0.0027,0 -0.0213,-0.048 -0.0533,-0.1093 z M 10.4507,8.296 C 10.4774,8.08 10.4454,7.952 10.264,7.5467 l -0.0907,-0.2 -0.0187,0.1733 c -0.024,0.224 -0.0027,0.4 0.072,0.6053 0.0613,0.1573 0.1787,0.3867 0.192,0.3707 0.0053,-0.0053 0.0187,-0.0933 0.032,-0.2 z M 10.056,8.2347 9.9973,8.1467 l 0.0187,0.08 c 0.0107,0.0453 0.032,0.088 0.048,0.0987 0.0533,0.0347 0.0507,-0.0027 -0.008,-0.0907 z M 10.0427,7.8374 C 9.9814,7.6001 9.9787,7.5921 9.976,7.7147 9.9733,7.8267 10.0667,8.128 10.096,8.0987 10.1013,8.0934 10.0773,7.976 10.0427,7.8374 Z M 6.5067,7.9307 C 6.44,7.9094 6.352,7.896 6.3067,7.9014 6.232,7.9067 6.2374,7.9121 6.3467,7.9387 c 0.0667,0.016 0.1573,0.0293 0.2,0.0293 0.0693,0 0.064,-0.0053 -0.04,-0.0373 z M 9.1574,7.16 C 9.1814,7.0587 9.2401,6.7893 9.2907,6.5653 9.3414,6.3413 9.4214,5.896 9.4667,5.5786 9.512,5.2613 9.568,4.9493 9.5894,4.8879 9.6161,4.8132 9.6801,4.7332 9.7814,4.6452 9.8641,4.5732 9.9627,4.4612 9.9974,4.3999 L 10.0587,4.2879 9.9174,4.3706 C 9.8374,4.4159 9.7201,4.4799 9.6561,4.5146 9.5601,4.5626 9.5254,4.6026 9.4721,4.7173 9.4108,4.8506 9.4081,4.8746 9.4294,5.0906 9.4614,5.3973 9.4054,5.7839 9.2134,6.5466 9.1334,6.8693 9.0507,7.2453 9.0267,7.3813 8.9867,7.6053 8.9867,7.6426 9.024,7.7893 9.048,7.8773 9.0693,7.96 9.0693,7.968 9.072,7.9787 9.0826,7.8427 9.096,7.6667 9.1067,7.4907 9.136,7.264 9.1573,7.16 Z M 5.9681,7.8213 C 5.9414,7.816 5.8988,7.816 5.8748,7.8213 5.8481,7.8293 5.8695,7.8346 5.9201,7.8346 c 0.0507,0 0.072,-0.0053 0.048,-0.0133 z m 0.5627,-0.048 c -0.0293,-0.0267 -0.5387,-0.2 -0.592,-0.2 -0.0907,0.0027 0.1467,0.104 0.368,0.1627 0.2,0.0507 0.2427,0.0587 0.224,0.0373 z M 9.7228,7.4906 C 9.6321,7.2933 9.6321,7.2933 9.6295,7.3973 9.6268,7.472 9.6482,7.5253 9.7095,7.6053 9.7548,7.6613 9.7975,7.704 9.8055,7.6986 9.8108,7.6933 9.7735,7.5973 9.7228,7.4906 Z M 8.5335,7.4666 C 8.4668,7.4079 8.3602,7.3413 8.2962,7.3199 8.0775,7.2452 8.0909,7.2799 8.3335,7.4026 8.4668,7.4719 8.5842,7.5359 8.6002,7.5493 8.6135,7.5626 8.6295,7.5733 8.6402,7.5733 8.6482,7.5706 8.6002,7.5226 8.5335,7.4666 Z M 9.8588,7.3573 C 9.8508,7.3013 9.8215,7.2213 9.7895,7.176 9.7228,7.0827 9.7202,7.0667 9.7735,7.0667 c 0.024,0 0.056,0.0293 0.072,0.0667 0.0427,0.096 0.0613,0.0827 0.0933,-0.056 C 9.9601,6.9867 9.9575,6.9281 9.9308,6.8401 9.9121,6.7761 9.8935,6.6508 9.8881,6.5628 9.8801,6.4161 9.8774,6.4081 9.8348,6.4428 9.7681,6.5068 9.7361,6.6055 9.6935,6.8935 L 9.6562,7.1602 9.7415,7.3495 c 0.0907,0.2053 0.144,0.208 0.1173,0.008 z m 0.2,-0.0507 -0.0213,-0.2267 -0.0213,0.1547 c -0.0133,0.1067 -0.0107,0.1813 0.0133,0.2347 0.016,0.0427 0.0347,0.0747 0.04,0.0693 0.0053,-0.0027 0,-0.1093 -0.0107,-0.232 z m 0.1707,-0.192 c -0.0987,-0.296 -0.1173,-0.336 -0.12,-0.248 0,0.112 0.0533,0.2853 0.16,0.512 0.104,0.2213 0.088,0.12 -0.04,-0.264 z M 8.3068,7.0613 C 8.3175,7.0533 8.2801,6.96 8.2295,6.856 L 8.1335,6.6667 H 8.0188 c -0.4667,0 -0.7947,-0.168 -1.0213,-0.52 C 6.7175,5.7094 6.7415,5.2374 7.0562,4.92 7.2189,4.76 7.3789,4.688 7.6162,4.672 8.0909,4.6427 8.5682,4.9413 8.7789,5.4027 8.8242,5.5014 8.8402,5.584 8.8402,5.736 c 0,0.1787 -0.0107,0.2213 -0.0987,0.4 -0.0667,0.1333 -0.152,0.2507 -0.272,0.368 l -0.1733,0.1733 0.08,0.1467 c 0.0453,0.0827 0.0907,0.16 0.1013,0.1707 0.04,0.04 0.288,-0.2187 0.384,-0.4 C 9.0028,6.3227 9.0402,6.1654 9.0402,5.8374 9.0402,5.4881 8.9682,5.1761 8.7949,4.7814 8.6002,4.3441 8.4856,4.1627 8.2696,3.9441 7.9469,3.6214 7.5736,3.4668 7.1256,3.4668 c -0.2427,0 -0.5173,0.0533 -0.6667,0.1307 -0.392,0.2 -0.5227,0.88 -0.3253,1.6613 0.232,0.9067 0.7227,1.4907 1.4747,1.76 0.192,0.0667 0.248,0.0747 0.4507,0.0667 0.128,-0.0053 0.24,-0.016 0.248,-0.024 z M 8.9095,6.7946 C 9.1415,6.4426 9.2322,6.1279 9.2322,5.6799 9.2295,5.2399 9.1229,4.8586 8.8722,4.4132 8.7442,4.1865 8.6642,4.0799 8.4002,3.7865 8.2882,3.6612 8.1895,3.5385 8.1789,3.5145 8.1602,3.4612 7.8562,3.3038 7.6669,3.2505 7.5736,3.2238 7.3842,3.2132 7.0402,3.2132 c -0.5627,0 -0.64,0.0187 -0.864,0.2267 -0.1173,0.1067 -0.2827,0.3893 -0.2827,0.4773 0,0.024 0.0987,-0.0613 0.2213,-0.192 C 6.3121,3.5119 6.3521,3.4825 6.5201,3.4239 6.8294,3.3119 6.8588,3.3066 7.0668,3.3066 c 0.6213,0.0027 1.16,0.3067 1.528,0.8667 0.4027,0.6133 0.5787,1.096 0.5787,1.6027 0,0.448 -0.104,0.76 -0.3813,1.144 C 8.7175,7.024 8.6802,7.088 8.7069,7.0667 8.7336,7.0454 8.8242,6.9227 8.9096,6.7947 Z M 5.9548,6.5999 6.0401,6.5626 5.9468,6.5786 c -0.0507,0.008 -0.1413,0.032 -0.2,0.0507 L 5.6401,6.6666 5.7548,6.6533 C 5.8188,6.6453 5.9095,6.6213 5.9548,6.6 Z M 8.0161,6.5386 C 8.0748,6.5199 8.0721,6.5173 7.9761,6.3253 L 7.8774,6.128 7.8027,6.224 C 7.72,6.3333 7.6267,6.3493 7.4854,6.2773 7.1761,6.1173 7.0987,5.6133 7.3387,5.32 7.5174,5.104 7.824,5.0427 8.056,5.1787 c 0.2453,0.144 0.432,0.4107 0.4667,0.672 0.016,0.1093 0.0107,0.128 -0.064,0.2 C 8.3627,6.1467 8.3147,6.152 8.1467,6.08 8.0774,6.0507 8.0107,6.0267 7.9974,6.0267 c -0.0373,0 0.16,0.3813 0.224,0.4293 C 8.2747,6.4987 8.2827,6.4933 8.4721,6.224 8.5788,6.0693 8.6774,5.9227 8.6934,5.8933 8.8267,5.6426 8.4907,5.0693 8.1014,4.8906 7.9601,4.8266 7.8987,4.8159 7.7067,4.8133 c -0.184,0 -0.248,0.0107 -0.3333,0.0587 -0.144,0.0773 -0.2907,0.2347 -0.3573,0.3813 -0.1733,0.3813 0.08,1.0293 0.472,1.216 0.1733,0.0827 0.3893,0.1093 0.528,0.0693 z M 5.7334,6.1226 c 0,-0.024 -0.2187,-0.1493 -0.2587,-0.1467 -0.04,0.0027 -0.04,0.0053 0.0053,0.016 0.0293,0.008 0.0933,0.0427 0.1467,0.0773 0.0933,0.064 0.1067,0.072 0.1067,0.0533 z M 5.1067,5.7733 C 4.976,5.7093 4.848,5.656 4.8267,5.656 4.7654,5.6533 5.0374,5.8187 5.16,5.856 5.3653,5.92 5.344,5.888 5.1067,5.7733 Z M 5.728,5.5813 C 5.6107,5.408 5.4187,5.2053 5.2267,5.056 l -0.16,-0.1253 0.16,0.2347 c 0.2027,0.2987 0.3253,0.4267 0.464,0.4907 0.0587,0.0267 0.112,0.0507 0.1173,0.0507 0.0053,0 -0.032,-0.056 -0.08,-0.1253 z M 4.7387,5.4 C 4.5334,5.2053 4.3627,5.1147 4.096,5.056 L 3.912,5.016 4.04,5.1467 c 0.0693,0.0693 0.1867,0.16 0.264,0.2027 L 4.44,5.4214 4.3813,5.3547 c -0.0587,-0.064 -0.08,-0.128 -0.0427,-0.128 0.0107,0 0.0747,0.0533 0.1413,0.12 C 4.5812,5.4454 4.7786,5.5494 4.9066,5.568 4.9146,5.5707 4.8373,5.4933 4.7386,5.4 Z M 5.6907,5.2613 C 5.6534,5.176 5.616,5.0933 5.608,5.0773 5.5973,5.048 5.3573,4.9066 5.3227,4.9066 c -0.0107,0 0.08,0.1147 0.2027,0.2533 0.12,0.1387 0.2213,0.2533 0.2267,0.2533 0.0053,0 -0.024,-0.0693 -0.0613,-0.152 z M 5.184,4.8933 C 5.168,4.8533 4.992,4.784 4.968,4.8106 4.96,4.8186 4.976,4.8319 5.0027,4.8399 c 0.0267,0.008 0.08,0.032 0.1173,0.0533 0.0373,0.0187 0.0693,0.0373 0.072,0.0373 0.0027,0.0027 0,-0.016 -0.008,-0.0373 z M 5.6453,4.792 C 5.568,4.664 5.3813,4.48 5.2613,4.416 5.184,4.3787 5.1733,4.3787 4.9973,4.464 L 4.816,4.5493 5.0533,4.624 c 0.2453,0.0773 0.5813,0.232 0.6133,0.2827 0.0107,0.016 0.024,0.024 0.032,0.016 C 5.7066,4.9147 5.6826,4.856 5.6453,4.792 Z M 9.656,4.0827 C 9.672,3.936 9.7067,3.824 9.784,3.6614 9.8427,3.5387 9.888,3.4241 9.88,3.4054 9.8747,3.3894 9.864,3.3414 9.856,3.3041 L 9.84,3.2348 9.7147,3.3601 C 9.6427,3.4294 9.5734,3.4908 9.5547,3.4961 9.52,3.5068 9.3627,4.1334 9.3387,4.3414 9.3334,4.4054 9.336,4.5094 9.3467,4.5761 l 0.016,0.12 0.136,-0.208 C 9.6187,4.3041 9.6374,4.2561 9.656,4.0828 Z M 4.9867,4.36 C 5.024,4.3387 5.048,4.3227 5.04,4.32 5.032,4.32 4.8373,4.2533 4.6053,4.176 4.3733,4.096 4.1946,4.0427 4.2026,4.0613 4.3359,4.288 4.3973,4.336 4.6266,4.384 c 0.12,0.024 0.296,0.0107 0.36,-0.024 z M 5.504,4.2907 C 5.376,4.1547 5.2133,4.056 4.9173,3.9307 4.7626,3.8667 4.632,3.8134 4.6266,3.8134 c -0.0347,0 0.0587,0.1733 0.1173,0.216 0.0853,0.0613 0.4933,0.2107 0.584,0.2107 0.032,0 0.0587,0.0107 0.0587,0.024 0,0.0267 0.1653,0.1333 0.184,0.1173 C 5.5786,4.3761 5.5466,4.3361 5.5039,4.2907 Z M 9.2773,3.8934 C 9.2773,3.7121 9.2133,3.5094 9.144,3.4747 9.0507,3.4267 9.0053,3.432 9.0267,3.488 9.0347,3.512 9.072,3.6533 9.1094,3.8 9.2134,4.2347 9.2054,4.2187 9.2427,4.0933 9.2614,4.0346 9.2774,3.944 9.2774,3.8933 Z M 8.9706,3.7974 C 8.8853,3.3814 8.8933,3.4027 8.7786,3.3281 8.7253,3.2908 8.6133,3.1921 8.5306,3.1121 l -0.1467,-0.152 -0.056,0.1333 -0.056,0.1307 0.072,0.0773 c 0.04,0.04 0.0987,0.128 0.1307,0.1947 0.0427,0.0853 0.112,0.1627 0.248,0.2613 0.1307,0.0987 0.2027,0.176 0.2427,0.2587 0.032,0.064 0.0613,0.112 0.0667,0.1093 C 9.0347,4.1201 9.008,3.9734 8.9707,3.7974 Z M 9.9679,3.6667 C 9.9626,3.624 9.9492,3.5867 9.9332,3.5867 c -0.0293,0 -0.1573,0.3253 -0.1867,0.4667 -0.0133,0.08 0,0.064 0.1067,-0.1067 0.0853,-0.1413 0.12,-0.224 0.1147,-0.28 z M 5.6052,4.032 C 5.5039,3.8933 5.4079,3.8133 5.1359,3.656 4.8399,3.4853 4.4266,3.2533 4.4106,3.2533 c -0.0053,0 0.032,0.0933 0.08,0.2053 0.0827,0.1973 0.0933,0.208 0.192,0.2267 0.2667,0.056 0.664,0.2213 0.8773,0.3653 0.104,0.072 0.1067,0.0693 0.0453,-0.0187 z M 5.6105,3.72 C 5.5305,3.6 5.1092,3.328 4.6052,3.0747 4.4692,3.008 4.3252,2.928 4.2852,2.8987 L 4.2079,2.8454 4.2506,2.9307 c 0.0373,0.072 0.128,0.1253 0.5653,0.344 0.32,0.1573 0.5813,0.3067 0.6747,0.384 C 5.5733,3.7254 5.6426,3.784 5.6479,3.784 5.6506,3.7867 5.6346,3.7573 5.6106,3.72 Z M 3.4478,3.6293 C 3.3891,3.5813 3.0238,3.4986 2.9971,3.528 2.9864,3.5387 3.2131,3.6053 3.2931,3.6133 3.3091,3.616 3.3384,3.624 3.3598,3.632 3.4131,3.6533 3.4771,3.6747 3.4931,3.6773 3.5011,3.6773 3.4798,3.656 3.4478,3.6293 Z M 4.4131,3.568 C 4.4024,3.5333 4.3464,3.424 4.2851,3.32 4.1891,3.16 4.1491,3.1227 3.9918,3.032 3.8505,2.952 3.7971,2.9333 3.7571,2.952 3.7064,2.9733 3.7118,2.9813 3.8184,3.0587 3.9491,3.152 4.2771,3.472 4.3384,3.568 4.3624,3.6 4.3917,3.6267 4.4051,3.6267 4.4184,3.6267 4.4211,3.6 4.4131,3.568 Z M 5.7278,3.5547 C 5.6531,3.3814 5.3438,3.016 5.2878,3.032 5.2745,3.0373 5.2318,3.0507 5.1891,3.0667 L 5.1118,3.0934 5.2745,3.2001 c 0.088,0.0587 0.2293,0.176 0.3147,0.264 0.088,0.0853 0.16,0.1573 0.1627,0.16 0.0053,0 -0.008,-0.0293 -0.024,-0.0693 z M 4.1065,3.4427 C 4.1065,3.4187 3.9092,3.2454 3.7332,3.1147 3.6559,3.056 3.6185,3.0454 3.5332,3.0587 L 3.4239,3.072 3.6132,3.2533 C 3.7145,3.352 3.8185,3.44 3.8399,3.448 3.9066,3.472 4.1066,3.4693 4.1066,3.4427 Z M 5.8398,3.2987 C 5.7945,3.176 5.6211,2.9067 5.5865,2.9067 c -0.0053,0 -0.0267,0.008 -0.0507,0.016 -0.0347,0.0133 -0.0213,0.04 0.0667,0.1387 0.0587,0.0693 0.1467,0.1867 0.192,0.264 0.0453,0.0773 0.088,0.136 0.0907,0.1307 C 5.8905,3.4508 5.8692,3.3814 5.8399,3.2988 Z M 8.8238,3.176 C 8.8078,3.1307 8.7518,3.064 8.6985,3.024 8.6452,2.984 8.5598,2.9147 8.5145,2.872 8.4478,2.8107 8.4265,2.8 8.4265,2.832 c 0,0.032 0.3867,0.4213 0.4187,0.4213 0.0027,0 -0.008,-0.0347 -0.0213,-0.0773 z M 8.1598,3.0747 C 8.1598,3.0267 8.1225,2.96 8.0665,2.8934 L 7.9732,2.7867 8.0585,2.968 c 0.048,0.0987 0.0907,0.1787 0.0933,0.1787 0.0053,0 0.008,-0.032 0.008,-0.072 z M 7.8745,3.0347 C 7.8585,3.016 7.8025,2.8827 7.7465,2.7414 7.6905,2.5974 7.6398,2.4827 7.6372,2.4881 c -0.024,0.0213 0.1467,0.504 0.192,0.5387 0.064,0.048 0.0773,0.0507 0.0453,0.008 z M 5.0612,3.0187 c 0.0213,-0.016 0.0053,-0.024 -0.048,-0.024 -0.0533,0 -0.0693,0.008 -0.048,0.024 0.0187,0.0107 0.04,0.0213 0.048,0.0213 0.008,0 0.0293,-0.0107 0.048,-0.0213 z M 8.2932,2.8294 C 8.2745,2.7921 8.2772,2.7761 8.3065,2.7627 8.3358,2.752 8.3145,2.7067 8.2132,2.5734 c -0.1333,-0.176 -0.24,-0.36 -0.24,-0.4133 0,-0.0667 0.056,-0.0107 0.1867,0.1867 0.0773,0.1173 0.152,0.2213 0.1627,0.2293 0.0587,0.0347 0.0107,-0.0827 -0.152,-0.3733 -0.096,-0.1733 -0.168,-0.32 -0.16,-0.328 0.032,-0.0347 0.112,0.0747 0.3813,0.5307 0.1547,0.2613 0.2933,0.4747 0.3067,0.4747 0.016,0 -0.016,-0.0747 -0.0667,-0.1653 C 8.5812,2.6216 8.4692,2.4162 8.3839,2.2562 8.2932,2.0909 8.1946,1.9442 8.1492,1.9095 8.1065,1.8802 8.0212,1.8028 7.9599,1.7415 L 7.8452,1.6322 7.8159,1.7442 c -0.016,0.0613 -0.0373,0.184 -0.0453,0.2693 -0.016,0.136 -0.0133,0.1547 0.024,0.1387 0.0453,-0.016 0.168,0.1147 0.2827,0.304 0.08,0.136 0.1627,0.3867 0.1653,0.5013 l 0.0027,0.096 0.0373,-0.088 C 8.3093,2.9042 8.3119,2.8642 8.2933,2.8295 Z M 4.1439,2.8934 C 4.1199,2.8561 4.0746,2.8267 4.0452,2.8267 c -0.048,0 -0.0427,0.0107 0.0347,0.0667 0.0507,0.0373 0.0933,0.0667 0.0987,0.0667 0.0053,0 -0.0107,-0.0293 -0.0347,-0.0667 z m -0.464,0 c 0.0293,-0.0347 0.0187,-0.04 -0.0693,-0.04 -0.0933,0 -0.0987,0.0027 -0.048,0.04 0.064,0.048 0.0773,0.048 0.1173,0 z M 7.5252,2.8347 C 7.4985,2.7787 7.4425,2.6587 7.3999,2.568 7.3599,2.4773 7.3146,2.408 7.3012,2.416 7.2905,2.424 7.2799,2.4853 7.2799,2.5547 c 0,0.112 0.0133,0.136 0.1253,0.2507 0.0693,0.0693 0.136,0.128 0.1467,0.128 0.0133,0 0,-0.0453 -0.0267,-0.0987 z M 4.9199,2.8774 C 4.7732,2.8347 4.4532,2.7787 4.4532,2.8001 c 0,0.0107 0.0693,0.0347 0.1547,0.0533 0.0827,0.0187 0.1653,0.0373 0.1787,0.04 0.016,0.0053 0.0693,0.008 0.12,0.008 H 4.9999 Z M 5.4692,2.7494 C 5.4532,2.7227 5.4265,2.6907 5.4079,2.6747 5.3786,2.648 5.0346,2.5334 4.9919,2.5334 c -0.0107,0 0.0427,0.04 0.1147,0.0907 0.0747,0.0507 0.168,0.1227 0.2133,0.1573 0.0587,0.0507 0.0907,0.0613 0.128,0.0427 0.0347,-0.0213 0.04,-0.0373 0.0213,-0.0747 z m -0.52,0.016 C 4.9199,2.7467 4.8212,2.6827 4.7252,2.6187 4.6132,2.544 4.5092,2.496 4.4239,2.4827 L 4.2959,2.4614 4.3306,2.5281 c 0.0293,0.0533 0.0907,0.0853 0.3227,0.1547 0.1573,0.048 0.2933,0.0933 0.3013,0.1013 0.008,0.0107 0.0213,0.016 0.0293,0.0133 0.008,0 -0.008,-0.016 -0.0347,-0.032 z m 3.128,-0.08 C 8.0559,2.6027 7.8025,2.1867 7.7732,2.1867 c -0.0107,0 0.0347,0.1947 0.0667,0.28 0.0293,0.0747 0.24,0.344 0.256,0.3253 C 8.1012,2.7867 8.0932,2.7387 8.0772,2.6853 Z m -1.72,-0.056 C 6.2799,2.4934 6.2585,2.4721 6.1385,2.4321 6.0612,2.4054 6.0558,2.4081 6.0772,2.4481 c 0.0133,0.024 0.0667,0.0853 0.1173,0.136 0.0773,0.0747 0.12,0.104 0.224,0.16 C 6.4212,2.7468 6.3945,2.6934 6.3572,2.6294 Z M 7.5519,2.5707 C 7.5226,2.4987 7.4906,2.4187 7.4799,2.3947 7.4506,2.3227 7.5332,2.3334 7.5839,2.4054 7.6479,2.4961 7.6372,2.4587 7.5226,2.1974 7.3973,1.9094 7.1413,1.4187 7.0266,1.2481 L 6.9413,1.1201 6.9066,1.1948 c -0.0187,0.04 -0.04,0.1893 -0.0453,0.3387 -0.008,0.2373 0,0.2933 0.0667,0.4933 0.0427,0.1253 0.0907,0.224 0.1067,0.2213 C 7.0534,2.2428 7.0827,2.2828 7.104,2.3334 7.1253,2.3841 7.152,2.4267 7.1627,2.4267 7.1974,2.4267 7.1414,2.168 7.064,1.9894 6.96,1.7387 6.992,1.7201 7.1413,1.9361 7.1706,1.9814 7.1733,1.9788 7.16,1.9068 7.152,1.8641 7.12,1.7948 7.0907,1.7521 7.0374,1.6774 7.0427,1.6268 7.1067,1.6268 c 0.0533,0 0.1413,0.2053 0.1733,0.4107 0.016,0.1013 0.0507,0.2107 0.0747,0.2427 0.024,0.032 0.088,0.1493 0.1387,0.264 0.0987,0.2213 0.1413,0.24 0.0587,0.0267 z M 7.1332,2.568 C 7.1092,2.528 7.0985,2.5173 7.1065,2.5467 7.1172,2.576 7.1332,2.624 7.1412,2.6534 7.1492,2.6827 7.1599,2.6907 7.1652,2.6747 7.1732,2.656 7.1572,2.6107 7.1332,2.568 Z M 6.7465,2.6587 c 0,-0.0053 -0.04,-0.0427 -0.0853,-0.088 l -0.088,-0.0773 0.0773,0.088 c 0.0747,0.08 0.096,0.0987 0.096,0.0773 z M 6.9865,2.656 C 6.9865,2.6533 6.8985,2.5707 6.7945,2.4773 6.6878,2.384 6.6292,2.344 6.6665,2.3866 6.7012,2.4319 6.7865,2.5119 6.8532,2.5653 6.9785,2.6666 6.9865,2.672 6.9865,2.656 Z M 5.8505,2.4213 C 5.7972,2.344 5.7278,2.256 5.6985,2.2266 c -0.056,-0.056 -0.008,0.0187 0.152,0.2347 0.1147,0.1493 0.1147,0.1173 0,-0.04 z M 5.5545,2.3546 C 5.5278,2.3119 5.4398,2.1839 5.3598,2.0666 5.0425,1.6053 4.8638,1.3093 4.7705,1.0853 4.6772,0.8586 4.6718,0.8506 4.6585,0.9386 4.6158,1.1759 4.6105,1.3279 4.6372,1.3439 c 0.016,0.0107 0.0293,0 0.0293,-0.0213 0,-0.0667 0.0507,-0.0507 0.08,0.0213 0.0133,0.0373 0.0613,0.0933 0.104,0.1253 0.08,0.0587 0.2853,0.3147 0.3147,0.3893 0.008,0.0187 0,0.0347 -0.016,0.0347 -0.016,0 -0.0293,0.0293 -0.0293,0.064 0,0.0427 0.04,0.096 0.128,0.1653 0.0693,0.056 0.1733,0.1467 0.232,0.2027 0.0587,0.056 0.1093,0.1013 0.1147,0.1013 0.0027,0 -0.0133,-0.032 -0.04,-0.072 z M 4.3012,2.2986 C 4.2452,2.2399 4.1599,2.1759 4.1119,2.1519 L 4.0239,2.1092 4.1172,2.2345 c 0.0667,0.0933 0.1147,0.1307 0.1813,0.1413 0.048,0.0107 0.0907,0.0187 0.096,0.0213 0.0053,0 -0.0373,-0.0427 -0.0933,-0.0987 z M 4.9065,2.3173 C 4.8185,2.1973 4.6718,2.112 4.3812,2.0133 4.2372,1.9653 4.0959,1.9173 4.0665,1.9066 3.9838,1.8746 4.3438,2.1306 4.4932,2.2053 4.5972,2.2586 4.9172,2.392 4.9545,2.4 4.9598,2.4 4.9385,2.3627 4.9065,2.3173 Z M 5.7065,2 C 5.6612,1.9413 5.6078,1.8853 5.5918,1.8747 5.5625,1.8587 5.6025,1.9147 5.7171,2.048 5.8051,2.1467 5.7971,2.1147 5.7064,2 Z m -2.96,0.04 c 0,-0.0053 -0.072,-0.0613 -0.16,-0.12 -0.2027,-0.1387 -0.2107,-0.1173 -0.008,0.024 0.152,0.1093 0.168,0.12 0.168,0.096 z M 5.4532,1.864 C 5.3439,1.7147 5.1999,1.5733 5.1999,1.6133 c 0,0.056 0.3067,0.4 0.3653,0.4107 C 5.5705,2.0267 5.5199,1.9547 5.4532,1.864 Z M 4.9865,1.8267 C 4.9732,1.7894 4.9412,1.7307 4.9172,1.696 4.8665,1.616 4.6212,1.4107 4.6585,1.4773 4.6825,1.5226 4.9918,1.8906 5.0052,1.8933 5.0079,1.8933 4.9999,1.864 4.9865,1.8266 Z M 7.6985,1.368 C 7.6558,1.2907 7.6185,1.2267 7.6158,1.2267 c -0.0053,0 0.008,0.0693 0.0267,0.1547 0.0213,0.0827 0.0373,0.224 0.04,0.312 L 7.6852,1.8534 7.7305,1.6801 7.7758,1.5094 7.6985,1.3681 Z M 7.5838,1.7147 C 7.5731,1.6587 7.5118,1.512 7.4478,1.3867 c -0.128,-0.248 -0.128,-0.2373 0.008,0.12 0.0507,0.1333 0.0987,0.256 0.104,0.2747 0.0267,0.0693 0.0427,0.0267 0.024,-0.0667 z m 0.44,-0.08 C 7.9518,1.512 7.8931,1.4454 7.8931,1.4827 c 0,0.0347 0.152,0.2507 0.176,0.2507 0.008,0 -0.0107,-0.0453 -0.0453,-0.0987 z M 5.9731,1.6667 C 5.9544,1.6427 5.9011,1.6 5.8558,1.5707 5.7918,1.528 5.7971,1.5387 5.8798,1.6107 5.9945,1.712 6.0265,1.7334 5.9731,1.6667 Z M 4.5224,1.48 C 4.4984,1.4427 4.4611,1.384 4.4371,1.3493 4.4158,1.3146 4.3304,1.2506 4.2504,1.208 4.1731,1.168 4.1064,1.1253 4.1064,1.1147 4.1064,1.08 4.2264,1.0907 4.2637,1.128 4.2904,1.1547 4.293,1.152 4.2797,1.12 4.2584,1.0667 4.0744,0.9227 3.8984,0.8213 L 3.7597,0.7413 3.885,0.96 c 0.1333,0.2267 0.2613,0.3573 0.5013,0.5013 0.1653,0.1013 0.192,0.104 0.136,0.0187 z M 5.2051,1.52 C 5.1944,1.512 5.1518,1.4773 5.1118,1.44 l -0.0773,-0.0667 0.048,0.08 c 0.024,0.0453 0.0667,0.0827 0.0933,0.0827 0.0267,0 0.04,-0.008 0.0293,-0.016 z M 8.1038,1.4107 C 8.0105,1.1654 7.9011,0.9414 7.8638,0.9174 7.8345,0.9014 7.8318,0.9041 7.8585,0.9361 c 0.016,0.0213 0.0427,0.0907 0.0613,0.1573 0.0267,0.1067 0.2,0.4533 0.2267,0.4533 0.0027,0 -0.016,-0.0613 -0.0427,-0.136 z M 5.7305,1.3067 C 5.6532,1.216 5.5518,1.1387 5.4185,1.0667 l -0.2,-0.104 0.1547,0.1387 c 0.1387,0.1253 0.4267,0.3387 0.4587,0.3387 0.0053,0 -0.04,-0.0613 -0.1013,-0.1333 z M 7.4772,1.1894 C 7.4399,1.0907 7.4025,1.0161 7.3972,1.0214 7.3919,1.0267 7.4185,1.1094 7.4585,1.2081 7.4958,1.3068 7.5332,1.3814 7.5385,1.3761 7.5438,1.3708 7.5172,1.2854 7.4772,1.1894 Z m -0.6,-0.1093 c 0,-0.0133 -0.0347,-0.0667 -0.0773,-0.1173 l -0.0747,-0.088 0.056,0.1467 c 0.0347,0.0853 0.0667,0.1333 0.0773,0.1147 0.0107,-0.016 0.0213,-0.04 0.0187,-0.056 z"
         id="path10" />
      <path
         d="M 10.9227,8.2 C 10.9067,8.152 10.9547,8 10.9894,8 c 0.0267,0 0.032,0.0907 0.008,0.1813 C 10.9787,8.248 10.9467,8.2586 10.9227,8.2 Z"
         id="path12" />
      <path
         d="m 10.1067,5.4693 c 0,-0.0293 0.024,-0.0587 0.0507,-0.0693 0.0267,-0.008 0.0907,-0.0747 0.1413,-0.1467 0.0987,-0.1467 0.1067,-0.152 0.1547,-0.0933 0.0293,0.0347 0.016,0.0667 -0.0853,0.1947 -0.0827,0.1067 -0.1387,0.1547 -0.1893,0.16 -0.056,0.008 -0.072,-0.0027 -0.072,-0.0453 z"
         id="path14" />
    </g>
  </g>
</svg>
