Michael	1.38215%
Thomas	1.224208%
Christian	1.048511%
Andreas	1.044622%
Daniel	0.918425%
Stefan	0.876114%
Markus	0.754741%
Sandra	0.735253%
Martin	0.725907%
Peter	0.721109%
Nicole	0.658538%
Patrick	0.602906%
Sebastian	0.577025%
Alexander	0.555675%
Claudia	0.542371%
Sabine	0.54225%
Andrea	0.540561%
Julia	0.521081%
Melanie	0.512749%
Matthias	0.478761%
Tobias	0.478086%
Petra	0.461542%
Florian	0.450421%
Nadine	0.443327%
Daniela	0.439776%
Marcel	0.439698%
Sarah	0.438347%
Sabrina	0.438191%
Tanja	0.42726%
Lisa	0.424004%
Marco	0.417023%
Stefanie	0.40455%
Anna	0.399613%
Anja	0.398678%
Kevin	0.382394%
David	0.375881%
Susanne	0.375006%
Dennis	0.373672%
Sascha	0.362932%
Christoph	0.349983%
Martina	0.347818%
Monika	0.347532%
Mario	0.345843%
Robert	0.344544%
Maria	0.344085%
Oliver	0.334107%
Alex	0.332253%
Kerstin	0.330209%
Manuela	0.321955%
Katharina	0.316368%
Klaus	0.315727%
Philipp	0.311301%
Jürgen	0.309369%
Karin	0.296646%
Christina	0.295451%
Heike	0.285065%
Manuel	0.283299%
Michaela	0.280076%
Bernd	0.270367%
Stephan	0.268946%
Sonja	0.268271%
Christine	0.267725%
Jan	0.265291%
Alexandra	0.264495%
Dominik	0.264373%
Katrin	0.26394%
Simone	0.262901%
Birgit	0.262858%
Uwe	0.260701%
Dirk	0.2598%
Ralf	0.259003%
Marc	0.250359%
Max	0.249805%
Tim	0.247371%
Katja	0.244928%
Jens	0.243828%
Nina	0.243716%
Laura	0.243577%
Chris	0.243283%
Jasmin	0.240901%
Benjamin	0.239818%
Jörg	0.236942%
Marion	0.231304%
Vanessa	0.227926%
Tina	0.227623%
Steffen	0.226601%
Lukas	0.225778%
Barbara	0.225639%
Simon	0.222729%
Andre	0.218329%
Manfred	0.218121%
Rene	0.217783%
Johannes	0.214786%
Kathrin	0.214449%
Mike	0.21295%
Jana	0.211582%
Bianca	0.210161%
Fabian	0.208663%
Steffi	0.207771%
Stephanie	0.204107%
Lena	0.203743%
Felix	0.203249%
Silke	0.201205%
Silvia	0.200668%
Anne	0.199023%
Hans	0.197706%
Kai	0.196545%
Nico	0.193185%
Paul	0.187538%
Lars	0.185883%
Bettina	0.185416%
Jessica	0.184177%
Thorsten	0.182826%
Maik	0.182401%
Diana	0.18092%
Timo	0.178703%
Werner	0.178686%
Roland	0.178547%
Angelika	0.178417%
Marina	0.177421%
Jenny	0.174199%
Pascal	0.173593%
Elke	0.1718%
Torsten	0.170596%
Heiko	0.165512%
Rainer	0.165044%
Ramona	0.16397%
Dieter	0.16261%
Verena	0.160817%
Marcus	0.160358%
Tom	0.160115%
Mandy	0.156097%
Gerhard	0.154148%
Jennifer	0.150865%
Julian	0.14967%
Elisabeth	0.149436%
Carsten	0.149427%
Harald	0.14876%
Ulrike	0.146993%
Doris	0.144637%
Carmen	0.144594%
Renate	0.143182%
Mathias	0.14203%
Angela	0.141753%
Gabriele	0.140593%
Christopher	0.138522%
Ute	0.136972%
Helmut	0.136582%
Anita	0.135101%
Denise	0.134486%
Andy	0.13349%
Christiane	0.132624%
Ronny	0.132174%
Georg	0.131307%
Carina	0.130675%
Bernhard	0.130242%
Björn	0.130052%
Norbert	0.12767%
Walter	0.12741%
Heidi	0.125409%
Anke	0.124915%
Beate	0.124075%
Ali	0.123963%
Cornelia	0.122698%
Regina	0.121893%
Josef	0.121148%
Linda	0.119363%
Miriam	0.11654%
Roman	0.115249%
Karl	0.11447%
Heinz	0.114166%
Ines	0.114149%
Gabi	0.114071%
Ingo	0.113465%
Ingrid	0.1113%
Kristina	0.110078%
Tamara	0.109533%
Iris	0.109498%
Ursula	0.107852%
Nils	0.107012%
Nadja	0.106267%
Natalie	0.106094%
Marie	0.105981%
Herbert	0.105124%
Maximilian	0.105063%
Carolin	0.104604%
Patricia	0.10431%
Elena	0.10224%
Annika	0.10185%
Robin	0.101235%
Tatjana	0.100057%
Jutta	0.099667%
Astrid	0.099511%
Marvin	0.099312%
Antje	0.098359%
Rolf	0.098013%
Saskia	0.096463%
Corinna	0.096411%
Steven	0.096333%
Karsten	0.096125%
Natascha	0.095518%
Toni	0.093691%
Mark	0.092175%
Adrian	0.092002%
Olaf	0.091777%
Günter	0.091448%
Ina	0.091439%
Michelle	0.090694%
Annette	0.090296%
Denis	0.090114%
Rebecca	0.089923%
Janina	0.089386%
Richard	0.08897%
Helga	0.08897%
Jochen	0.088892%
Olga	0.087576%
Conny	0.087134%
Enrico	0.086692%
Hannes	0.085922%
Udo	0.085289%
Sara	0.085159%
Gerd	0.084908%
Christin	0.084692%
Judith	0.083773%
Alina	0.082855%
Erika	0.082639%
Dagmar	0.081478%
Sina	0.080837%
Ulrich	0.079503%
Rita	0.079313%
Marius	0.077373%
Doreen	0.077052%
Armin	0.076827%
Kurt	0.075944%
Reinhard	0.075866%
Marko	0.07577%
Pia	0.075753%
Johanna	0.075519%
Susi	0.075389%
Irina	0.074584%
Kim	0.074185%
Eric	0.073631%
Sophie	0.072808%
Steve	0.072791%
Veronika	0.072721%
Danny	0.071933%
Anton	0.07189%
Mirko	0.07144%
Andi	0.071414%
Lara	0.071275%
Kristin	0.071007%
Marianne	0.070677%
Moritz	0.07066%
Christa	0.069958%
Lea	0.069794%
Niklas	0.069768%
Guido	0.06943%
Nancy	0.068772%
Gaby	0.068616%
Mehmet	0.068521%
Caroline	0.067724%
Detlef	0.067551%
Tobi	0.067187%
Ilona	0.067083%
Murat	0.066485%
Cindy	0.066485%
Juliane	0.066442%
Sandy	0.065576%
Jacqueline	0.065541%
Theresa	0.065532%
Bastian	0.064017%
Alfred	0.063904%
Mustafa	0.063047%
Anika	0.063038%
Ben	0.062917%
Viktor	0.062657%
Nathalie	0.062588%
Hermann	0.06225%
Dietmar	0.062077%
Melissa	0.061765%
Raphael	0.061643%
Gisela	0.061531%
Irene	0.060977%
Erik	0.060656%
Achim	0.060457%
Carola	0.060396%
Leon	0.060301%
Vera	0.06024%
Isabella	0.060154%
Selina	0.060006%
Sandro	0.059513%
Karina	0.059452%
Philip	0.059123%
Willi	0.058924%
Hendrik	0.058716%
Larissa	0.058473%
Maike	0.0583%
Luca	0.058214%
Kirsten	0.057945%
Dani	0.057945%
Gerald	0.057625%
Inge	0.057347%
Dominic	0.056317%
Lutz	0.055892%
Erich	0.055866%
Susann	0.055043%
Hanna	0.054255%
Frank	0.05403%
Michi	0.054021%
Jakob	0.053935%
Isabell	0.053701%
Isabel	0.053684%
Siegfried	0.053389%
Lydia	0.053337%
Maren	0.053311%
Tino	0.053303%
Benny	0.052921%
Erwin	0.052731%
Mareike	0.052714%
Kathi	0.052341%
Gudrun	0.052038%
Reiner	0.051977%
Harry	0.051891%
Sven	0.051821%
Günther	0.051787%
Viktoria	0.051622%
Rico	0.051475%
Mona	0.051042%
Flo	0.050999%
Magdalena	0.050695%
Ralph	0.05034%
Caro	0.050167%
Michel	0.049847%
Lothar	0.049673%
Bärbel	0.049379%
Gregor	0.049318%
Roger	0.04931%
Peggy	0.049301%
Kay	0.048998%
Ahmet	0.048928%
Roswitha	0.048816%
Margit	0.048738%
Lucas	0.04853%
Sigrid	0.048426%
Waldemar	0.0484%
Leo	0.048305%
Pierre	0.04827%
Deniz	0.04801%
Nick	0.047638%
Meike	0.046858%
Hasan	0.046832%
Annett	0.046798%
Antonio	0.046486%
Luisa	0.046096%
Dana	0.046036%
Sophia	0.045992%
Hannah	0.045819%
Sergej	0.045732%
Hakan	0.045377%
Albert	0.045187%
Micha	0.044702%
Norman	0.044554%
Angelina	0.044312%
Ernst	0.044217%
Monique	0.044147%
Lina	0.043567%
Rudi	0.043541%
Benedikt	0.043515%
Gabriela	0.043402%
Uschi	0.043307%
Edith	0.043013%
Gina	0.042086%
Artur	0.041956%
Manu	0.041558%
Susan	0.040925%
Hartmut	0.040882%
Rüdiger	0.040804%
John	0.040648%
Eduard	0.040492%
Silvio	0.040302%
Natalia	0.040051%
Kathleen	0.039886%
Isabelle	0.039886%
Basti	0.039565%
Heinrich	0.039392%
Helena	0.039392%
Malte	0.039366%
Ellen	0.039349%
Maxi	0.03928%
Ronald	0.03908%
Henning	0.039011%
Leonie	0.038708%
Beatrice	0.038708%
Uli	0.038517%
Juergen	0.038336%
Nora	0.03818%
Boris	0.038102%
Kati	0.038041%
Henry	0.037989%
Tony	0.03798%
Chantal	0.037669%
Maja	0.037547%
Valentina	0.037374%
Emre	0.037253%
Marlene	0.037192%
Tommy	0.037045%
Anni	0.036993%
Maurice	0.036906%
Ibrahim	0.03682%
Antonia	0.036733%
Madeleine	0.036569%
Claus	0.036456%
Hannelore	0.035928%
Mia	0.035443%
Wilfried	0.035295%
Samuel	0.035287%
Niko	0.035278%
Mary	0.035252%
Elisa	0.0352%
Victoria	0.035096%
Wolfgang	0.034706%
Elvira	0.034576%
Arne	0.034516%
Alice	0.034473%
Clemens	0.034447%
Torben	0.034135%
Fabio	0.033979%
Rosi	0.033728%
Marlies	0.033624%
Giuseppe	0.03358%
Patrik	0.033494%
Dominique	0.033476%
Otto	0.033373%
Fabienne	0.033338%
Roberto	0.033199%
Serkan	0.033199%
Matze	0.03313%
Nicolas	0.032922%
Inga	0.03268%
Annemarie	0.032498%
Waltraud	0.03235%
Phil	0.03229%
Nicola	0.031571%
Don	0.031571%
Anastasia	0.031406%
Konstantin	0.031389%
Lilly	0.031276%
Paula	0.031276%
Ludwig	0.031259%
Joerg	0.031242%
Reinhold	0.031103%
Agnes	0.030965%
Christel	0.030887%
Jeannette	0.030835%
Romy	0.030809%
Fatih	0.030774%
Angelo	0.030558%
Jaqueline	0.030523%
Aylin	0.030488%
Ricardo	0.03048%
Can	0.030376%
Sam	0.030367%
Teresa	0.03022%
Mirjam	0.03009%
Mirco	0.029865%
Denny	0.029726%
Adam	0.029717%
Corina	0.029648%
Urs	0.029622%
Viola	0.029562%
Moni	0.029536%
Eileen	0.029527%
Gabriel	0.029527%
Yannick	0.029241%
Gerlinde	0.029198%
Rafael	0.029076%
Silvana	0.029024%
Marita	0.028791%
Bianka	0.02873%
Rudolf	0.028713%
Igor	0.028384%
Ana	0.028323%
Melina	0.028288%
Wilhelm	0.028236%
Hüseyin	0.028098%
Justin	0.027942%
Jessi	0.027907%
Rosemarie	0.027899%
Phillip	0.027829%
Ela	0.027795%
Rosa	0.027656%
Arthur	0.027595%
Charlotte	0.027379%
Wiebke	0.027362%
Michele	0.027327%
Anette	0.027249%
Ulli	0.027197%
Andrej	0.02718%
Jannik	0.026747%
Yasemin	0.026729%
Sibylle	0.026721%
Yasmin	0.026686%
Beatrix	0.026417%
Madlen	0.026348%
Isa	0.026348%
Mohamed	0.026305%
Arno	0.026279%
Konrad	0.026218%
Leyla	0.026166%
Patrizia	0.026054%
Christof	0.025984%
Benni	0.025967%
Emma	0.025915%
Uta	0.025577%
Kira	0.025525%
Claudio	0.025205%
Dave	0.02517%
Jörn	0.025153%
Gerda	0.024971%
Samira	0.024902%
Henrik	0.024876%
Bea	0.024763%
Ilka	0.024529%
Reto	0.024399%
Fatma	0.024269%
Beat	0.023975%
Helene	0.02394%
Liane	0.023828%
Falk	0.023819%
Ulla	0.023802%
Romina	0.02375%
Valentin	0.023646%
Theo	0.02355%
Cem	0.023507%
Samantha	0.023386%
Alois	0.023334%
Bella	0.023317%
Vincent	0.023169%
Aline	0.023126%
Elli	0.023126%
Nadia	0.023057%
Sinan	0.023022%
Hildegard	0.022927%
Dario	0.02284%
Sabina	0.022823%
Angie	0.022624%
Mara	0.022615%
Lucia	0.022598%
Ahmed	0.022537%
Milena	0.022528%
Franziska	0.022485%
Osman	0.022407%
Salvatore	0.022338%
Ebru	0.022286%
Alessandro	0.022234%
Ricarda	0.022208%
Mira	0.022191%
Giovanni	0.022147%
Samir	0.02213%
El	0.022113%
Svetlana	0.022104%
Dorothea	0.021983%
Erkan	0.021974%
Rebekka	0.021836%
Ariane	0.021818%
Lilli	0.02181%
Derya	0.021723%
Karen	0.021697%
Irmgard	0.021645%
Joe	0.021584%
Ronja	0.021489%
Luise	0.021411%
Axel	0.021264%
Ulf	0.021255%
Jo	0.021221%
Carlos	0.02116%
Esra	0.02116%
Olivia	0.021091%
Elias	0.020891%
Aaron	0.020761%
Sindy	0.020761%
Edgar	0.020744%
Anett	0.020614%
Till	0.02058%
Emanuel	0.02058%
Gerrit	0.02058%
Olli	0.020545%
Gökhan	0.020493%
Yasin	0.020302%
Jason	0.020207%
Roy	0.020198%
Kornelia	0.020138%
Vicky	0.020103%
Ömer	0.020086%
Susanna	0.020086%
Carlo	0.019965%
Grit	0.019947%
Metin	0.019947%
Damian	0.019904%
Klaudia	0.019861%
Hassan	0.019835%
Adriana	0.019774%
Kenan	0.019739%
Marian	0.019731%
Tine	0.019705%
Thilo	0.019696%
Pamela	0.019687%
Sepp	0.019687%
Nino	0.019687%
Alena	0.019661%
Romana	0.019618%
Gernot	0.019584%
Dragan	0.01954%
Selma	0.019532%
Orhan	0.019497%
Sunny	0.019358%
Bodo	0.019341%
Sibel	0.019272%
Bernadette	0.019272%
Heidrun	0.019263%
Sami	0.019263%
Lorenz	0.019254%
Celina	0.019254%
Adnan	0.019211%
Ella	0.019185%
Özlem	0.019168%
Janet	0.019029%
Elfriede	0.018943%
Jonathan	0.018821%
Karola	0.018804%
Luis	0.018795%
Lucy	0.018761%
Ole	0.018761%
Ilse	0.018743%
Amir	0.018735%
Simona	0.018709%
Constanze	0.018605%
Corinne	0.018579%
Remo	0.018466%
Kadir	0.018406%
Amelie	0.018388%
Helge	0.018371%
Katarina	0.018328%
Desiree	0.018258%
Arnold	0.018189%
Oli	0.018154%
Mar	0.018128%
Sofia	0.018085%
Melli	0.018059%
Tabea	0.017998%
Janine	0.017998%
Eike	0.017938%
Swen	0.017929%
Enes	0.017912%
Swetlana	0.017903%
Carla	0.01786%
Ferdinand	0.017851%
Marek	0.017843%
Eva	0.017825%
Josephine	0.017791%
Onur	0.017791%
Maya	0.017773%
Jack	0.017756%
Ramon	0.017747%
Mert	0.017739%
Goran	0.017687%
Hansi	0.017687%
Margot	0.017678%
Heiner	0.0176%
Mimi	0.017583%
Clara	0.017583%
Tolga	0.017565%
Karlheinz	0.017565%
Milan	0.017557%
Elmar	0.017522%
Helen	0.017522%
Kemal	0.017513%
Gunnar	0.017513%
Rahel	0.017496%
Brigitte	0.017444%
Adem	0.017427%
Chrissi	0.017418%
Emily	0.01741%
Klara	0.017358%
Karoline	0.017245%
Margret	0.017176%
Dan	0.017158%
Marlen	0.017141%
Celine	0.01702%
Mel	0.017011%
Nici	0.016968%
Xenia	0.016933%
Gertrud	0.016907%
Serdar	0.016872%
Luna	0.016838%
Eddy	0.016838%
Karim	0.016838%
Mina	0.016829%
Dejan	0.016829%
Patric	0.016795%
Joel	0.016777%
Willy	0.016777%
Halil	0.01676%
Hatice	0.01676%
Martha	0.016751%
Manja	0.016691%
Louis	0.016639%
Sieglinde	0.016595%
Ahmad	0.016561%
Ron	0.0165%
Elif	0.016405%
Charly	0.016396%
Anneliese	0.016275%
Holger	0.016214%
Kilian	0.016206%
Ingeborg	0.016197%
Yvonne	0.01618%
Marta	0.01618%
Lennart	0.016093%
Kalle	0.016058%
Dimitri	0.01605%
Niels	0.016006%
Egon	0.01592%
Aileen	0.015859%
Winfried	0.015833%
Ramazan	0.015824%
Emil	0.01579%
Jeannine	0.015721%
Chiara	0.015703%
Nele	0.015703%
Regine	0.015695%
Dima	0.015686%
Joanna	0.015677%
Vitali	0.015625%
Sasa	0.015461%
Sarina	0.015461%
La	0.015443%
Margarete	0.015435%
Bilal	0.015426%
Cordula	0.0154%
Betty	0.0154%
Kathy	0.015391%
Valerie	0.015383%
Deborah	0.015365%
Nicky	0.015357%
Baris	0.015331%
Alexa	0.015331%
Emine	0.015305%
Lola	0.015261%
De	0.015235%
Sanja	0.015201%
Nikola	0.015192%
Raimund	0.01514%
Marija	0.015114%
Melek	0.015106%
Monica	0.015088%
Ayhan	0.015054%
Alisa	0.015036%
Da	0.015028%
Selin	0.015019%
Birte	0.014967%
Abdullah	0.014932%
Cengiz	0.014898%
Katha	0.014802%
George	0.014742%
Hülya	0.014698%
Finn	0.01469%
Maxim	0.014681%
Merve	0.014672%
Jannis	0.014638%
Zeynep	0.014621%
Fabi	0.014612%
Dilara	0.014595%
Ugur	0.014569%
Brian	0.014569%
Zoran	0.014551%
Angelique	0.014525%
Bob	0.014465%
Miguel	0.014439%
Cristina	0.014421%
Niki	0.014413%
Eberhard	0.014404%
Hilde	0.014369%
Inna	0.014369%
Lili	0.014335%
Yannik	0.014326%
Aleksandra	0.0143%
Siggi	0.014274%
Knut	0.014213%
Ferhat	0.014213%
Ercan	0.014118%
Detlev	0.014075%
Dorothee	0.014014%
Victor	0.013988%
Lorena	0.013988%
Hagen	0.013876%
Falko	0.013832%
Momo	0.013824%
Nicki	0.013789%
Amanda	0.013789%
Elfi	0.013754%
Sylvia	0.013711%
Mesut	0.013711%
Thorben	0.013711%
Nadin	0.01365%
Gordon	0.01365%
Kaan	0.013598%
Domi	0.013555%
Mohammed	0.013546%
Karolina	0.013529%
Vivian	0.013512%
Filiz	0.013434%
Daniele	0.013425%
Annegret	0.013417%
Timm	0.013399%
Daria	0.013382%
Dany	0.013304%
Bine	0.013295%
Kiki	0.013287%
Danilo	0.013278%
Meli	0.013217%
Tilo	0.013209%
Bert	0.013183%
Engin	0.013148%
Gottfried	0.013139%
Franz	0.013131%
Yilmaz	0.013053%
Myriam	0.013053%
Sammy	0.013053%
Alicia	0.013035%
Jonas	0.013035%
Nikolai	0.012906%
Cihan	0.01288%
Muhammed	0.012871%
Tarik	0.012862%
Rocco	0.012862%
Oleg	0.012793%
Miri	0.012784%
Fatima	0.012767%
Sahra	0.012732%
Jane	0.012706%
Luigi	0.012706%
Vincenzo	0.012672%
Oskar	0.012654%
Louisa	0.012646%
Kristian	0.012637%
Meik	0.012628%
Stefano	0.01262%
Dino	0.012602%
Rick	0.012585%
Fiona	0.012585%
Gino	0.012576%
Mari	0.012568%
Philippe	0.01255%
Diego	0.012533%
Josefine	0.012533%
Leila	0.012524%
Karolin	0.012507%
Marika	0.012481%
Erol	0.012446%
Kirstin	0.012438%
Noah	0.012429%
Dina	0.012403%
Eckhard	0.012395%
Ruben	0.012395%
Angi	0.012386%
Bülent	0.012377%
Erna	0.012369%
Hauke	0.012369%
Dunja	0.012351%
Canan	0.012343%
Arzu	0.012291%
Niclas	0.012282%
Ümit	0.012256%
Renata	0.012213%
Stef	0.012169%
Theresia	0.012169%
Constantin	0.0121%
Sylke	0.012074%
Jessika	0.012065%
Aleksandar	0.012057%
Babsi	0.012048%
Adi	0.012031%
Melisa	0.012022%
Karla	0.012022%
Okan	0.012022%
Danijel	0.012022%
Mo	0.012013%
Sonia	0.011996%
Cora	0.011996%
Gustav	0.011979%
Dajana	0.011909%
Margrit	0.011909%
Benno	0.011892%
Emilia	0.011849%
Gert	0.011814%
Doro	0.01178%
Emir	0.011771%
Amy	0.011771%
Nicolai	0.011762%
Dilek	0.011676%
Selim	0.011667%
Imke	0.011667%
Ann	0.01165%
Coco	0.011632%
Sinem	0.011554%
Chrissy	0.01152%
Paulina	0.011511%
Edeltraud	0.011511%
Marlon	0.011442%
Karo	0.011433%
Omar	0.011424%
Gamze	0.011416%
Pauline	0.01139%
Elvis	0.011381%
Marisa	0.011346%
Beni	0.011329%
Salih	0.011329%
Harun	0.011312%
Berthold	0.011312%
Belinda	0.011295%
Sevda	0.01126%
Cathrin	0.011251%
Janin	0.011243%
Erdal	0.011217%
Bahar	0.011191%
Volker	0.011173%
Raphaela	0.011173%
Gunter	0.011173%
Sergio	0.011156%
Paddy	0.011139%
Horst	0.011087%
Danijela	0.011069%
Cedric	0.011052%
Agnieszka	0.011026%
Guenter	0.011026%
Mischa	0.010983%
Jasmine	0.010974%
Levent	0.010965%
Riccardo	0.010957%
Eugen	0.010948%
Irena	0.010913%
Rob	0.010896%
Claudi	0.010887%
Fernando	0.010887%
Meryem	0.010879%
Sigi	0.010861%
Umut	0.010853%
Lana	0.010809%
Biggi	0.010801%
Nelly	0.010801%
Valeria	0.010801%
Kris	0.010775%
Clarissa	0.010749%
Erhan	0.010723%
Leonard	0.01068%
Vesna	0.01068%
Said	0.010645%
Ma	0.010636%
Gloria	0.01061%
Angel	0.01061%
Sahin	0.010567%
Sedat	0.010567%
Edi	0.01055%
Galina	0.01055%
Georgios	0.010498%
Musa	0.01048%
Eda	0.010454%
Pedro	0.010428%
Catharina	0.010428%
Joachim	0.01042%
Jürg	0.010394%
Adolf	0.010385%
Edwin	0.010376%
Monja	0.01035%
Dörte	0.010333%
Faruk	0.010333%
Yunus	0.010324%
Oktay	0.010307%
Alen	0.010307%
Tini	0.01029%
Lulu	0.010281%
Nikolaus	0.010264%
Zeljko	0.010264%
Ibo	0.010255%
Domenico	0.010255%
Svenja	0.010246%
Darius	0.010246%
Severin	0.010238%
Tomas	0.010238%
Heide	0.010229%
Alain	0.010229%
Kamil	0.010221%
Robby	0.010221%
Merle	0.010212%
Suzana	0.010151%
Darko	0.010143%
Hanspeter	0.010117%
Erhard	0.010091%
Peer	0.010073%