[
  20,
  17,
  48,
  65,
  45,
  34,
  68,
  51,
  62,
  23,
  76,
  101,
  31,
  38,
  2,
  52,
  36,
  50,
  54,
  184,
  41,
  159,
  21,
  9,
  22,
  141,
  104,
  32,
  6,
  55,
  152,
  73,
  98,
  66,
  75,
  33,
  26,
  74,
  70,
  44,
  18,
  122,
  28,
  123,
  49,
  25,
  198,
  59,
  202,
  196,
  160,
  143,
  16,
  71,
  127,
  11,
  43,
  93,
  116,
  67,
  35
]