<?xml version="1.0" encoding="iso-8859-1"?>
<!-- Generator: Adobe Illustrator 19.0.0, SVG Export Plug-In . SVG Version: 6.00 Build 0)  -->
<svg version="1.1" id="Layer_1" xmlns="http://www.w3.org/2000/svg" xmlns:xlink="http://www.w3.org/1999/xlink" x="0px" y="0px"
	 viewBox="0 0 512 512" style="enable-background:new 0 0 512 512;" xml:space="preserve">
<path style="fill:#F0F3FA;" d="M268.884,82.455c-5.503-5.128-11.437-10.21-17.652-15.119V43.931h-69.116v24.216
	c-5.808,4.631-11.393,9.437-16.619,14.309l-20.278,18.906h143.953L268.884,82.455z"/>
<path style="opacity:0.19;fill:#202121;enable-background:new    ;" d="M211.864,68.146V43.931h-29.748v24.216
	c-5.808,4.631-11.393,9.437-16.619,14.309l-20.278,18.906h29.748l20.279-18.906C200.472,77.584,206.058,72.776,211.864,68.146z"/>
<g>
	<path style="fill:#6699CC;" d="M287.212,98.264l-0.653-0.757c-2.075-2.407-5.092-3.79-8.269-3.79H156.099
		c-3.18,0-6.201,1.386-8.277,3.796l-0.647,0.753c-18.302,21.232-27.578,41.625-27.578,60.611v35.117c0,2.077,0.592,4.11,1.705,5.862
		l9.729,15.284c2.003,3.149,5.479,5.056,9.21,5.056h153.891c3.732,0,7.205-1.907,9.209-5.056l9.73-15.284
		c1.114-1.753,1.707-3.785,1.707-5.862v-35.117C314.775,139.868,305.502,119.477,287.212,98.264z"/>
	<path style="fill:#6699CC;" d="M303.377,294.671c-1.982-3.254-5.516-5.241-9.327-5.241H140.318c-3.81,0-7.347,1.986-9.328,5.241
		l-9.804,16.111c-1.041,1.71-1.59,3.675-1.59,5.675v170.106c-0.002,0.056-0.005,0.112-0.006,0.168
		c-0.108,5.088,1.641,12.95,6.938,18.369c4.48,4.578,10.675,6.9,18.412,6.9h131.635c3.028,0,5.921-1.258,7.987-3.472
		c2.065-2.215,3.118-5.19,2.904-8.208l-10.873-154.874h27.266c6.031,0,10.919-4.888,10.919-10.919v-18.07c0-2-0.55-3.965-1.59-5.675
		L303.377,294.671z"/>
</g>
<path style="fill:#485D6D;" d="M180.189,51.573h73.992c6.028,0,10.918-4.888,10.918-10.918V19.09c0-10.527-8.565-19.09-19.093-19.09
	h-57.642c-10.528,0-19.09,8.563-19.09,19.09v21.565C169.272,46.685,174.16,51.573,180.189,51.573z"/>
<path style="opacity:0.19;fill:#202121;enable-background:new    ;" d="M180.189,51.573h73.992c6.028,0,10.918-4.888,10.918-10.918
	V19.09c0-10.527-8.565-19.09-19.093-19.09h-57.642c-10.528,0-19.09,8.563-19.09,19.09v21.565
	C169.272,46.685,174.16,51.573,180.189,51.573z"/>
<path style="fill:#F0F3FA;" d="M389.492,335.595c-2.066-2.219-4.962-3.482-7.993-3.482H276.688c-3.023,0-5.91,1.252-7.975,3.459
	c-2.064,2.207-3.121,5.171-2.921,8.184l2.72,40.83c0.382,5.736,5.146,10.192,10.893,10.192h99.127
	c5.722,0,10.474-4.42,10.891-10.126l2.964-40.831C392.608,340.798,391.56,337.816,389.492,335.595z"/>
<g>
	<path style="opacity:0.19;fill:#202121;enable-background:new    ;" d="M160.778,215.141l-9.727-15.284
		c-1.116-1.752-1.706-3.785-1.706-5.862v-35.117c0-18.986,9.277-39.379,27.579-60.611l0.647-0.753
		c2.075-2.41,5.097-3.796,8.276-3.796h-29.748c-3.18,0-6.201,1.386-8.277,3.796l-0.647,0.753
		c-18.302,21.232-27.578,41.625-27.578,60.611v35.117c0,2.077,0.592,4.11,1.705,5.862l9.729,15.284
		c2.003,3.149,5.479,5.056,9.21,5.056h29.749C166.257,220.197,162.782,218.289,160.778,215.141z"/>
	<path style="opacity:0.19;fill:#202121;enable-background:new    ;" d="M149.339,486.731c0.001-0.056,0.004-0.112,0.006-0.168
		V316.458c0-2,0.55-3.965,1.59-5.675l9.804-16.111c1.981-3.254,5.517-5.241,9.328-5.241h-29.749c-3.81,0-7.347,1.986-9.328,5.241
		l-9.804,16.111c-1.041,1.71-1.59,3.675-1.59,5.675v170.106c-0.002,0.056-0.005,0.112-0.006,0.168
		c-0.108,5.088,1.641,12.95,6.938,18.369c4.48,4.578,10.675,6.9,18.412,6.9h29.75c-7.737,0-13.932-2.322-18.412-6.9
		C150.98,499.68,149.229,491.819,149.339,486.731z"/>
</g>
<path style="fill:#485D6D;" d="M265.099,40.655V19.09c0-10.527-8.565-19.09-19.093-19.09h-27.893c-10.528,0-19.09,8.563-19.09,19.09
	v21.565c0,6.03,4.888,10.918,10.917,10.918h44.243C260.21,51.573,265.099,46.685,265.099,40.655z"/>
<path style="opacity:0.19;fill:#202121;enable-background:new    ;" d="M298.261,384.587l-2.719-40.83
	c-0.2-3.014,0.857-5.977,2.922-8.184c2.064-2.207,4.951-3.459,7.973-3.459h-29.748c-3.023,0-5.91,1.252-7.975,3.459
	c-2.064,2.207-3.121,5.171-2.921,8.184l2.72,40.83c0.382,5.736,5.146,10.192,10.893,10.192h29.749
	C303.407,394.779,298.644,390.323,298.261,384.587z"/>
<rect x="132.025" y="216.809" style="fill:#485D6D;" width="170.31" height="76.421"/>
<rect x="132.025" y="216.809" style="opacity:0.19;fill:#202121;enable-background:new    ;" width="29.749" height="76.421"/>
<polygon style="fill:#6699CC;" points="267.419,375.057 277.035,512 380.195,512 389.81,375.057 "/>
<polygon style="opacity:0.19;fill:#202121;enable-background:new    ;" points="267.419,375.057 277.035,512 306.783,512 
	297.168,375.057 "/>
<g>
</g>
<g>
</g>
<g>
</g>
<g>
</g>
<g>
</g>
<g>
</g>
<g>
</g>
<g>
</g>
<g>
</g>
<g>
</g>
<g>
</g>
<g>
</g>
<g>
</g>
<g>
</g>
<g>
</g>
</svg>
