<svg xmlns="http://www.w3.org/2000/svg" xmlns:xlink="http://www.w3.org/1999/xlink" width="98.453" height="98.453" viewBox="0 0 98.453 98.453">
  <defs>
    <linearGradient id="linear-gradient" x1="0.5" x2="0.5" y2="1" gradientUnits="objectBoundingBox">
      <stop offset="0" stop-color="#fff"/>
      <stop offset="0.225" stop-color="#80bae1"/>
      <stop offset="1" stop-color="#3498db"/>
    </linearGradient>
  </defs>
  <g id="Group_21" data-name="Group 21" transform="translate(-215.774 -187.774)">
    <circle id="Ellipse_2" data-name="Ellipse 2" cx="35" cy="35" r="35" transform="translate(215.774 231.826) rotate(-39)" fill="url(#linear-gradient)"/>
    <path id="Icon_awesome-crown" data-name="Icon awesome-crown" d="M27.828,23.612H5.9a.846.846,0,0,0-.843.843v1.687a.846.846,0,0,0,.843.843H27.828a.846.846,0,0,0,.843-.843V24.455A.846.846,0,0,0,27.828,23.612ZM31.2,6.746a2.53,2.53,0,0,0-2.53,2.53A2.478,2.478,0,0,0,28.9,10.32l-3.816,2.287A1.684,1.684,0,0,1,22.758,12l-4.3-7.516a2.53,2.53,0,1,0-3.194,0L10.973,12a1.685,1.685,0,0,1-2.33.611L4.833,10.32a2.529,2.529,0,1,0-2.3,1.486,2.583,2.583,0,0,0,.406-.042L6.746,21.925H26.985L30.8,11.764a2.583,2.583,0,0,0,.406.042,2.53,2.53,0,0,0,0-5.06Z" transform="translate(248.135 223.508)" fill="#fff"/>
  </g>
</svg>
