[  
      {  
         "productID":4001,
         "productName":"NOW Account",
         "productDescription":"NOW Account - Basic",
         "rateTiers":3
      },
      {  
         "productID":4003,
         "productName":"NOW Account",
         "productDescription":"NOW Account - Premium",
         "rateTiers":3
      },
      {  
         "productID":4004,
         "productName":"Interest Checking",
         "productDescription":"Interest Checking",
         "rateTiers":2
      },
      {  
         "productID":4102,
         "productName":"Money Market Savings",
         "productDescription":"Money Market Savings",
         "rateTiers":3
      },
      {  
         "productID":4103,
         "productName":"Money Market",
         "productDescription":"Money Market Savings",
         "rateTiers":3
      },
      {  
         "productID":4107,
         "productName":"Online Savings Account",
         "productDescription":"Online Savings Account",
         "rateTiers":3
      },
      {  
         "productID":4800,
         "productName":"CMG Account",
         "productDescription":"NOW Account - CMG",
         "rateTiers":3
      },
      {  
         "productID":3704,
         "productName":"IRA Online Savings",
         "productDescription":"IRA Online Savings",
         "rateTiers":3
      },
      {  
         "productID":3506,
         "productName":"Raise Your Rate CD",
         "productDescription":"Raise Your Rate 2-Year CD",
         "rateTiers":3
      },
      {  
         "productID":3512,
         "productName":"No Penalty CD",
         "productDescription":"No Penalty 11-Month CD",
         "rateTiers":3
      },
      {  
         "productID":3501,
         "productName":"High Yield CD",
         "productDescription":"High Yield CD 3-Month",
         "rateTiers":3
      },
      {  
         "productID":3502,
         "productName":"High Yield CD",
         "productDescription":"High Yield 6-Month CD",
         "rateTiers":3
      },
      {  
         "productID":3503,
         "productName":"High Yield CD",
         "productDescription":"High Yield 9-Month CD",
         "rateTiers":3
      },
      {  
         "productID":3504,
         "productName":"High Yield CD",
         "productDescription":"High Yield 12-Month CD",
         "rateTiers":3
      },
      {  
         "productID":3505,
         "productName":"High Yield CD",
         "productDescription":"High Yield 18-Month CD",
         "rateTiers":3
      },
      {  
         "productID":3507,
         "productName":"High Yield CD",
         "productDescription":"High Yield 3-Year CD",
         "rateTiers":3
      },
      {  
         "productID":3508,
         "productName":"Raise Your Rate CD",
         "productDescription":"Raise Your Rate 4-Year CD",
         "rateTiers":3
      },
      {  
         "productID":3509,
         "productName":"High Yield CD",
         "productDescription":"High Yield 5-Year CD",
         "rateTiers":3
      },
      {  
         "productID":3701,
         "productName":"IRA High Yield CD",
         "productDescription":"IRA High Yield CD",
         "rateTiers":3
      },
      {  
         "productID":3702,
         "productName":"IRA Raise Your Rate CD",
         "productDescription":"IRA Raise Your Rate CD",
         "rateTiers":3
      },
      {  
         "productID":3511,
         "productName":"CRA CD",
         "productDescription":"Certificate of Deposit - 6 Month CRA",
         "rateTiers":3
      },
      {  
         "productID":3520,
         "productName":"Select CD",
         "productDescription":"Select CD",
         "rateTiers":3
      },
      {  
         "productID":3710,
         "productName":"IRA Select CD",
         "productDescription":"IRA Select CD",
         "rateTiers":3
      }
]