\relax 
\providecommand\hyper@newdestlabel[2]{}
\@writefile{toc}{\contentsline {subsection}{\numberline {2.11.1}Modifica\IeC {\c c}\IeC {\~o}es propostas}{9}{subsection.2.11.1}}
\@writefile{lof}{\contentsline {figure}{\numberline {1}{\ignorespaces Imagem do diagrama ap\IeC {\'o}s altera\IeC {\c c}\IeC {\~o}es propostas}}{9}{figure.2.1}}
\newlabel{fig:diagramamod}{{\M@TitleReference {1}{Imagem do diagrama ap\IeC {\'o}s altera\IeC {\c c}\IeC {\~o}es propostas}}{9}{Imagem do diagrama após alterações propostas}{figure.2.1}{}}
\@writefile{toc}{\contentsline {subsubsection}{\numberline {2.11.1.1}Novas tabelas}{9}{subsubsection.2.11.1.1}}
\@writefile{toc}{\contentsline {subsubsection}{\numberline {2.11.1.2}Novos atributos}{9}{subsubsection.2.11.1.2}}
\@setckpt{descricaoDiagrama}{
\setcounter{page}{10}
\setcounter{equation}{0}
\setcounter{enumi}{0}
\setcounter{enumii}{0}
\setcounter{enumiii}{0}
\setcounter{enumiv}{0}
\setcounter{footnote}{1}
\setcounter{mpfootnote}{0}
\setcounter{@memmarkcntra}{-1}
\setcounter{storedpagenumber}{1}
\setcounter{book}{0}
\setcounter{part}{0}
\setcounter{chapter}{2}
\setcounter{section}{11}
\setcounter{subsection}{1}
\setcounter{subsubsection}{2}
\setcounter{paragraph}{0}
\setcounter{subparagraph}{0}
\setcounter{@ppsavesec}{0}
\setcounter{@ppsaveapp}{0}
\setcounter{vslineno}{0}
\setcounter{poemline}{0}
\setcounter{modulo@vs}{0}
\setcounter{memfvsline}{0}
\setcounter{verse}{0}
\setcounter{chrsinstr}{0}
\setcounter{poem}{0}
\setcounter{newflo@tctr}{4}
\setcounter{@contsubnum}{0}
\setcounter{maxsecnumdepth}{4}
\setcounter{sidefootnote}{0}
\setcounter{pagenote}{0}
\setcounter{pagenoteshadow}{0}
\setcounter{memfbvline}{0}
\setcounter{bvlinectr}{0}
\setcounter{cp@cntr}{0}
\setcounter{ism@mctr}{0}
\setcounter{xsm@mctr}{0}
\setcounter{csm@mctr}{0}
\setcounter{ksm@mctr}{0}
\setcounter{xksm@mctr}{0}
\setcounter{cksm@mctr}{0}
\setcounter{msm@mctr}{0}
\setcounter{xmsm@mctr}{0}
\setcounter{cmsm@mctr}{0}
\setcounter{bsm@mctr}{0}
\setcounter{workm@mctr}{0}
\setcounter{sheetsequence}{11}
\setcounter{lastsheet}{12}
\setcounter{lastpage}{11}
\setcounter{figure}{1}
\setcounter{lofdepth}{1}
\setcounter{table}{0}
\setcounter{lotdepth}{1}
\setcounter{Item}{0}
\setcounter{Hfootnote}{1}
\setcounter{memhycontfloat}{0}
\setcounter{Hpagenote}{0}
\setcounter{bookmark@seq@number}{0}
\setcounter{abntex@bookmarkcounter}{1}
\setcounter{alineasi}{0}
\setcounter{alineasii}{0}
\setcounter{subalineasi}{0}
\setcounter{incisosi}{0}
\setcounter{float@type}{8}
\setcounter{ABCIaux}{0}
\setcounter{ABCImax}{0}
\setcounter{lstnumber}{1}
\setcounter{loldepth}{1}
\setcounter{section@level}{3}
\setcounter{lstlisting}{0}
}
