\relax 
\providecommand\hyper@newdestlabel[2]{}
\providecommand\BKM@entry[2]{}
\providecommand*{\memsetcounter}[2]{}
\providecommand\HyperFirstAtBeginDocument{\AtBeginDocument}
\HyperFirstAtBeginDocument{\ifx\hyper@anchor\@undefined
\global\let\oldcontentsline\contentsline
\gdef\contentsline#1#2#3#4{\oldcontentsline{#1}{#2}{#3}}
\global\let\oldnewlabel\newlabel
\gdef\newlabel#1#2{\newlabelxx{#1}#2}
\gdef\newlabelxx#1#2#3#4#5#6{\oldnewlabel{#1}{{#2}{#3}}}
\AtEndDocument{\ifx\hyper@anchor\@undefined
\let\contentsline\oldcontentsline
\let\newlabel\oldnewlabel
\fi}
\fi}
\global\let\hyper@last\relax 
\gdef\HyperFirstAtBeginDocument#1{#1}
\providecommand\HyField@AuxAddToFields[1]{}
\providecommand\HyField@AuxAddToCoFields[2]{}
\catcode `"\active 
\citation{abnt-url-package=url}
\citation{abnt-emphasize=bf}
\pgfsyspdfmark {pgfid2}{19582308}{27685592}
\pgfsyspdfmark {pgfid1}{4736286}{50644704}
\@writefile{toc}{\changetocdepth  {4}}
\babel@aux{brazil}{}
\BKM@entry{id=1,dest={6368617074657262312E30},srcline={119}}{466F6C686120646520726F73746F}
\pgfsyspdfmark {pgfid4}{19582308}{27685592}
\pgfsyspdfmark {pgfid3}{4736286}{50644704}
\BKM@entry{id=2,dest={6C6F6C2E30},srcline={121}}{4C6973746120646520616C676F7269746D6F73}
\pgfsyspdfmark {pgfid6}{19582308}{27685592}
\pgfsyspdfmark {pgfid5}{4736286}{50644704}
\BKM@entry{id=3,dest={6C6F662E30},srcline={126}}{4C6973746120646520696C75737472615C3334375C3336356573}
\pgfsyspdfmark {pgfid8}{19582308}{27685592}
\pgfsyspdfmark {pgfid7}{4736286}{50644704}
\BKM@entry{id=4,dest={746F632E30},srcline={131}}{53756D5C33343172696F}
\pgfsyspdfmark {pgfid10}{19582308}{27685592}
\pgfsyspdfmark {pgfid9}{4736286}{50644704}
\pgfsyspdfmark {pgfid12}{19582308}{27685592}
\pgfsyspdfmark {pgfid11}{4736286}{50644704}
\BKM@entry{id=5,dest={636861707465722E31},srcline={143}}{496E74726F64755C3334375C3334336F}
\BKM@entry{id=6,dest={73656374696F6E2E312E31},srcline={1}}{4D6F746976615C3334375C3334336F}
\BKM@entry{id=7,dest={73656374696F6E2E312E32},srcline={3}}{496E667261657374727574757261}
\BKM@entry{id=8,dest={73656374696F6E2E312E33},srcline={14}}{436F6E6669677572615C3334375C3334336F20696E696369616C}
\pgfsyspdfmark {pgfid14}{19582308}{27685592}
\pgfsyspdfmark {pgfid13}{4736286}{50644704}
\@writefile{toc}{\contentsline {chapter}{\chapternumberline {1}Introdu\IeC {\c c}\IeC {\~a}o}{6}{chapter.1}}
\newlabel{sec:introducao}{{\M@TitleReference {1}{Introdu\IeC {\c c}\IeC {\~a}o}}{6}{Introdução}{chapter.1}{}}
\@writefile{toc}{\contentsline {section}{\numberline {1.1}Motiva\IeC {\c c}\IeC {\~a}o}{6}{section.1.1}}
\@writefile{toc}{\contentsline {section}{\numberline {1.2}Infraestrutura}{6}{section.1.2}}
\@writefile{toc}{\contentsline {section}{\numberline {1.3}Configura\IeC {\c c}\IeC {\~a}o inicial}{6}{section.1.3}}
\pgfsyspdfmark {pgfid16}{19582308}{27685592}
\pgfsyspdfmark {pgfid15}{4736286}{50644704}
\@writefile{lof}{\contentsline {figure}{\numberline {1}{\ignorespaces Imagem das tabelas criadas com base na especifica\IeC {\c c}\IeC {\~a}o ER}}{7}{figure.1.1}}
\newlabel{fig:diagramaori}{{\M@TitleReference {1}{Imagem das tabelas criadas com base na especifica\IeC {\c c}\IeC {\~a}o ER}}{7}{Imagem das tabelas criadas com base na especificação ER}{figure.1.1}{}}
\newlabel{lst:scriptSQLER}{{\M@TitleReference {1.1}{Configura\IeC {\c c}\IeC {\~a}o inicial}}{7}{SQL gerado com base em diagrama EER inicial}{lstlisting.1.1}{}}
\@writefile{lol}{\contentsline {lstlisting}{\numberline {1.1}SQL gerado com base em diagrama EER inicial}{7}{lstlisting.1.1}}
\pgfsyspdfmark {pgfid18}{19582308}{27685592}
\pgfsyspdfmark {pgfid17}{4736286}{50644704}
\pgfsyspdfmark {pgfid20}{19582308}{27685592}
\pgfsyspdfmark {pgfid19}{4736286}{50644704}
\pgfsyspdfmark {pgfid22}{19582308}{27685592}
\pgfsyspdfmark {pgfid21}{4736286}{50644704}
\BKM@entry{id=9,dest={636861707465722E32},srcline={146}}{446573656E766F6C76696D656E746F}
\BKM@entry{id=10,dest={73656374696F6E2E322E31},srcline={148}}{51756573745C3334336F2031}
\BKM@entry{id=11,dest={73756273656374696F6E2E322E312E31},srcline={150}}{435C3336336469676F}
\BKM@entry{id=12,dest={73756273656374696F6E2E322E312E32},srcline={152}}{526573756C7461646F}
\BKM@entry{id=13,dest={73656374696F6E2E322E32},srcline={155}}{51756573745C3334336F2032}
\BKM@entry{id=14,dest={73756273656374696F6E2E322E322E31},srcline={157}}{435C3336336469676F}
\pgfsyspdfmark {pgfid24}{19582308}{27685592}
\pgfsyspdfmark {pgfid23}{4736286}{50644704}
\@writefile{toc}{\contentsline {chapter}{\chapternumberline {2}Desenvolvimento}{11}{chapter.2}}
\newlabel{sec:desenvolvimento}{{\M@TitleReference {2}{Desenvolvimento}}{11}{Desenvolvimento}{chapter.2}{}}
\@writefile{toc}{\contentsline {section}{\numberline {2.1}Quest\IeC {\~a}o 1}{11}{section.2.1}}
\@writefile{toc}{\contentsline {subsection}{\numberline {2.1.1}C\IeC {\'o}digo}{11}{subsection.2.1.1}}
\@writefile{lol}{\contentsline {lstlisting}{\numberline {2.1}Implementa\IeC {\c c}\IeC {\~a}o do c\IeC {\'o}digo referente \IeC {\`a} 1\IeC {\textordfeminine } quest\IeC {\~a}o}{11}{lstlisting.2.1}}
\@writefile{toc}{\contentsline {subsection}{\numberline {2.1.2}Resultado}{11}{subsection.2.1.2}}
\@writefile{lof}{\contentsline {figure}{\numberline {2}{\ignorespaces Resultado da execu\IeC {\c c}\IeC {\~a}o do c\IeC {\'o}digo referente \IeC {\`a} 1\IeC {\textordfeminine } quest\IeC {\~a}o}}{11}{figure.2.2}}
\newlabel{fig:questao1}{{\M@TitleReference {2}{Resultado da execu\IeC {\c c}\IeC {\~a}o do c\IeC {\'o}digo referente \IeC {\`a} 1\IeC {\textordfeminine } quest\IeC {\~a}o}}{11}{Resultado da execução do código referente à 1ª questão}{figure.2.2}{}}
\@writefile{toc}{\contentsline {section}{\numberline {2.2}Quest\IeC {\~a}o 2}{11}{section.2.2}}
\@writefile{toc}{\contentsline {subsection}{\numberline {2.2.1}C\IeC {\'o}digo}{11}{subsection.2.2.1}}
\@writefile{lol}{\contentsline {lstlisting}{\numberline {2.2}Implementa\IeC {\c c}\IeC {\~a}o do c\IeC {\'o}digo referente \IeC {\`a} 2\IeC {\textordfeminine } quest\IeC {\~a}o}{11}{lstlisting.2.2}}
\BKM@entry{id=15,dest={73756273656374696F6E2E322E322E32},srcline={159}}{526573756C7461646F}
\BKM@entry{id=16,dest={73656374696F6E2E322E33},srcline={162}}{51756573745C3334336F2033}
\BKM@entry{id=17,dest={73756273656374696F6E2E322E332E31},srcline={164}}{435C3336336469676F}
\BKM@entry{id=18,dest={73756273656374696F6E2E322E332E32},srcline={167}}{526573756C7461646F}
\pgfsyspdfmark {pgfid26}{19582308}{27685592}
\pgfsyspdfmark {pgfid25}{4736286}{50644704}
\@writefile{toc}{\contentsline {subsection}{\numberline {2.2.2}Resultado}{12}{subsection.2.2.2}}
\@writefile{lof}{\contentsline {figure}{\numberline {3}{\ignorespaces Resultado da execu\IeC {\c c}\IeC {\~a}o do c\IeC {\'o}digo referente \IeC {\`a} 2\IeC {\textordfeminine } quest\IeC {\~a}o}}{12}{figure.2.3}}
\newlabel{fig:questao2}{{\M@TitleReference {3}{Resultado da execu\IeC {\c c}\IeC {\~a}o do c\IeC {\'o}digo referente \IeC {\`a} 2\IeC {\textordfeminine } quest\IeC {\~a}o}}{12}{Resultado da execução do código referente à 2ª questão}{figure.2.3}{}}
\@writefile{toc}{\contentsline {section}{\numberline {2.3}Quest\IeC {\~a}o 3}{12}{section.2.3}}
\@writefile{toc}{\contentsline {subsection}{\numberline {2.3.1}C\IeC {\'o}digo}{12}{subsection.2.3.1}}
\@writefile{lol}{\contentsline {lstlisting}{\numberline {2.3}Implementa\IeC {\c c}\IeC {\~a}o do c\IeC {\'o}digo referente \IeC {\`a} 3\IeC {\textordfeminine } quest\IeC {\~a}o}{12}{lstlisting.2.3}}
\@writefile{toc}{\contentsline {subsection}{\numberline {2.3.2}Resultado}{12}{subsection.2.3.2}}
\BKM@entry{id=19,dest={73656374696F6E2E322E34},srcline={170}}{51756573745C3334336F2034}
\BKM@entry{id=20,dest={73756273656374696F6E2E322E342E31},srcline={172}}{435C3336336469676F}
\BKM@entry{id=21,dest={73656374696F6E2E322E35},srcline={175}}{51756573745C3334336F2035}
\BKM@entry{id=22,dest={73756273656374696F6E2E322E352E31},srcline={177}}{435C3336336469676F}
\BKM@entry{id=23,dest={73756273656374696F6E2E322E352E32},srcline={180}}{526573756C7461646F}
\pgfsyspdfmark {pgfid28}{19582308}{27685592}
\pgfsyspdfmark {pgfid27}{4736286}{50644704}
\@writefile{lof}{\contentsline {figure}{\numberline {4}{\ignorespaces Resultado da execu\IeC {\c c}\IeC {\~a}o do c\IeC {\'o}digo referente \IeC {\`a} 3\IeC {\textordfeminine } quest\IeC {\~a}o}}{13}{figure.2.4}}
\newlabel{fig:questao3}{{\M@TitleReference {4}{Resultado da execu\IeC {\c c}\IeC {\~a}o do c\IeC {\'o}digo referente \IeC {\`a} 3\IeC {\textordfeminine } quest\IeC {\~a}o}}{13}{Resultado da execução do código referente à 3ª questão}{figure.2.4}{}}
\@writefile{toc}{\contentsline {section}{\numberline {2.4}Quest\IeC {\~a}o 4}{13}{section.2.4}}
\@writefile{toc}{\contentsline {subsection}{\numberline {2.4.1}C\IeC {\'o}digo}{13}{subsection.2.4.1}}
\@writefile{lol}{\contentsline {lstlisting}{\numberline {2.4}Implementa\IeC {\c c}\IeC {\~a}o do c\IeC {\'o}digo referente \IeC {\`a} 4\IeC {\textordfeminine } quest\IeC {\~a}o}{13}{lstlisting.2.4}}
\@writefile{toc}{\contentsline {section}{\numberline {2.5}Quest\IeC {\~a}o 5}{13}{section.2.5}}
\@writefile{toc}{\contentsline {subsection}{\numberline {2.5.1}C\IeC {\'o}digo}{13}{subsection.2.5.1}}
\@writefile{lol}{\contentsline {lstlisting}{\numberline {2.5}Implementa\IeC {\c c}\IeC {\~a}o do c\IeC {\'o}digo referente \IeC {\`a} 5\IeC {\textordfeminine } quest\IeC {\~a}o}{13}{lstlisting.2.5}}
\@writefile{toc}{\contentsline {subsection}{\numberline {2.5.2}Resultado}{13}{subsection.2.5.2}}
\BKM@entry{id=24,dest={73656374696F6E2E322E36},srcline={184}}{51756573745C3334336F2036}
\BKM@entry{id=25,dest={73756273656374696F6E2E322E362E31},srcline={186}}{435C3336336469676F}
\BKM@entry{id=26,dest={73756273656374696F6E2E322E362E32},srcline={189}}{526573756C7461646F}
\BKM@entry{id=27,dest={73656374696F6E2E322E37},srcline={192}}{51756573745C3334336F2037}
\BKM@entry{id=28,dest={73756273656374696F6E2E322E372E31},srcline={194}}{435C3336336469676F}
\pgfsyspdfmark {pgfid30}{19582308}{27685592}
\pgfsyspdfmark {pgfid29}{4736286}{50644704}
\@writefile{lof}{\contentsline {figure}{\numberline {5}{\ignorespaces Resultado da execu\IeC {\c c}\IeC {\~a}o do c\IeC {\'o}digo referente \IeC {\`a} 5\IeC {\textordfeminine } quest\IeC {\~a}o}}{14}{figure.2.5}}
\newlabel{fig:questao5}{{\M@TitleReference {5}{Resultado da execu\IeC {\c c}\IeC {\~a}o do c\IeC {\'o}digo referente \IeC {\`a} 5\IeC {\textordfeminine } quest\IeC {\~a}o}}{14}{Resultado da execução do código referente à 5ª questão}{figure.2.5}{}}
\@writefile{toc}{\contentsline {section}{\numberline {2.6}Quest\IeC {\~a}o 6}{14}{section.2.6}}
\@writefile{toc}{\contentsline {subsection}{\numberline {2.6.1}C\IeC {\'o}digo}{14}{subsection.2.6.1}}
\@writefile{lol}{\contentsline {lstlisting}{\numberline {2.6}Implementa\IeC {\c c}\IeC {\~a}o do c\IeC {\'o}digo referente \IeC {\`a} 6\IeC {\textordfeminine } quest\IeC {\~a}o}{14}{lstlisting.2.6}}
\@writefile{toc}{\contentsline {subsection}{\numberline {2.6.2}Resultado}{14}{subsection.2.6.2}}
\@writefile{lof}{\contentsline {figure}{\numberline {6}{\ignorespaces Resultado da execu\IeC {\c c}\IeC {\~a}o do c\IeC {\'o}digo referente \IeC {\`a} 6\IeC {\textordfeminine } quest\IeC {\~a}o}}{14}{figure.2.6}}
\newlabel{fig:questao6}{{\M@TitleReference {6}{Resultado da execu\IeC {\c c}\IeC {\~a}o do c\IeC {\'o}digo referente \IeC {\`a} 6\IeC {\textordfeminine } quest\IeC {\~a}o}}{14}{Resultado da execução do código referente à 6ª questão}{figure.2.6}{}}
\@writefile{toc}{\contentsline {section}{\numberline {2.7}Quest\IeC {\~a}o 7}{14}{section.2.7}}
\@writefile{toc}{\contentsline {subsection}{\numberline {2.7.1}C\IeC {\'o}digo}{14}{subsection.2.7.1}}
\@writefile{lol}{\contentsline {lstlisting}{\numberline {2.7}Implementa\IeC {\c c}\IeC {\~a}o do c\IeC {\'o}digo referente \IeC {\`a} 7\IeC {\textordfeminine } quest\IeC {\~a}o}{14}{lstlisting.2.7}}
\BKM@entry{id=29,dest={73756273656374696F6E2E322E372E32},srcline={197}}{526573756C7461646F}
\BKM@entry{id=30,dest={73656374696F6E2E322E38},srcline={200}}{51756573745C3334336F2038}
\BKM@entry{id=31,dest={73756273656374696F6E2E322E382E31},srcline={202}}{435C3336336469676F}
\BKM@entry{id=32,dest={73756273656374696F6E2E322E382E32},srcline={205}}{526573756C7461646F}
\BKM@entry{id=33,dest={73656374696F6E2E322E39},srcline={208}}{51756573745C3334336F2039}
\BKM@entry{id=34,dest={73756273656374696F6E2E322E392E31},srcline={210}}{435C3336336469676F}
\pgfsyspdfmark {pgfid32}{19582308}{27685592}
\pgfsyspdfmark {pgfid31}{4736286}{50644704}
\@writefile{toc}{\contentsline {subsection}{\numberline {2.7.2}Resultado}{15}{subsection.2.7.2}}
\@writefile{lof}{\contentsline {figure}{\numberline {7}{\ignorespaces Resultado da execu\IeC {\c c}\IeC {\~a}o do c\IeC {\'o}digo referente \IeC {\`a} 7\IeC {\textordfeminine } quest\IeC {\~a}o}}{15}{figure.2.7}}
\newlabel{fig:questao7}{{\M@TitleReference {7}{Resultado da execu\IeC {\c c}\IeC {\~a}o do c\IeC {\'o}digo referente \IeC {\`a} 7\IeC {\textordfeminine } quest\IeC {\~a}o}}{15}{Resultado da execução do código referente à 7ª questão}{figure.2.7}{}}
\@writefile{toc}{\contentsline {section}{\numberline {2.8}Quest\IeC {\~a}o 8}{15}{section.2.8}}
\@writefile{toc}{\contentsline {subsection}{\numberline {2.8.1}C\IeC {\'o}digo}{15}{subsection.2.8.1}}
\@writefile{lol}{\contentsline {lstlisting}{\numberline {2.8}Implementa\IeC {\c c}\IeC {\~a}o do c\IeC {\'o}digo referente \IeC {\`a} 8\IeC {\textordfeminine } quest\IeC {\~a}o}{15}{lstlisting.2.8}}
\@writefile{toc}{\contentsline {subsection}{\numberline {2.8.2}Resultado}{15}{subsection.2.8.2}}
\@writefile{lof}{\contentsline {figure}{\numberline {8}{\ignorespaces Resultado da execu\IeC {\c c}\IeC {\~a}o do c\IeC {\'o}digo referente \IeC {\`a} 8\IeC {\textordfeminine } quest\IeC {\~a}o}}{15}{figure.2.8}}
\newlabel{fig:questao8}{{\M@TitleReference {8}{Resultado da execu\IeC {\c c}\IeC {\~a}o do c\IeC {\'o}digo referente \IeC {\`a} 8\IeC {\textordfeminine } quest\IeC {\~a}o}}{15}{Resultado da execução do código referente à 8ª questão}{figure.2.8}{}}
\BKM@entry{id=35,dest={73756273656374696F6E2E322E392E32},srcline={213}}{526573756C7461646F}
\BKM@entry{id=36,dest={73656374696F6E2E322E3130},srcline={216}}{51756573745C3334336F203130}
\BKM@entry{id=37,dest={73756273656374696F6E2E322E31302E31},srcline={218}}{435C3336336469676F}
\BKM@entry{id=38,dest={73756273656374696F6E2E322E31302E32},srcline={221}}{526573756C7461646F}
\pgfsyspdfmark {pgfid34}{19582308}{27685592}
\pgfsyspdfmark {pgfid33}{4736286}{50644704}
\@writefile{toc}{\contentsline {section}{\numberline {2.9}Quest\IeC {\~a}o 9}{16}{section.2.9}}
\@writefile{toc}{\contentsline {subsection}{\numberline {2.9.1}C\IeC {\'o}digo}{16}{subsection.2.9.1}}
\@writefile{lol}{\contentsline {lstlisting}{\numberline {2.9}Implementa\IeC {\c c}\IeC {\~a}o do c\IeC {\'o}digo referente \IeC {\`a} 9\IeC {\textordfeminine } quest\IeC {\~a}o}{16}{lstlisting.2.9}}
\@writefile{toc}{\contentsline {subsection}{\numberline {2.9.2}Resultado}{16}{subsection.2.9.2}}
\@writefile{lof}{\contentsline {figure}{\numberline {9}{\ignorespaces Resultado da execu\IeC {\c c}\IeC {\~a}o do c\IeC {\'o}digo referente \IeC {\`a} 9\IeC {\textordfeminine } quest\IeC {\~a}o}}{16}{figure.2.9}}
\newlabel{fig:questao9}{{\M@TitleReference {9}{Resultado da execu\IeC {\c c}\IeC {\~a}o do c\IeC {\'o}digo referente \IeC {\`a} 9\IeC {\textordfeminine } quest\IeC {\~a}o}}{16}{Resultado da execução do código referente à 9ª questão}{figure.2.9}{}}
\@writefile{toc}{\contentsline {section}{\numberline {2.10}Quest\IeC {\~a}o 10}{16}{section.2.10}}
\@writefile{toc}{\contentsline {subsection}{\numberline {2.10.1}C\IeC {\'o}digo}{16}{subsection.2.10.1}}
\@writefile{lol}{\contentsline {lstlisting}{\numberline {2.10}Implementa\IeC {\c c}\IeC {\~a}o do c\IeC {\'o}digo referente \IeC {\`a} 10\IeC {\textordfeminine } quest\IeC {\~a}o}{16}{lstlisting.2.10}}
\BKM@entry{id=39,dest={73656374696F6E2E322E3131},srcline={224}}{51756573745C3334336F203131}
\BKM@entry{id=40,dest={73756273656374696F6E2E322E31312E31},srcline={1}}{4D6F6469666963615C3334375C33363565732070726F706F73746173206E6F206469616772616D61}
\BKM@entry{id=41,dest={73756273756273656374696F6E2E322E31312E312E31},srcline={3}}{4E6F76617320746162656C6173}
\pgfsyspdfmark {pgfid36}{19582308}{27685592}
\pgfsyspdfmark {pgfid35}{4736286}{50644704}
\@writefile{toc}{\contentsline {subsection}{\numberline {2.10.2}Resultado}{17}{subsection.2.10.2}}
\@writefile{lof}{\contentsline {figure}{\numberline {10}{\ignorespaces Resultado da execu\IeC {\c c}\IeC {\~a}o do c\IeC {\'o}digo referente \IeC {\`a} 10\IeC {\textordfeminine } quest\IeC {\~a}o}}{17}{figure.2.10}}
\newlabel{fig:questao10}{{\M@TitleReference {10}{Resultado da execu\IeC {\c c}\IeC {\~a}o do c\IeC {\'o}digo referente \IeC {\`a} 10\IeC {\textordfeminine } quest\IeC {\~a}o}}{17}{Resultado da execução do código referente à 10ª questão}{figure.2.10}{}}
\@writefile{toc}{\contentsline {section}{\numberline {2.11}Quest\IeC {\~a}o 11}{17}{section.2.11}}
\@writefile{toc}{\contentsline {subsection}{\numberline {2.11.1}Modifica\IeC {\c c}\IeC {\~o}es propostas no diagrama}{17}{subsection.2.11.1}}
\@writefile{lof}{\contentsline {figure}{\numberline {11}{\ignorespaces Imagem do diagrama ap\IeC {\'o}s altera\IeC {\c c}\IeC {\~o}es propostas}}{17}{figure.2.11}}
\newlabel{fig:diagramamod}{{\M@TitleReference {11}{Imagem do diagrama ap\IeC {\'o}s altera\IeC {\c c}\IeC {\~o}es propostas}}{17}{Imagem do diagrama após alterações propostas}{figure.2.11}{}}
\@writefile{toc}{\contentsline {subsubsection}{\numberline {2.11.1.1}Novas tabelas}{17}{subsubsection.2.11.1.1}}
\BKM@entry{id=42,dest={73756273756273656374696F6E2E322E31312E312E32},srcline={14}}{4E6F766F7320617472696275746F73}
\BKM@entry{id=43,dest={73756273656374696F6E2E322E31312E32},srcline={20}}{435C3336336469676F2053514C2067657261646F}
\pgfsyspdfmark {pgfid38}{19582308}{27685592}
\pgfsyspdfmark {pgfid37}{4736286}{50644704}
\@writefile{toc}{\contentsline {subsubsection}{\numberline {2.11.1.2}Novos atributos}{18}{subsubsection.2.11.1.2}}
\@writefile{toc}{\contentsline {subsection}{\numberline {2.11.2}C\IeC {\'o}digo SQL gerado}{18}{subsection.2.11.2}}
\@writefile{lol}{\contentsline {lstlisting}{\numberline {2.11}C\IeC {\'o}digo SQL gerado do diagrama modificado}{18}{lstlisting.2.11}}
\pgfsyspdfmark {pgfid40}{19582308}{27685592}
\pgfsyspdfmark {pgfid39}{4736286}{50644704}
\pgfsyspdfmark {pgfid42}{19582308}{27685592}
\pgfsyspdfmark {pgfid41}{4736286}{50644704}
\BKM@entry{id=44,dest={73656374696F6E2E322E3132},srcline={227}}{51756573745C3334336F203132}
\pgfsyspdfmark {pgfid44}{19582308}{27685592}
\pgfsyspdfmark {pgfid43}{4736286}{50644704}
\@writefile{toc}{\contentsline {section}{\numberline {2.12}Quest\IeC {\~a}o 12}{21}{section.2.12}}
\@writefile{lol}{\contentsline {lstlisting}{\numberline {2.12}Implementa\IeC {\c c}\IeC {\~a}o do c\IeC {\'o}digo referente \IeC {\`a} 10\IeC {\textordfeminine } quest\IeC {\~a}o}{21}{lstlisting.2.12}}
\pgfsyspdfmark {pgfid46}{19582308}{27685592}
\pgfsyspdfmark {pgfid45}{4736286}{50644704}
\pgfsyspdfmark {pgfid48}{19582308}{27685592}
\pgfsyspdfmark {pgfid47}{4736286}{50644704}
\pgfsyspdfmark {pgfid50}{19582308}{27685592}
\pgfsyspdfmark {pgfid49}{4736286}{50644704}
\pgfsyspdfmark {pgfid52}{19582308}{27685592}
\pgfsyspdfmark {pgfid51}{4736286}{50644704}
\BKM@entry{id=45,dest={73656374696F6E2E322E3133},srcline={230}}{51756573745C3334336F20313361}
\BKM@entry{id=46,dest={73756273656374696F6E2E322E31332E31},srcline={231}}{45786572635C33353563696F2070726F706F73746F}
\BKM@entry{id=47,dest={73756273656374696F6E2E322E31332E32},srcline={234}}{435C3336336469676F}
\pgfsyspdfmark {pgfid54}{19582308}{27685592}
\pgfsyspdfmark {pgfid53}{4736286}{50644704}
\@writefile{toc}{\contentsline {section}{\numberline {2.13}Quest\IeC {\~a}o 13a}{26}{section.2.13}}
\@writefile{toc}{\contentsline {subsection}{\numberline {2.13.1}Exerc\IeC {\'\i }cio proposto}{26}{subsection.2.13.1}}
\@writefile{toc}{\contentsline {subsection}{\numberline {2.13.2}C\IeC {\'o}digo}{26}{subsection.2.13.2}}
\@writefile{lol}{\contentsline {lstlisting}{\numberline {2.13}Implementa\IeC {\c c}\IeC {\~a}o do c\IeC {\'o}digo referente \IeC {\`a} 1\IeC {\textordfeminine } quest\IeC {\~a}o proposta}{26}{lstlisting.2.13}}
\BKM@entry{id=48,dest={73756273656374696F6E2E322E31332E33},srcline={236}}{526573756C7461646F}
\BKM@entry{id=49,dest={73656374696F6E2E322E3134},srcline={238}}{51756573745C3334336F20313362}
\BKM@entry{id=50,dest={73756273656374696F6E2E322E31342E31},srcline={239}}{45786572635C33353563696F2070726F706F73746F}
\BKM@entry{id=51,dest={73756273656374696F6E2E322E31342E32},srcline={242}}{435C3336336469676F}
\pgfsyspdfmark {pgfid56}{19582308}{27685592}
\pgfsyspdfmark {pgfid55}{4736286}{50644704}
\@writefile{toc}{\contentsline {subsection}{\numberline {2.13.3}Resultado}{27}{subsection.2.13.3}}
\@writefile{lof}{\contentsline {figure}{\numberline {12}{\ignorespaces Resultado da execu\IeC {\c c}\IeC {\~a}o do c\IeC {\'o}digo referente \IeC {\`a} 1\IeC {\textordfeminine } quest\IeC {\~a}o proposta}}{27}{figure.2.12}}
\newlabel{fig:questao13a}{{\M@TitleReference {12}{Resultado da execu\IeC {\c c}\IeC {\~a}o do c\IeC {\'o}digo referente \IeC {\`a} 1\IeC {\textordfeminine } quest\IeC {\~a}o proposta}}{27}{Resultado da execução do código referente à 1ª questão proposta}{figure.2.12}{}}
\@writefile{toc}{\contentsline {section}{\numberline {2.14}Quest\IeC {\~a}o 13b}{27}{section.2.14}}
\@writefile{toc}{\contentsline {subsection}{\numberline {2.14.1}Exerc\IeC {\'\i }cio proposto}{27}{subsection.2.14.1}}
\@writefile{toc}{\contentsline {subsection}{\numberline {2.14.2}C\IeC {\'o}digo}{27}{subsection.2.14.2}}
\@writefile{lol}{\contentsline {lstlisting}{\numberline {2.14}Implementa\IeC {\c c}\IeC {\~a}o do c\IeC {\'o}digo referente \IeC {\`a} 2\IeC {\textordfeminine } quest\IeC {\~a}o proposta}{27}{lstlisting.2.14}}
\BKM@entry{id=52,dest={73756273656374696F6E2E322E31342E33},srcline={245}}{526573756C7461646F}
\bibstyle{abntex2-alf}
\pgfsyspdfmark {pgfid58}{19582308}{27685592}
\pgfsyspdfmark {pgfid57}{4736286}{50644704}
\@writefile{toc}{\contentsline {subsection}{\numberline {2.14.3}Resultado}{28}{subsection.2.14.3}}
\@writefile{lof}{\contentsline {figure}{\numberline {13}{\ignorespaces Resultado da execu\IeC {\c c}\IeC {\~a}o do c\IeC {\'o}digo referente \IeC {\`a} 2\IeC {\textordfeminine } quest\IeC {\~a}o proposta}}{28}{figure.2.13}}
\newlabel{fig:questao13b}{{\M@TitleReference {13}{Resultado da execu\IeC {\c c}\IeC {\~a}o do c\IeC {\'o}digo referente \IeC {\`a} 2\IeC {\textordfeminine } quest\IeC {\~a}o proposta}}{28}{Resultado da execução do código referente à 2ª questão proposta}{figure.2.13}{}}
\@writefile{toc}{\vspace  {\cftbeforepartskip }}
\memsetcounter{lastsheet}{29}
\memsetcounter{lastpage}{28}
