{
  "db": {
    "name": "db",
    "connector": "memory"
  },
  "mysql-db": {
    "host": "db",
    "port": 3306,
    "url": "",
    "database": "flisol-db",
    "password": "flisol-cefet",
    "name": "mysql-db",
    "user": "flisol",
    "connector": "mysql"
  },
  "emailDataSource": {
    "name": "emailDataSource",
    "connector": "mail",
    "transports": [{
      "type": "SMTP",
      "host": "smtp.gmail.com",
      "secure": true,
      "port": 465,
      "auth": {
        "user": "bh.flisol@gmail.com",
        "pass": "flisol-cefet-compet"
      }
    }]
  }
}
