pickup_datetime,n. trips,price,distance
2014-01-01,420810,12.790657731517792,3.3018827974620555
2014-01-02,359958,11.657875585484973,2.8148331194194465
2014-01-03,275470,11.88827193523796,2.8350400043561854
2014-01-04,417499,11.686589452908871,2.7654991029918325
2014-01-05,388542,12.176261897040735,3.048916178945856
2014-01-06,395445,12.243913009394477,2.9359955493178593
2014-01-07,460052,11.367451353325277,2.61819642127416
2014-01-08,473611,11.488055091625831,2.6177914575463634
2014-01-09,479714,11.816840534151602,2.7064418174162057
2014-01-10,507732,11.829271131226708,2.6736362884356315
2014-01-11,511172,11.233572046199717,2.6685525224385875
2014-01-12,450487,12.16671064869797,3.0615527862069483
2014-01-13,419698,11.879611220448995,2.8293368803281806
2014-01-14,454108,11.931093242136235,2.6644066169281175
2014-01-15,466443,12.358875811192371,2.844408084160476
2014-01-16,482037,12.245691326599408,2.811661926366653
2014-01-17,490852,12.429613447637987,2.8487765151206683
2014-01-18,507033,11.375489859634385,2.7077728865774495
2014-01-19,462238,11.673071642746809,2.895289482906988
2014-01-20,378450,12.254269018364385,3.106797674725912
2014-01-21,255518,13.398042525379827,2.5237832951102854
2014-01-22,377773,11.814828243416024,2.7238209718534425
2014-01-23,462469,12.974570209030233,2.8392311484661694
2014-01-24,509509,12.361545350523741,2.710409099741221
2014-01-25,530551,11.180194005854295,2.6129668401341193
2014-01-26,457026,11.886950523602595,2.951046876983021
2014-01-27,418863,11.875883140788288,2.776009387317581
2014-01-28,468729,11.68904750932842,2.5756354738025893
2014-01-29,477984,11.960770339592962,2.6303781088906826
2014-01-30,495971,12.329140312639252,2.7137502999167817
2014-01-31,526748,12.27135334163585,2.734867906475247
