{
    "about": {
        "problemID": "AUGDATA_taxi_vehicle_collisions_weather_hourly_problem",
        "problemName": "Vehicle collision prediciton problem",
        "problemDescription": "The task is to predict the number of vehicle collisions in NYC. This is a regression problem.",
        "taskType": "regression",
        "problemSchemaVersion": "3.1.1",
        "problemVersion": "1.0"
    },
    "inputs": {
        "data": [
            {
                "datasetID": "AUGDATA_taxi_vehicle_collisions_weather_hourly_dataset",
                "targets": [
                    {
                        "targetIndex": 0,
                        "resID": "0",
                        "colIndex": 3,
                        "colName": "n. collisions"
                    }
                ]
            }
        ],
        "dataSplits": {
            "method": "holdOut",
            "testSize": 0.25,
            "stratified": false,
            "numRepeats": 0,
            "splitsFile": "dataSplits.csv"
        },
        "performanceMetrics": [
            {
                "metric": "meanAbsoluteError"
            }
        ]
    },
    "expectedOutputs": {
        "predictionsFile": "predictions.csv"
    }
}