datetime,n. trips,n. collisions
2014-07-01,445743,616
2014-07-02,439423,658
2014-07-03,417460,740
2014-07-04,309652,360
2014-07-05,308304,505
2014-07-06,313544,451
2014-07-07,378451,614
2014-07-08,434856,594
2014-07-09,448579,569
2014-07-10,456003,584
2014-07-11,458597,642
2014-07-12,447090,550
2014-07-13,410483,439
2014-07-14,416403,566
2014-07-15,436616,587
2014-07-16,449192,551
2014-07-17,457123,587
2014-07-18,460247,624
2014-07-19,445222,480
2014-07-20,398703,451
2014-07-21,399110,557
2014-07-22,447126,587
2014-07-23,466725,591
2014-07-24,461698,539
2014-07-25,461493,653
2014-07-26,448388,534
2014-07-27,403948,476
2014-07-28,368733,595
2014-07-29,422448,526
2014-07-30,441490,605
2014-07-31,453515,626
2014-08-01,453428,667
2014-08-02,440096,540
2014-08-03,397765,476
2014-08-04,392871,589
2014-08-05,422243,606
2014-08-06,439508,562
2014-08-07,446629,585
2014-08-08,445799,601
2014-08-09,420314,538
2014-08-10,372124,512
2014-08-11,377494,604
2014-08-12,413297,491
2014-08-13,434391,572
2014-08-14,439289,625
2014-08-15,444148,522
2014-08-16,419353,490
2014-08-17,380140,476
2014-08-18,376662,595
2014-08-19,405997,516
2014-08-20,422389,551
2014-08-21,441620,567
2014-08-22,419858,568
2014-08-23,402490,454
2014-08-24,364236,437
2014-08-25,357998,549
2014-08-26,389266,608
2014-08-27,415610,538
2014-08-28,414649,618
2014-08-29,410496,631
2014-08-30,376328,510
2014-08-31,352389,495
2014-09-01,319157,392
2014-09-02,408333,700
2014-09-03,441040,580
2014-09-04,469500,727
2014-09-05,496714,647
2014-09-06,503100,553
2014-09-07,445959,477
2014-09-08,430611,598
2014-09-09,450763,592
2014-09-10,466592,618
2014-09-11,478607,619
2014-09-12,486929,730
2014-09-13,513501,558
2014-09-14,450849,528
2014-09-15,421980,610
2014-09-16,447618,613
2014-09-17,451216,658
2014-09-18,464358,650
2014-09-19,488834,648
2014-09-20,492576,594
2014-09-21,402953,515
2014-09-22,393656,662
2014-09-23,401123,593
2014-09-24,416770,566
2014-09-25,426440,491
2014-09-26,448361,643
2014-09-27,486921,600
2014-09-28,433820,512
2014-09-29,400318,566
2014-09-30,435417,589
2014-10-01,458010,560
2014-10-02,467301,558
2014-10-03,485297,719
2014-10-04,467371,531
2014-10-05,416216,505
2014-10-06,409584,639
2014-10-07,436891,620
2014-10-08,456070,639
2014-10-09,477361,499
2014-10-10,489982,541
2014-10-11,509530,546
2014-10-12,437673,473
2014-10-13,389171,451
2014-10-14,431529,696
2014-10-15,456636,575
2014-10-16,481635,602
2014-10-17,492494,648
2014-10-18,513702,493
2014-10-19,461858,483
2014-10-20,416422,591
2014-10-21,445571,607
2014-10-22,461722,708
2014-10-23,471818,639
2014-10-24,492064,669
2014-10-25,500873,515
2014-10-26,441193,515
2014-10-27,411856,642
2014-10-28,434802,571
2014-10-29,454041,556
2014-10-30,469494,626
2014-10-31,494320,668
2014-11-01,561404,656
2014-11-02,435721,532
2014-11-03,412503,625
2014-11-04,424682,538
2014-11-05,449110,554
2014-11-06,470232,652
2014-11-07,486697,641
2014-11-08,515675,543
2014-11-09,445908,419
2014-11-10,407197,560
2014-11-11,402435,493
2014-11-12,444745,546
2014-11-13,464077,696
2014-11-14,491482,654
2014-11-15,508043,529
2014-11-16,442084,429
2014-11-17,402189,666
2014-11-18,456387,712
2014-11-19,458644,633
2014-11-20,458620,634
2014-11-21,495376,677
2014-11-22,516116,512
2014-11-23,425989,425
2014-11-24,398633,722
2014-11-25,409243,599
2014-11-26,425449,742
2014-11-27,296309,378
2014-11-28,347711,444
2014-11-29,395378,394
2014-11-30,370177,377
2014-12-01,399044,644
2014-12-02,440620,611
2014-12-03,438432,569
2014-12-04,458616,606
2014-12-05,496034,673
2014-12-06,508899,628
2014-12-07,460972,493
2014-12-08,431042,579
2014-12-09,437220,645
2014-12-10,447350,649
2014-12-11,469687,669
2014-12-12,497272,687
2014-12-13,501276,594
2014-12-14,441365,439
2014-12-15,410459,720
2014-12-16,439779,645
2014-12-17,456564,555
2014-12-18,482660,621
2014-12-19,509016,652
2014-12-20,494266,505
2014-12-21,419889,409
2014-12-22,382112,566
2014-12-23,384346,732
2014-12-24,348267,519
2014-12-25,210250,303
2014-12-26,278667,446
2014-12-27,323696,406
2014-12-28,323916,349
2014-12-29,339450,411
2014-12-30,377702,469
2014-12-31,405293,461
