datetime,n. trips,n. collisions,Amt[PrecipHourly1],Temp[Temp],Visby[Visibility],n. citibike trips,d3mIndex
2014-01-01,420810,399,0.0,-1.5156249999999996,16069.75,6059,0
2014-01-02,359958,603,0.0,-1.1342105263157893,15365.052631578947,8600,1
2014-01-03,275470,423,0.6195121951219513,-8.546511627906975,4990.697674418605,1144,2
2014-01-04,417499,418,0.2269230769230769,-9.474999999999998,16069.75,2292,3
2014-01-05,388542,320,0.13333333333333333,-0.5380952380952378,12491.42857142857,2678,4
2014-01-06,395445,518,0.811627906976744,8.071153846153845,4950.5,9510,5
2014-01-07,460052,491,0.596551724137931,-9.234374999999998,16069.75,6267,6
2014-01-08,473611,616,0.0,-10.021875000000001,16069.75,9246,7
2014-01-09,479714,561,0.0,-3.225,16069.75,13354,8
2014-01-10,507732,667,0.19189189189189187,0.05581395348837218,10886.790697674418,9847,9
2014-01-11,511172,465,1.0035087719298246,8.091666666666669,2624.6833333333334,7695,10
2014-01-12,450487,388,1.1176470588235294,8.702439024390246,13384.09756097561,12515,11
2014-01-13,419698,568,0.0,4.3625000000000025,15969.1875,20633,12
2014-01-14,454108,558,1.137142857142857,7.739024390243904,11392.80487804878,9999,13
2014-01-15,466443,583,1.109375,3.856818181818183,4939.772727272727,21630,14
2014-01-16,482037,521,0.0,4.577777777777778,9069.62962962963,19953,15
2014-01-17,490852,589,0.0,2.773529411764706,16071.117647058823,20301,16
2014-01-18,507033,448,0.45142857142857146,3.635714285714286,13513.880952380952,9438,17
2014-01-19,462238,380,0.45185185185185184,-0.8531250000000001,16069.75,9028,18
2014-01-20,378450,360,0.0,4.115625,16069.75,13407,19
2014-01-21,255518,1161,0.24324324324324326,-3.5047619047619056,7872.547619047619,3804,20
2014-01-22,377773,498,0.42162162162162165,-10.631707317073168,10168.219512195123,2451,21
2014-01-23,462469,612,0.012,-10.215625,16069.75,5071,22
2014-01-24,509509,705,0.0,-8.934375000000001,16069.75,6176,23
2014-01-25,530551,475,0.06451612903225806,-4.278947368421053,12200.421052631578,4338,24
2014-01-26,457026,465,0.06451612903225806,-5.23142857142857,15061.542857142857,4980,25
2014-01-27,418863,511,0.0,1.9250000000000003,16069.75,13119,26
2014-01-28,468729,504,0.0,-6.6968749999999995,16069.75,10033,27
2014-01-29,477984,649,0.12580645161290321,-7.354285714285715,12724.085714285715,10021,28
2014-01-30,495971,657,0.052000000000000005,-6.015625000000003,16069.75,12158,29
2014-01-31,526748,560,0.0,-0.7735294117647058,16071.117647058823,14653,30
2014-02-01,533783,507,0.0,2.44375,16069.75,12771,31
2014-02-02,464225,417,0.0,3.274418604651163,9031.697674418605,13816,32
2014-02-03,382517,960,1.7825,2.6424999999999974,7604.65,2600,33
2014-02-04,454444,613,1.7258064516129032,-1.5833333333333333,15927.388888888889,8709,34
2014-02-05,413853,468,2.31875,0.20909090909090908,8253.418181818182,2746,35
2014-02-06,478790,569,1.496551724137931,-1.5324324324324328,15100.81081081081,7196,36
2014-02-07,512218,675,0.0,-2.2218749999999985,16069.75,8495,37
2014-02-08,549967,424,0.0,-2.928125,16069.75,5986,38
2014-02-09,466492,450,0.0,-3.4875000000000003,16069.75,4996,39
2014-02-10,435911,678,0.5117647058823529,-3.1550000000000002,11521.625,6846,40
2014-02-11,489373,636,0.0,-5.637500000000001,16069.75,8343,41
2014-02-12,481968,640,0.0,-7.171875000000001,16069.75,8580,42
2014-02-13,326187,447,1.5511627906976744,-0.6723404255319141,6174.04255319149,876,43
2014-02-14,472229,791,2.051428571428571,1.9780487804878055,10732.780487804877,3609,44
2014-02-15,491375,516,0.2111111111111111,1.0837209302325586,10102.06976744186,2261,45
2014-02-16,457332,464,0.2914285714285714,-2.0333333333333337,14012.923076923076,3003,46
2014-02-17,391723,491,0.0,-4.209374999999999,16069.75,4854,47
2014-02-18,419655,518,0.3914285714285714,0.30000000000000016,11151.15909090909,5140,48
2014-02-19,446126,552,0.9677419354838711,2.474358974358975,10991.846153846154,8506,49
2014-02-20,466020,556,0.6592592592592593,4.046875000000001,15530.28125,11792,50
2014-02-21,503515,545,0.29743589743589743,4.583333333333332,4765.270833333333,8680,51
2014-02-22,522080,587,0.36666666666666664,5.521875,15367.15625,13044,52
2014-02-23,442458,414,0.0,6.803124999999999,16069.75,13324,53
2014-02-24,439480,569,0.07241379310344828,4.744117647058824,16071.117647058823,12922,54
2014-02-25,472383,513,0.02,-1.290625,16069.75,12830,55
2014-02-26,492982,511,0.08717948717948719,-2.026190476190476,11431.214285714286,11188,56
2014-02-27,512342,571,0.05,-3.454285714285715,14934.114285714286,12036,57
2014-02-28,544363,655,0.0,-7.559374999999999,15969.1875,9587,58
2014-03-01,554906,497,0.0,-3.6531250000000015,16069.75,9202,59
2014-03-02,462065,344,0.0,2.309375,16019.46875,8195,60
2014-03-03,463982,440,0.07941176470588235,-3.083333333333332,12879.833333333334,7708,61
2014-03-04,499349,532,0.05,-6.762500000000003,16069.75,10398,62
2014-03-05,508381,491,0.0,-0.5031250000000004,16069.75,13801,63
2014-03-06,531137,558,0.0,-3.5187500000000003,16069.75,12773,64
2014-03-07,547177,533,0.0,-1.0228571428571427,15607.028571428571,13304,65
2014-03-08,551574,515,0.0,5.4727272727272736,15772.636363636364,16350,66
2014-03-09,473451,404,0.0,6.734374999999998,15956.96875,12262,67
2014-03-10,442200,513,0.0,5.225714285714284,15106.2,17231,68
2014-03-11,456983,510,0.0,9.484375000000002,16019.46875,24356,69
2014-03-12,483326,515,0.10344827586206896,8.494444444444444,13693.638888888889,15101,70
2014-03-13,549191,545,0.5242424242424243,0.4400000000000005,13094.8,10979,71
2014-03-14,539176,585,0.0,-1.2718749999999994,16069.75,16299,72
2014-03-15,547916,519,0.03333333333333333,8.5375,16069.75,18053,73
2014-03-16,485008,412,0.012,4.284375,16069.75,9851,74
2014-03-17,433321,519,0.0,-1.2205882352941178,15976.470588235294,12503,75
2014-03-18,469975,551,0.0,0.6645161290322579,16072.0,16679,76
2014-03-19,489567,525,0.0,2.3529411764705883,16071.117647058823,13341,77
2014-03-20,500070,627,2.011428571428571,7.870454545454543,12134.15909090909,19695,78
2014-03-21,516535,589,0.0,7.316129032258064,16072.0,20718,79
2014-03-22,534441,493,0.0,8.746875000000001,16069.75,19880,80
2014-03-23,480744,427,0.0,6.648484848484847,16070.454545454546,11740,81
2014-03-24,443322,547,0.0,-1.4999999999999991,16069.75,13598,82
2014-03-25,461531,474,0.0,-0.30937499999999996,16069.75,16037,83
2014-03-26,502757,563,0.0,1.5124999999999997,15329.15625,14500,84
2014-03-27,507907,538,0.0,-1.2531249999999998,16069.75,16666,85
2014-03-28,522404,530,0.0,5.896875000000001,16069.75,18425,86
2014-03-29,574530,569,1.36,8.426315789473682,11815.526315789473,4480,87
2014-03-30,462771,437,5.446341463414635,9.389361702127653,5430.404255319149,7907,88
2014-03-31,432430,559,1.0025641025641023,5.351162790697675,12714.697674418605,17085,89
2014-04-01,462503,549,0.27307692307692305,7.659375000000001,16069.75,23908,90
2014-04-02,483841,519,0.06153846153846154,6.315625000000002,16069.75,22515,91
2014-04-03,499912,592,0.06153846153846154,9.2,15956.96875,26321,92
2014-04-04,544519,622,0.2941176470588236,6.391666666666664,14213.111111111111,12566,93
2014-04-05,543175,580,0.16363636363636364,7.989999999999999,11848.525,18655,94
2014-04-06,475267,484,0.0,7.315151515151515,16070.454545454546,20750,95
2014-04-07,460614,533,0.15357142857142855,6.727777777777779,13666.444444444445,14677,96
2014-04-08,467018,606,1.2857142857142856,11.087500000000004,5362.1875,21884,97
2014-04-09,484663,595,0.256,12.196875000000002,16069.75,26931,98
2014-04-10,498870,645,0.0,8.90625,16069.75,27463,99
2014-04-11,506025,609,0.0,12.487500000000002,16069.75,26798,100
2014-04-12,540202,578,0.0,14.849999999999998,16069.75,27108,101
2014-04-13,472041,482,0.0,12.554285714285719,15979.8,26871,102
2014-04-14,419268,513,0.0,13.475757575757578,15863.575757575758,28832,103
2014-04-15,481424,452,0.6473684210526315,12.159183673469387,4476.510204081633,10523,104
2014-04-16,495438,570,1.197297297297297,4.492307692307692,14475.897435897436,20082,105
2014-04-17,508415,508,0.08,5.318749999999999,16069.75,22282,106
2014-04-18,514893,496,0.0,4.470588235294116,16071.117647058823,20770,107
2014-04-19,483916,526,0.0,10.324999999999998,16069.75,24369,108
2014-04-20,429066,393,0.0,10.515625,16069.75,18464,109
2014-04-21,421347,521,0.0,8.856250000000003,16069.75,27124,110
2014-04-22,463407,459,0.0,10.921875,16069.75,27259,111
2014-04-23,501335,536,0.0,13.253124999999999,15956.96875,26949,112
2014-04-24,505056,586,0.0,10.8125,16069.75,28107,113
2014-04-25,526282,617,0.0,11.434375,16069.75,27919,114
2014-04-26,540090,548,1.4216216216216218,10.51276595744681,13938.170212765957,19899,115
2014-04-27,473210,449,0.6666666666666666,11.130303030303029,16070.454545454546,21926,116
2014-04-28,436246,597,0.0,12.333333333333336,16070.454545454546,28557,117
2014-04-29,483147,555,0.028571428571428574,9.20606060606061,16070.454545454546,18404,118
2014-04-30,497569,651,3.2410256410256406,7.202439024390241,9130.073170731708,2867,119
2014-05-01,492691,650,8.3625,13.291836734693879,5576.469387755102,26762,120
2014-05-02,516985,698,0.25172413793103443,16.20909090909091,15553.90909090909,32377,121
2014-05-03,544063,590,0.012,15.125000000000004,16069.75,25501,122
2014-05-04,475789,451,0.0,14.200000000000005,16071.117647058823,21277,123
2014-05-05,461342,618,0.0,15.315151515151513,16070.454545454546,30288,124
2014-05-06,483245,565,0.0,15.733333333333334,16073.272727272728,32233,125
2014-05-07,484552,603,0.0,14.500000000000002,16069.75,32882,126
2014-05-08,508104,596,0.7514285714285714,12.437837837837831,11566.405405405405,17619,127
2014-05-09,523936,584,0.428125,14.531914893617026,5371.063829787234,22641,128
2014-05-10,527537,549,1.2093023255813953,16.43103448275862,6053.3448275862065,21832,129
2014-05-11,454120,584,1.5233333333333334,20.481250000000003,15821.21875,28326,130
2014-05-12,437492,581,0.02,19.081249999999994,16069.75,31644,131
2014-05-13,473044,560,0.0,17.634375000000002,15969.1875,32847,132
2014-05-14,466666,638,0.0,13.284210526315787,15692.28947368421,30044,133
2014-05-15,495003,659,0.2375,17.33111111111111,5438.844444444445,26057,134
2014-05-16,515834,700,0.2323529411764706,17.697872340425523,6460.468085106383,17784,135
2014-05-17,506831,619,3.8470588235294123,16.673684210526314,12647.263157894737,29912,136
2014-05-18,473932,507,0.0,16.148484848484845,16070.454545454546,27436,137
2014-05-19,452923,572,0.0,16.518750000000004,16069.75,31692,138
2014-05-20,472199,650,0.0,19.05,16071.117647058823,35567,139
2014-05-21,483979,575,0.0,20.584374999999994,16069.75,34420,140
2014-05-22,489262,593,0.5800000000000001,15.736842105263158,12519.763157894737,24535,141
2014-05-23,495859,660,0.5,16.11224489795918,12373.795918367347,24484,142
2014-05-24,413311,486,1.0205882352941178,16.025641025641022,14744.76923076923,16798,143
2014-05-25,378073,472,0.11379310344827585,17.618918918918922,15703.864864864865,25637,144
2014-05-26,336173,433,0.0,21.728124999999995,16069.75,26930,145
2014-05-27,432969,645,0.0,23.918750000000006,16069.75,32936,146
2014-05-28,472420,538,0.0,17.049999999999997,16072.333333333334,29690,147
2014-05-29,489739,663,0.0,13.38787878787879,16070.454545454546,33889,148
2014-05-30,503977,650,0.0,16.049999999999997,16069.75,34343,149
2014-05-31,511991,587,0.13793103448275862,17.478125000000006,15956.96875,27734,150
2014-06-01,435163,604,0.0,17.737500000000008,16069.75,31333,151
2014-06-02,428122,643,0.0,18.7875,16069.75,34519,152
2014-06-03,462670,663,0.0,20.768749999999997,16069.75,29501,153
2014-06-04,482348,582,0.0,20.326315789473686,15904.052631578947,36068,154
2014-06-05,501694,569,1.0138888888888888,19.32439024390244,12624.073170731708,24619,155
2014-06-06,495170,743,0.7730769230769231,20.86666666666666,16070.454545454546,37719,156
2014-06-07,504156,623,0.0,22.040625,16069.75,31204,157
2014-06-08,434856,516,0.0,22.575,16069.75,30162,158
2014-06-09,440162,528,2.0,19.27073170731707,12923.365853658537,18611,159
2014-06-10,463614,569,1.5037037037037038,21.151020408163262,12751.244897959185,33435,160
2014-06-11,477219,576,0.0,19.749999999999996,14928.4,30548,161
2014-06-12,498857,563,0.0,19.09767441860464,13160.767441860466,29084,162
2014-06-13,496516,708,0.5615384615384615,21.204081632653065,6989.285714285715,18308,163
2014-06-14,487611,612,3.76969696969697,21.47906976744186,12303.697674418605,28417,164
2014-06-15,414417,475,0.0,20.603125,16069.75,28382,165
2014-06-16,423175,622,0.0,22.337499999999995,16069.75,34932,166
2014-06-17,449368,666,0.0,22.80000000000001,16069.75,35097,167
2014-06-18,472667,663,0.0,27.61250000000001,15856.40625,35531,168
2014-06-19,487104,675,0.10689655172413792,23.921874999999993,16019.46875,31724,169
2014-06-20,485548,765,0.10740740740740742,23.162500000000005,16069.75,34405,170
2014-06-21,473409,557,0.0,21.440625,16069.75,30288,171
2014-06-22,430757,477,0.0,20.437499999999996,15868.59375,29417,172
2014-06-23,413205,644,0.0,21.684374999999996,16069.75,32580,173
2014-06-24,441878,632,0.0,21.890624999999993,16069.75,35897,174
2014-06-25,468089,646,0.0,22.706818181818182,12426.0,34340,175
2014-06-26,486884,670,0.267741935483871,24.649999999999995,14385.309523809523,34846,176
2014-06-27,474158,660,0.02,23.018918918918914,16072.891891891892,35823,177
2014-06-28,472015,611,0.0,23.49375,16069.75,28507,178
2014-06-29,402696,537,0.0,22.543749999999996,16069.75,27986,179
2014-06-30,409501,609,0.0,22.918750000000006,16069.75,33597,180
2014-07-01,445743,616,0.0,24.53749999999999,16069.75,34854,181
2014-07-02,439423,658,0.0,25.251428571428562,16071.742857142857,26582,182
2014-07-03,417460,740,2.17027027027027,24.880952380952376,15481.380952380952,27587,183
2014-07-04,309652,360,2.0777777777777775,22.344444444444438,14612.333333333334,13612,184
2014-07-05,308304,505,0.637037037037037,23.009090909090904,16070.454545454546,22913,185
2014-07-06,313544,451,0.0,24.087096774193554,16072.0,23822,186
2014-07-07,378451,614,0.0,24.206451612903226,16072.0,31863,187
2014-07-08,434856,594,0.0,26.009375000000002,16019.46875,32713,188
2014-07-09,448579,569,0.0,24.787499999999998,15856.40625,34426,189
2014-07-10,456003,584,0.1064516129032258,24.035294117647062,15675.911764705883,36288,190
2014-07-11,458597,642,0.032,24.534374999999994,16069.75,35000,191
2014-07-12,447090,550,0.0,22.08888888888889,12513.138888888889,28718,192
2014-07-13,410483,439,0.0,22.80909090909091,15843.575757575758,24869,193
2014-07-14,416403,566,0.39333333333333337,24.252777777777776,15606.222222222223,25825,194
2014-07-15,436616,587,7.330232558139534,23.433928571428574,7924.0,22963,195
2014-07-16,449192,551,2.651351351351351,23.11086956521739,14381.652173913044,35391,196
2014-07-17,457123,587,0.023076923076923075,23.86875000000001,16069.75,38619,197
2014-07-18,460247,624,0.0,23.63125,16069.75,36105,198
2014-07-19,445222,480,0.0,22.965624999999992,16069.75,29291,199
2014-07-20,398703,451,0.0,22.235294117647054,16071.117647058823,30296,200
2014-07-21,399110,557,0.0,22.978125000000006,16069.75,35670,201
2014-07-22,447126,587,0.0,24.112499999999997,16069.75,36886,202
2014-07-23,466725,591,0.0,24.909374999999997,16069.75,34173,203
2014-07-24,461698,539,0.0896551724137931,25.325,15804.111111111111,36693,204
2014-07-25,461493,653,0.0,24.171874999999996,16069.75,36384,205
2014-07-26,448388,534,0.08846153846153845,23.315625,16069.75,27179,206
2014-07-27,403948,476,0.1733333333333333,24.314285714285706,16071.742857142857,27004,207
2014-07-28,368733,595,1.2781250000000002,25.018421052631574,15169.28947368421,33189,208
2014-07-29,422448,526,0.5,22.328124999999996,16069.75,37092,209
2014-07-30,441490,605,0.0,22.35625,16069.75,37377,210
2014-07-31,453515,626,0.0,23.14687500000001,16069.75,35458,211
2014-08-01,453428,667,0.0,23.95588235294117,15976.470588235294,32654,212
2014-08-02,440096,540,0.8999999999999999,21.448780487804882,14799.829268292682,26784,213
2014-08-03,397765,476,0.48620689655172417,20.905405405405396,15597.0,25276,214
2014-08-04,392871,589,0.11923076923076922,23.35384615384616,16073.923076923076,33822,215
2014-08-05,422243,606,0.0,25.168749999999996,16069.75,34392,216
2014-08-06,439508,562,0.0,25.066666666666663,16074.4,36336,217
2014-08-07,446629,585,0.0,24.88999999999999,16074.4,36362,218
2014-08-08,445799,601,0.0,23.487499999999994,16069.75,34073,219
2014-08-09,420314,538,0.0,24.590624999999996,16069.75,31636,220
2014-08-10,372124,512,0.0,25.490624999999994,16069.75,26749,221
2014-08-11,377494,604,0.0,24.571875,16069.75,33664,222
2014-08-12,413297,491,0.011538461538461537,24.171875000000004,16069.75,26261,223
2014-08-13,434391,572,6.102380952380951,23.291836734693877,11901.69387755102,27977,224
2014-08-14,439289,625,2.814814814814815,22.684374999999992,16069.75,35154,225
2014-08-15,444148,522,0.0,21.0875,16069.75,32480,226
2014-08-16,419353,490,0.0,21.590624999999996,16069.75,32017,227
2014-08-17,380140,476,0.0,23.64375,16069.75,27417,228
2014-08-18,376662,595,0.0,23.175,16069.75,34339,229
2014-08-19,405997,516,0.0,22.16176470588235,16071.117647058823,35367,230
2014-08-20,422389,551,0.0,22.978125000000002,16069.75,35532,231
2014-08-21,441620,567,0.0,23.415625,16069.75,33804,232
2014-08-22,419858,568,0.884375,22.000000000000004,15398.073170731708,30406,233
2014-08-23,402490,454,0.15357142857142855,21.097222222222225,16072.333333333334,26429,234
2014-08-24,364236,437,0.0,21.220588235294116,16071.117647058823,27493,235
2014-08-25,357998,549,0.0,23.565625,16069.75,32892,236
2014-08-26,389266,608,0.0,24.225714285714297,16071.742857142857,34519,237
2014-08-27,415610,538,0.0,24.218749999999993,16069.75,33721,238
2014-08-28,414649,618,0.0,24.931250000000002,16069.75,33927,239
2014-08-29,410496,631,0.0,21.69375,16069.75,31264,240
2014-08-30,376328,510,0.0,21.70937499999999,16069.75,22689,241
2014-08-31,352389,495,0.08518518518518518,24.905128205128207,15610.02564102564,18053,242
2014-09-01,319157,392,0.2966666666666667,25.611764705882347,16071.117647058823,23575,243
2014-09-02,408333,700,0.0,27.143749999999997,15856.40625,30507,244
2014-09-03,441040,580,0.0,26.928124999999998,16069.75,35535,245
2014-09-04,469500,727,0.0,24.909374999999994,16069.75,36496,246
2014-09-05,496714,647,0.0,24.891891891891884,16072.891891891892,34831,247
2014-09-06,503100,553,0.0,25.831578947368417,15280.394736842105,25833,248
2014-09-07,445959,477,0.11034482758620691,23.26388888888889,16072.333333333334,29721,249
2014-09-08,430611,598,0.0,21.453124999999993,16069.75,34335,250
2014-09-09,450763,592,0.0,21.040540540540537,16072.891891891892,34518,251
2014-09-10,466592,618,0.0,20.52058823529412,16071.117647058823,37653,252
2014-09-11,478607,619,0.0,23.000000000000004,16072.333333333334,37081,253
2014-09-12,486929,730,0.0,21.97714285714286,16071.742857142857,37204,254
2014-09-13,513501,558,0.5967741935483871,18.599999999999994,14857.35,17293,255
2014-09-14,450849,528,0.7899999999999998,16.81176470588235,15078.529411764706,28688,256
2014-09-15,421980,610,0.0,17.471875000000004,16069.75,35045,257
2014-09-16,447618,613,0.7275862068965517,17.551428571428566,14899.914285714285,25633,258
2014-09-17,451216,658,1.3199999999999998,18.039393939393946,16070.454545454546,37453,259
2014-09-18,464358,650,0.0,19.343749999999996,16069.75,37381,260
2014-09-19,488834,648,0.0,17.049999999999997,16069.75,34713,261
2014-09-20,492576,594,0.0,18.1735294117647,16071.117647058823,30011,262
2014-09-21,402953,515,1.8562499999999997,21.68367346938775,12394.57142857143,26080,263
2014-09-22,393656,662,0.2296296296296296,20.675,15705.5625,33239,264
2014-09-23,401123,593,0.0,15.503124999999997,16069.75,36347,265
2014-09-24,416770,566,0.0,17.70625,16069.75,35481,266
2014-09-25,426440,491,0.4750000000000001,17.17777777777778,15051.611111111111,16650,267
2014-09-26,448361,643,0.36666666666666664,19.14375,16069.75,35116,268
2014-09-27,486921,600,0.0,21.184375,16069.75,30193,269
2014-09-28,433820,512,0.0,20.818749999999994,16069.75,29021,270
2014-09-29,400318,566,0.0,20.740625,16069.75,33161,271
2014-09-30,435417,589,0.0375,19.715789473684207,15137.21052631579,35093,272
2014-10-01,458010,560,0.04666666666666667,17.60975609756096,15760.878048780487,27942,273
2014-10-02,467301,558,0.0,17.479999999999993,16071.742857142857,34492,274
2014-10-03,485297,719,0.0,16.635294117647053,16073.85294117647,34944,275
2014-10-04,467371,531,1.4870967741935481,18.897368421052636,12760.78947368421,13354,276
2014-10-05,416216,505,1.2814814814814814,12.775000000000002,16069.75,23456,277
2014-10-06,409584,639,0.0,14.545454545454549,16070.454545454546,31742,278
2014-10-07,436891,620,0.0,19.815625,16069.75,32892,279
2014-10-08,456070,639,0.10714285714285714,20.306250000000006,16069.75,33607,280
2014-10-09,477361,499,0.02,17.509374999999995,16069.75,32203,281
2014-10-10,489982,541,0.0,15.437500000000002,16069.75,30887,282
2014-10-11,509530,546,0.89375,13.353846153846153,14084.461538461539,12965,283
2014-10-12,437673,473,0.6230769230769231,12.38709677419355,16072.0,23394,284
2014-10-13,389171,451,0.0,14.080000000000004,15428.028571428571,22752,285
2014-10-14,431529,696,0.3548387096774194,19.752777777777776,14670.944444444445,32614,286
2014-10-15,456636,575,0.025925925925925925,21.623529411764704,15929.117647058823,28743,287
2014-10-16,481635,602,1.848936170212766,20.57818181818182,12628.945454545454,26754,288
2014-10-17,492494,648,0.7807692307692308,18.106060606060606,16070.454545454546,34132,289
2014-10-18,513702,493,0.0,18.3,16069.75,24978,290
2014-10-19,461858,483,0.0,13.246875000000001,16069.75,18840,291
2014-10-20,416422,591,0.0,9.993750000000002,16069.65625,27914,292
2014-10-21,445571,607,0.0962962962962963,15.09375,16069.75,31330,293
2014-10-22,461722,708,2.4026315789473682,13.564102564102564,14430.23076923077,9169,294
2014-10-23,471818,639,1.7849999999999997,11.395,14824.125,13371,295
2014-10-24,492064,669,0.13103448275862067,12.90625,15918.875,29837,296
2014-10-25,500873,515,0.0,14.031249999999998,16069.75,24952,297
2014-10-26,441193,515,0.0,15.490909090909094,16070.454545454546,20768,298
2014-10-27,411856,642,0.0,13.990624999999994,16069.75,28806,299
2014-10-28,434802,571,0.0,14.909375,16069.75,32956,300
2014-10-29,454041,556,0.02,17.309375000000003,15918.90625,29999,301
2014-10-30,469494,626,0.09310344827586207,12.224242424242421,15614.515151515152,31133,302
2014-10-31,494320,668,0.0,10.259375,16069.75,27785,303
2014-11-01,561404,656,1.653125,8.947222222222225,14750.833333333334,6002,304
2014-11-02,435721,532,2.223333333333333,7.0852941176470585,16071.117647058823,14100,305
2014-11-03,412503,625,0.0,8.71875,16069.75,26757,306
2014-11-04,424682,538,0.0,14.046875,16069.75,31174,307
2014-11-05,449110,554,0.0,14.765625000000005,16069.75,30539,308
2014-11-06,470232,652,0.7351351351351351,11.12272727272727,12347.522727272728,12283,309
2014-11-07,486697,641,0.7000000000000001,10.272222222222222,15726.888888888889,25355,310
2014-11-08,515675,543,0.0,6.0187500000000025,16069.75,17443,311
2014-11-09,445908,419,0.0,9.753125000000002,16069.75,18207,312
2014-11-10,407197,560,0.0,9.543750000000001,16019.46875,27655,313
2014-11-11,402435,493,0.0,12.140625,14576.1875,29358,314
2014-11-12,444745,546,0.0,15.36440677966102,5413.389830508475,27807,315
2014-11-13,464077,696,0.0,7.8437500000000036,16069.75,20652,316
2014-11-14,491482,654,0.4,4.505263157894736,15841.131578947368,21082,317
2014-11-15,508043,529,0.07200000000000001,3.3968749999999996,16069.75,14057,318
2014-11-16,442084,429,0.0,3.5375000000000005,16069.75,13272,319
2014-11-17,402189,666,2.272340425531915,7.818367346938776,8410.42857142857,8116,320
2014-11-18,456387,712,2.5225806451612898,3.705882352941177,16071.117647058823,16691,321
2014-11-19,458644,633,0.0,-2.4875000000000003,16069.75,16694,322
2014-11-20,458620,634,0.0,4.0625,16069.75,20611,323
2014-11-21,495376,677,0.0,1.0031249999999998,16069.75,17806,324
2014-11-22,516116,512,0.0,1.1531250000000002,16069.75,12682,325
2014-11-23,425989,425,0.0,7.943749999999999,16069.75,15669,326
2014-11-24,398633,722,0.9142857142857143,14.323999999999998,7924.64,23031,327
2014-11-25,409243,599,0.49615384615384617,13.687500000000002,15906.6875,25580,328
2014-11-26,425449,742,1.6166666666666665,5.574468085106383,9994.106382978724,3675,329
2014-11-27,296309,378,1.17027027027027,2.965789473684209,14656.605263157895,3945,330
2014-11-28,347711,444,0.02962962962962963,1.809090909090909,16070.454545454546,8378,331
2014-11-29,395378,394,0.0,-0.3187500000000001,16069.75,8183,332
2014-11-30,370177,377,0.0,8.721875,16069.75,12384,333
2014-12-01,399044,644,0.0,11.990909090909096,16070.454545454546,18519,334
2014-12-02,440620,611,0.25625,4.932352941176472,15645.14705882353,15367,335
2014-12-03,438432,569,0.4452380952380952,7.382222222222222,9090.777777777777,13472,336
2014-12-04,458616,606,0.37407407407407406,5.920588235294116,16071.117647058823,21335,337
2014-12-05,496034,673,0.0,4.618750000000001,15768.03125,15818,338
2014-12-06,508899,628,2.4377777777777774,9.014000000000003,8886.9,4047,339
2014-12-07,460972,493,2.4566666666666666,4.891428571428572,15451.742857142857,10510,340
2014-12-08,431042,579,0.052000000000000005,-0.6999999999999998,16071.117647058823,15557,341
2014-12-09,437220,645,5.107692307692307,4.904545454545453,9375.454545454546,6713,342
2014-12-10,447350,649,2.764864864864864,4.335,11728.875,10399,343
2014-12-11,469687,669,0.11842105263157894,1.5921052631578947,13572.921052631578,18141,344
2014-12-12,497272,687,0.0,2.06875,16069.75,17892,345
2014-12-13,501276,594,0.0,3.396875,16069.75,12549,346
2014-12-14,441365,439,0.0,5.022857142857141,16071.742857142857,11941,347
2014-12-15,410459,720,0.0,4.924999999999999,16069.75,19382,348
2014-12-16,439779,645,0.012,5.164705882352943,15114.470588235294,16816,349
2014-12-17,456564,555,1.0055555555555553,9.055813953488375,9462.32558139535,20346,350
2014-12-18,482660,621,0.028571428571428574,5.784375,16069.75,19051,351
2014-12-19,509016,652,0.0,3.5249999999999995,16069.75,17200,352
2014-12-20,494266,505,0.0,0.464705882352941,16071.117647058823,9582,353
2014-12-21,419889,409,0.0,1.5971428571428572,16071.742857142857,8747,354
2014-12-22,382112,566,0.016129032258064516,4.645000000000001,15366.65,13560,355
2014-12-23,384346,732,0.4108108108108109,8.705405405405406,11630.54054054054,9422,356
2014-12-24,348267,519,1.739583333333333,9.822222222222221,2054.5,4285,357
2014-12-25,210250,303,1.2999999999999998,11.364285714285716,8650.404761904761,4890,358
2014-12-26,278667,446,0.06923076923076923,7.268750000000002,16069.75,9895,359
2014-12-27,323696,406,0.0,6.878125,16069.75,10247,360
2014-12-28,323916,349,0.12592592592592594,8.268749999999999,15868.59375,7902,361
2014-12-29,339450,411,0.1,6.162499999999998,16069.75,13549,362
2014-12-30,377702,469,0.0,0.9218750000000001,16069.75,12196,363
2014-12-31,405293,461,0.0,-0.9125,16069.75,9739,364
