{
    "about": {
        "datasetID": "AUGDATA_taxi_vehicle_collisions_hourly_dataset",
        "datasetName": "NYC Taxi and Vehicle Collision Datasets",
        "description": "This dataset contains hourly passenger pickup numbers (Taxi) and vehicle collision numbers (Vehicle Collision) between Jan 2014 to Dec 2014",
        "license": "",
        "datasetSchemaVersion": "3.1.2",
        "redacted": false
    },
    "dataResources": [
        {
            "resID": "0",
            "resPath": "tables/learningData.csv",
            "resType": "table",
            "resFormat": [
                "text/csv"
            ],
            "isCollection": false,
            "columns": [
                {
                    "colIndex": 0,
                    "colName": "d3mIndex",
                    "colType": "integer",
                    "role": [
                        "index"
                    ]
                },
                {
                    "colIndex": 1,
                    "colName": "datetime",
                    "colType": "dateTime",
                    "role": [
                        "attribute"
                    ]
                },
                {
                    "colIndex": 2,
                    "colName": "n. trips",
                    "colType": "integer",
                    "role": [
                        "attribute"
                    ]
                },
                {
                    "colIndex": 3,
                    "colName": "n. collisions",
                    "colType": "integer",
                    "role": [
                        "suggestedTarget"
                    ]
                },
                {
                    "colIndex": 4,
                    "colName": "weekday",
                    "colType": "categorical",
                    "role": [
                        "attribute"
                    ]
                }
            ]
        }
    ]
}