d3mIndex,type,repeats,fold
0,TRAIN,0,0
1,TRAIN,0,0
2,TRAIN,0,0
3,TRAIN,0,0
4,TRAIN,0,0
5,TRAIN,0,0
6,TEST,0,0
7,TRAIN,0,0
8,TEST,0,0
9,TRAIN,0,0
10,TRAIN,0,0
11,TRAIN,0,0
12,TEST,0,0
13,TRAIN,0,0
14,TEST,0,0
15,TRAIN,0,0
16,TRAIN,0,0
17,TEST,0,0
18,TRAIN,0,0
19,TRAIN,0,0
20,TRAIN,0,0
21,TRAIN,0,0
22,TRAIN,0,0
23,TEST,0,0
24,TRAIN,0,0
25,TRAIN,0,0
26,TEST,0,0
27,TRAIN,0,0
28,TRAIN,0,0
29,TEST,0,0
30,TEST,0,0
31,TRAIN,0,0
32,TEST,0,0
33,TEST,0,0
34,TRAIN,0,0
35,TRAIN,0,0
36,TRAIN,0,0
37,TRAIN,0,0
38,TRAIN,0,0
39,TRAIN,0,0
40,TRAIN,0,0
41,TRAIN,0,0
42,TRAIN,0,0
43,TEST,0,0
44,TEST,0,0
45,TEST,0,0
46,TRAIN,0,0
47,TRAIN,0,0
48,TRAIN,0,0
49,TRAIN,0,0
50,TRAIN,0,0
51,TEST,0,0
52,TEST,0,0
53,TRAIN,0,0
54,TRAIN,0,0
55,TRAIN,0,0
56,TEST,0,0
57,TRAIN,0,0
58,TEST,0,0
59,TRAIN,0,0
60,TRAIN,0,0
61,TEST,0,0
62,TRAIN,0,0
63,TEST,0,0
64,TRAIN,0,0
65,TRAIN,0,0
66,TRAIN,0,0
67,TRAIN,0,0
68,TRAIN,0,0
69,TEST,0,0
70,TEST,0,0
71,TRAIN,0,0
72,TRAIN,0,0
73,TEST,0,0
74,TRAIN,0,0
75,TRAIN,0,0
76,TEST,0,0
77,TRAIN,0,0
78,TRAIN,0,0
79,TRAIN,0,0
80,TEST,0,0
81,TRAIN,0,0
82,TRAIN,0,0
83,TRAIN,0,0
84,TEST,0,0
85,TRAIN,0,0
86,TRAIN,0,0
87,TRAIN,0,0
88,TRAIN,0,0
89,TRAIN,0,0
90,TRAIN,0,0
91,TRAIN,0,0
92,TRAIN,0,0
93,TEST,0,0
94,TRAIN,0,0
95,TEST,0,0
96,TEST,0,0
97,TRAIN,0,0
98,TRAIN,0,0
99,TEST,0,0
100,TRAIN,0,0
101,TRAIN,0,0
102,TRAIN,0,0
103,TEST,0,0
104,TRAIN,0,0
105,TRAIN,0,0
106,TRAIN,0,0
107,TRAIN,0,0
108,TEST,0,0
109,TEST,0,0
110,TRAIN,0,0
111,TRAIN,0,0
112,TRAIN,0,0
113,TEST,0,0
114,TRAIN,0,0
115,TRAIN,0,0
116,TRAIN,0,0
117,TRAIN,0,0
118,TRAIN,0,0
119,TRAIN,0,0
120,TEST,0,0
121,TRAIN,0,0
122,TEST,0,0
123,TRAIN,0,0
124,TEST,0,0
125,TRAIN,0,0
126,TRAIN,0,0
127,TRAIN,0,0
128,TRAIN,0,0
129,TRAIN,0,0
130,TRAIN,0,0
131,TRAIN,0,0
132,TEST,0,0
133,TRAIN,0,0
134,TEST,0,0
135,TRAIN,0,0
136,TRAIN,0,0
137,TRAIN,0,0
138,TRAIN,0,0
139,TEST,0,0
140,TRAIN,0,0
141,TRAIN,0,0
142,TRAIN,0,0
143,TRAIN,0,0
144,TEST,0,0
145,TRAIN,0,0
146,TRAIN,0,0
147,TRAIN,0,0
148,TRAIN,0,0
149,TEST,0,0
150,TEST,0,0
151,TEST,0,0
152,TEST,0,0
153,TRAIN,0,0
154,TRAIN,0,0
155,TRAIN,0,0
156,TEST,0,0
157,TEST,0,0
158,TRAIN,0,0
159,TRAIN,0,0
160,TRAIN,0,0
161,TRAIN,0,0
162,TRAIN,0,0
163,TRAIN,0,0
164,TRAIN,0,0
165,TRAIN,0,0
166,TEST,0,0
167,TRAIN,0,0
168,TRAIN,0,0
169,TRAIN,0,0
170,TEST,0,0
171,TRAIN,0,0
172,TRAIN,0,0
173,TRAIN,0,0
174,TEST,0,0
175,TEST,0,0
176,TRAIN,0,0
177,TEST,0,0
178,TRAIN,0,0
179,TEST,0,0
180,TEST,0,0
181,TRAIN,0,0
182,TRAIN,0,0
183,TEST,0,0
184,TEST,0,0
185,TRAIN,0,0
186,TRAIN,0,0
187,TRAIN,0,0
188,TEST,0,0
189,TRAIN,0,0
190,TRAIN,0,0
191,TRAIN,0,0
192,TEST,0,0
193,TRAIN,0,0
194,TEST,0,0
195,TRAIN,0,0
196,TEST,0,0
197,TRAIN,0,0
198,TRAIN,0,0
199,TRAIN,0,0
200,TRAIN,0,0
201,TRAIN,0,0
202,TRAIN,0,0
203,TEST,0,0
204,TRAIN,0,0
205,TEST,0,0
206,TRAIN,0,0
207,TRAIN,0,0
208,TRAIN,0,0
209,TRAIN,0,0
210,TRAIN,0,0
211,TEST,0,0
212,TRAIN,0,0
213,TRAIN,0,0
214,TEST,0,0
215,TRAIN,0,0
216,TRAIN,0,0
217,TEST,0,0
218,TRAIN,0,0
219,TRAIN,0,0
220,TEST,0,0
221,TRAIN,0,0
222,TEST,0,0
223,TRAIN,0,0
224,TRAIN,0,0
225,TRAIN,0,0
226,TRAIN,0,0
227,TEST,0,0
228,TRAIN,0,0
229,TEST,0,0
230,TRAIN,0,0
231,TRAIN,0,0
232,TRAIN,0,0
233,TRAIN,0,0
234,TRAIN,0,0
235,TRAIN,0,0
236,TRAIN,0,0
237,TRAIN,0,0
238,TEST,0,0
239,TEST,0,0
240,TEST,0,0
241,TRAIN,0,0
242,TRAIN,0,0
243,TRAIN,0,0
244,TRAIN,0,0
245,TRAIN,0,0
246,TRAIN,0,0
247,TRAIN,0,0
248,TRAIN,0,0
249,TRAIN,0,0
250,TRAIN,0,0
251,TEST,0,0
252,TRAIN,0,0
253,TRAIN,0,0
254,TEST,0,0
255,TRAIN,0,0
256,TEST,0,0
257,TEST,0,0
258,TRAIN,0,0
259,TRAIN,0,0
260,TRAIN,0,0
261,TRAIN,0,0
262,TRAIN,0,0
263,TEST,0,0
264,TRAIN,0,0
265,TRAIN,0,0
266,TEST,0,0
267,TRAIN,0,0
268,TRAIN,0,0
269,TRAIN,0,0
270,TEST,0,0
271,TRAIN,0,0
272,TRAIN,0,0
273,TRAIN,0,0
274,TEST,0,0
275,TRAIN,0,0
276,TRAIN,0,0
277,TRAIN,0,0
278,TRAIN,0,0
279,TEST,0,0
280,TRAIN,0,0
281,TRAIN,0,0
282,TRAIN,0,0
283,TRAIN,0,0
284,TRAIN,0,0
285,TRAIN,0,0
286,TRAIN,0,0
287,TEST,0,0
288,TRAIN,0,0
289,TEST,0,0
290,TEST,0,0
291,TEST,0,0
292,TRAIN,0,0
293,TEST,0,0
294,TRAIN,0,0
295,TEST,0,0
296,TEST,0,0
297,TEST,0,0
298,TEST,0,0
299,TEST,0,0
300,TRAIN,0,0
301,TRAIN,0,0
302,TRAIN,0,0
303,TRAIN,0,0
304,TRAIN,0,0
305,TEST,0,0
306,TRAIN,0,0
307,TRAIN,0,0
308,TEST,0,0
309,TEST,0,0
310,TRAIN,0,0
311,TRAIN,0,0
312,TRAIN,0,0
313,TRAIN,0,0
314,TEST,0,0
315,TEST,0,0
316,TRAIN,0,0
317,TRAIN,0,0
318,TEST,0,0
319,TRAIN,0,0
320,TRAIN,0,0
321,TEST,0,0
322,TEST,0,0
323,TRAIN,0,0
324,TEST,0,0
325,TEST,0,0
326,TRAIN,0,0
327,TRAIN,0,0
328,TRAIN,0,0
329,TRAIN,0,0
330,TEST,0,0
331,TRAIN,0,0
332,TEST,0,0
333,TRAIN,0,0
334,TRAIN,0,0
335,TRAIN,0,0
336,TRAIN,0,0
337,TRAIN,0,0
338,TRAIN,0,0
339,TRAIN,0,0
340,TRAIN,0,0
341,TRAIN,0,0
342,TRAIN,0,0
343,TRAIN,0,0
344,TRAIN,0,0
345,TRAIN,0,0
346,TRAIN,0,0
347,TRAIN,0,0
348,TRAIN,0,0
349,TRAIN,0,0
350,TRAIN,0,0
351,TEST,0,0
352,TRAIN,0,0
353,TEST,0,0
354,TEST,0,0
355,TRAIN,0,0
356,TRAIN,0,0
357,TRAIN,0,0
358,TEST,0,0
359,TRAIN,0,0
360,TEST,0,0
361,TRAIN,0,0
362,TRAIN,0,0
363,TRAIN,0,0
364,TRAIN,0,0
365,TRAIN,0,0
366,TEST,0,0
367,TRAIN,0,0
368,TEST,0,0
369,TRAIN,0,0
370,TRAIN,0,0
371,TEST,0,0
372,TRAIN,0,0
373,TRAIN,0,0
374,TRAIN,0,0
375,TRAIN,0,0
376,TEST,0,0
377,TRAIN,0,0
378,TRAIN,0,0
379,TRAIN,0,0
380,TRAIN,0,0
381,TRAIN,0,0
382,TRAIN,0,0
383,TRAIN,0,0
384,TRAIN,0,0
385,TRAIN,0,0
386,TRAIN,0,0
387,TEST,0,0
388,TRAIN,0,0
389,TRAIN,0,0
390,TRAIN,0,0
391,TRAIN,0,0
392,TRAIN,0,0
393,TEST,0,0
394,TRAIN,0,0
395,TRAIN,0,0
396,TRAIN,0,0
397,TRAIN,0,0
398,TRAIN,0,0
399,TRAIN,0,0
400,TRAIN,0,0
401,TRAIN,0,0
402,TEST,0,0
403,TRAIN,0,0
404,TRAIN,0,0
405,TRAIN,0,0
406,TRAIN,0,0
407,TRAIN,0,0
408,TEST,0,0
409,TRAIN,0,0
410,TEST,0,0
411,TRAIN,0,0
412,TRAIN,0,0
413,TRAIN,0,0
414,TEST,0,0
415,TEST,0,0
416,TEST,0,0
417,TRAIN,0,0
418,TEST,0,0
419,TRAIN,0,0
420,TRAIN,0,0
421,TRAIN,0,0
422,TRAIN,0,0
423,TRAIN,0,0
424,TRAIN,0,0
425,TRAIN,0,0
426,TEST,0,0
427,TRAIN,0,0
428,TRAIN,0,0
429,TEST,0,0
430,TRAIN,0,0
431,TRAIN,0,0
432,TEST,0,0
433,TEST,0,0
434,TRAIN,0,0
435,TRAIN,0,0
436,TEST,0,0
437,TRAIN,0,0
438,TEST,0,0
439,TEST,0,0
440,TRAIN,0,0
441,TRAIN,0,0
442,TEST,0,0
443,TEST,0,0
444,TRAIN,0,0
445,TEST,0,0
446,TRAIN,0,0
447,TRAIN,0,0
448,TRAIN,0,0
449,TEST,0,0
450,TEST,0,0
451,TRAIN,0,0
452,TRAIN,0,0
453,TRAIN,0,0
454,TRAIN,0,0
455,TRAIN,0,0
456,TRAIN,0,0
457,TEST,0,0
458,TRAIN,0,0
459,TRAIN,0,0
460,TRAIN,0,0
461,TEST,0,0
462,TRAIN,0,0
463,TEST,0,0
464,TRAIN,0,0
465,TEST,0,0
466,TRAIN,0,0
467,TRAIN,0,0
468,TEST,0,0
469,TRAIN,0,0
470,TRAIN,0,0
471,TEST,0,0
472,TRAIN,0,0
473,TRAIN,0,0
474,TRAIN,0,0
475,TRAIN,0,0
476,TRAIN,0,0
477,TRAIN,0,0
478,TEST,0,0
479,TRAIN,0,0
480,TRAIN,0,0
481,TRAIN,0,0
482,TRAIN,0,0
483,TRAIN,0,0
484,TRAIN,0,0
485,TRAIN,0,0
486,TEST,0,0
487,TRAIN,0,0
488,TRAIN,0,0
489,TRAIN,0,0
490,TEST,0,0
491,TRAIN,0,0
492,TRAIN,0,0
493,TRAIN,0,0
494,TEST,0,0
495,TEST,0,0
496,TRAIN,0,0
497,TEST,0,0
498,TRAIN,0,0
499,TRAIN,0,0
500,TRAIN,0,0
501,TEST,0,0
502,TRAIN,0,0
503,TRAIN,0,0
504,TRAIN,0,0
505,TEST,0,0
506,TEST,0,0
507,TRAIN,0,0
508,TEST,0,0
509,TRAIN,0,0
510,TRAIN,0,0
511,TEST,0,0
512,TRAIN,0,0
513,TRAIN,0,0
514,TRAIN,0,0
515,TRAIN,0,0
516,TRAIN,0,0
517,TRAIN,0,0
518,TRAIN,0,0
519,TRAIN,0,0
520,TRAIN,0,0
521,TRAIN,0,0
522,TRAIN,0,0
523,TRAIN,0,0
524,TRAIN,0,0
525,TRAIN,0,0
526,TRAIN,0,0
527,TEST,0,0
528,TRAIN,0,0
529,TRAIN,0,0
530,TEST,0,0
531,TRAIN,0,0
532,TRAIN,0,0
533,TRAIN,0,0
534,TEST,0,0
535,TRAIN,0,0
536,TRAIN,0,0
537,TRAIN,0,0
538,TEST,0,0
539,TRAIN,0,0
540,TRAIN,0,0
541,TRAIN,0,0
542,TRAIN,0,0
543,TRAIN,0,0
544,TEST,0,0
545,TRAIN,0,0
546,TRAIN,0,0
547,TRAIN,0,0
548,TRAIN,0,0
549,TRAIN,0,0
550,TRAIN,0,0
551,TEST,0,0
552,TRAIN,0,0
553,TRAIN,0,0
554,TRAIN,0,0
555,TEST,0,0
556,TRAIN,0,0
557,TRAIN,0,0
558,TRAIN,0,0
559,TRAIN,0,0
560,TRAIN,0,0
561,TEST,0,0
562,TRAIN,0,0
563,TRAIN,0,0
564,TEST,0,0
565,TRAIN,0,0
566,TRAIN,0,0
567,TEST,0,0
568,TEST,0,0
569,TRAIN,0,0
570,TRAIN,0,0
571,TRAIN,0,0
572,TRAIN,0,0
573,TEST,0,0
574,TRAIN,0,0
575,TRAIN,0,0
576,TEST,0,0
577,TRAIN,0,0
578,TRAIN,0,0
579,TRAIN,0,0
580,TRAIN,0,0
581,TRAIN,0,0
582,TRAIN,0,0
583,TRAIN,0,0
584,TEST,0,0
585,TRAIN,0,0
586,TRAIN,0,0
587,TRAIN,0,0
588,TRAIN,0,0
589,TEST,0,0
590,TRAIN,0,0
591,TRAIN,0,0
592,TRAIN,0,0
593,TRAIN,0,0
594,TEST,0,0
595,TRAIN,0,0
596,TEST,0,0
597,TRAIN,0,0
598,TEST,0,0
599,TEST,0,0
600,TRAIN,0,0
601,TRAIN,0,0
602,TEST,0,0
603,TRAIN,0,0
604,TRAIN,0,0
605,TEST,0,0
606,TRAIN,0,0
607,TRAIN,0,0
608,TRAIN,0,0
609,TRAIN,0,0
610,TRAIN,0,0
611,TRAIN,0,0
612,TRAIN,0,0
613,TRAIN,0,0
614,TRAIN,0,0
615,TRAIN,0,0
616,TRAIN,0,0
617,TRAIN,0,0
618,TEST,0,0
619,TRAIN,0,0
620,TEST,0,0
621,TEST,0,0
622,TRAIN,0,0
623,TRAIN,0,0
624,TRAIN,0,0
625,TRAIN,0,0
626,TEST,0,0
627,TRAIN,0,0
628,TRAIN,0,0
629,TRAIN,0,0
630,TRAIN,0,0
631,TRAIN,0,0
632,TRAIN,0,0
633,TRAIN,0,0
634,TRAIN,0,0
635,TRAIN,0,0
636,TRAIN,0,0
637,TRAIN,0,0
638,TRAIN,0,0
639,TRAIN,0,0
640,TRAIN,0,0
641,TRAIN,0,0
642,TEST,0,0
643,TEST,0,0
644,TRAIN,0,0
645,TRAIN,0,0
646,TRAIN,0,0
647,TEST,0,0
648,TRAIN,0,0
649,TRAIN,0,0
650,TEST,0,0
651,TRAIN,0,0
652,TRAIN,0,0
653,TRAIN,0,0
654,TEST,0,0
655,TEST,0,0
656,TRAIN,0,0
657,TEST,0,0
658,TRAIN,0,0
659,TRAIN,0,0
660,TRAIN,0,0
661,TRAIN,0,0
662,TRAIN,0,0
663,TRAIN,0,0
664,TRAIN,0,0
665,TEST,0,0
666,TRAIN,0,0
667,TRAIN,0,0
668,TEST,0,0
669,TRAIN,0,0
670,TEST,0,0
671,TRAIN,0,0
672,TRAIN,0,0
673,TRAIN,0,0
674,TRAIN,0,0
675,TRAIN,0,0
676,TEST,0,0
677,TEST,0,0
678,TRAIN,0,0
679,TRAIN,0,0
680,TEST,0,0
681,TRAIN,0,0
682,TEST,0,0
683,TEST,0,0
684,TRAIN,0,0
685,TRAIN,0,0
686,TRAIN,0,0
687,TRAIN,0,0
688,TRAIN,0,0
689,TRAIN,0,0
690,TEST,0,0
691,TEST,0,0
692,TRAIN,0,0
693,TEST,0,0
694,TRAIN,0,0
695,TRAIN,0,0
696,TRAIN,0,0
697,TRAIN,0,0
698,TRAIN,0,0
699,TRAIN,0,0
700,TRAIN,0,0
701,TRAIN,0,0
702,TRAIN,0,0
703,TRAIN,0,0
704,TRAIN,0,0
705,TEST,0,0
706,TRAIN,0,0
707,TRAIN,0,0
708,TRAIN,0,0
709,TRAIN,0,0
710,TRAIN,0,0
711,TRAIN,0,0
712,TEST,0,0
713,TRAIN,0,0
714,TRAIN,0,0
715,TRAIN,0,0
716,TRAIN,0,0
717,TRAIN,0,0
718,TEST,0,0
719,TRAIN,0,0
720,TEST,0,0
721,TEST,0,0
722,TRAIN,0,0
723,TRAIN,0,0
724,TRAIN,0,0
725,TRAIN,0,0
726,TRAIN,0,0
727,TRAIN,0,0
728,TRAIN,0,0
729,TRAIN,0,0
730,TRAIN,0,0
731,TEST,0,0
732,TRAIN,0,0
733,TEST,0,0
734,TEST,0,0
735,TRAIN,0,0
736,TEST,0,0
737,TRAIN,0,0
738,TRAIN,0,0
739,TRAIN,0,0
740,TRAIN,0,0
741,TRAIN,0,0
742,TRAIN,0,0
743,TRAIN,0,0
744,TEST,0,0
745,TRAIN,0,0
746,TEST,0,0
747,TRAIN,0,0
748,TRAIN,0,0
749,TRAIN,0,0
750,TRAIN,0,0
751,TEST,0,0
752,TRAIN,0,0
753,TRAIN,0,0
754,TRAIN,0,0
755,TEST,0,0
756,TRAIN,0,0
757,TRAIN,0,0
758,TRAIN,0,0
759,TEST,0,0
760,TRAIN,0,0
761,TEST,0,0
762,TRAIN,0,0
763,TRAIN,0,0
764,TEST,0,0
765,TRAIN,0,0
766,TRAIN,0,0
767,TRAIN,0,0
768,TRAIN,0,0
769,TRAIN,0,0
770,TRAIN,0,0
771,TRAIN,0,0
772,TRAIN,0,0
773,TRAIN,0,0
774,TRAIN,0,0
775,TRAIN,0,0
776,TEST,0,0
777,TRAIN,0,0
778,TRAIN,0,0
779,TRAIN,0,0
780,TRAIN,0,0
781,TRAIN,0,0
782,TRAIN,0,0
783,TEST,0,0
784,TRAIN,0,0
785,TEST,0,0
786,TRAIN,0,0
787,TEST,0,0
788,TRAIN,0,0
789,TRAIN,0,0
790,TEST,0,0
791,TRAIN,0,0
792,TRAIN,0,0
793,TRAIN,0,0
794,TEST,0,0
795,TRAIN,0,0
796,TRAIN,0,0
797,TRAIN,0,0
798,TEST,0,0
799,TRAIN,0,0
800,TEST,0,0
801,TRAIN,0,0
802,TEST,0,0
803,TEST,0,0
804,TRAIN,0,0
805,TEST,0,0
806,TRAIN,0,0
807,TEST,0,0
808,TRAIN,0,0
809,TEST,0,0
810,TEST,0,0
811,TEST,0,0
812,TEST,0,0
813,TRAIN,0,0
814,TRAIN,0,0
815,TRAIN,0,0
816,TRAIN,0,0
817,TEST,0,0
818,TRAIN,0,0
819,TRAIN,0,0
820,TRAIN,0,0
821,TRAIN,0,0
822,TRAIN,0,0
823,TRAIN,0,0
824,TRAIN,0,0
825,TRAIN,0,0
826,TRAIN,0,0
827,TRAIN,0,0
828,TRAIN,0,0
829,TEST,0,0
830,TRAIN,0,0
831,TEST,0,0
832,TRAIN,0,0
833,TRAIN,0,0
834,TRAIN,0,0
835,TRAIN,0,0
836,TRAIN,0,0
837,TRAIN,0,0
838,TEST,0,0
839,TRAIN,0,0
840,TRAIN,0,0
841,TRAIN,0,0
842,TEST,0,0
843,TEST,0,0
844,TRAIN,0,0
845,TRAIN,0,0
846,TRAIN,0,0
847,TRAIN,0,0
848,TRAIN,0,0
849,TRAIN,0,0
850,TRAIN,0,0
851,TRAIN,0,0
852,TRAIN,0,0
853,TRAIN,0,0
854,TRAIN,0,0
855,TRAIN,0,0
856,TEST,0,0
857,TEST,0,0
858,TRAIN,0,0
859,TRAIN,0,0
860,TRAIN,0,0
861,TRAIN,0,0
862,TEST,0,0
863,TRAIN,0,0
864,TRAIN,0,0
865,TEST,0,0
866,TRAIN,0,0
867,TRAIN,0,0
868,TRAIN,0,0
869,TEST,0,0
870,TRAIN,0,0
871,TEST,0,0
872,TRAIN,0,0
873,TRAIN,0,0
874,TRAIN,0,0
875,TRAIN,0,0
876,TRAIN,0,0
877,TEST,0,0
878,TRAIN,0,0
879,TEST,0,0
880,TRAIN,0,0
881,TEST,0,0
882,TRAIN,0,0
883,TRAIN,0,0
884,TRAIN,0,0
885,TRAIN,0,0
886,TRAIN,0,0
887,TRAIN,0,0
888,TEST,0,0
889,TEST,0,0
890,TRAIN,0,0
891,TRAIN,0,0
892,TRAIN,0,0
893,TEST,0,0
894,TRAIN,0,0
895,TRAIN,0,0
896,TRAIN,0,0
897,TEST,0,0
898,TRAIN,0,0
899,TRAIN,0,0
900,TRAIN,0,0
901,TRAIN,0,0
902,TRAIN,0,0
903,TEST,0,0
904,TRAIN,0,0
905,TRAIN,0,0
906,TRAIN,0,0
907,TEST,0,0
908,TEST,0,0
909,TRAIN,0,0
910,TEST,0,0
911,TEST,0,0
912,TEST,0,0
913,TRAIN,0,0
914,TRAIN,0,0
915,TEST,0,0
916,TRAIN,0,0
917,TRAIN,0,0
918,TRAIN,0,0
919,TRAIN,0,0
920,TRAIN,0,0
921,TRAIN,0,0
922,TRAIN,0,0
923,TRAIN,0,0
924,TRAIN,0,0
925,TRAIN,0,0
926,TRAIN,0,0
927,TRAIN,0,0
928,TRAIN,0,0
929,TRAIN,0,0
930,TRAIN,0,0
931,TRAIN,0,0
932,TEST,0,0
933,TRAIN,0,0
934,TRAIN,0,0
935,TRAIN,0,0
936,TRAIN,0,0
937,TEST,0,0
938,TRAIN,0,0
939,TRAIN,0,0
940,TRAIN,0,0
941,TRAIN,0,0
942,TRAIN,0,0
943,TRAIN,0,0
944,TRAIN,0,0
945,TRAIN,0,0
946,TRAIN,0,0
947,TRAIN,0,0
948,TRAIN,0,0
949,TEST,0,0
950,TRAIN,0,0
951,TRAIN,0,0
952,TRAIN,0,0
953,TRAIN,0,0
954,TRAIN,0,0
955,TRAIN,0,0
956,TRAIN,0,0
957,TRAIN,0,0
958,TEST,0,0
959,TRAIN,0,0
960,TEST,0,0
961,TRAIN,0,0
962,TRAIN,0,0
963,TRAIN,0,0
964,TEST,0,0
965,TRAIN,0,0
966,TRAIN,0,0
967,TRAIN,0,0
968,TRAIN,0,0
969,TEST,0,0
970,TRAIN,0,0
971,TRAIN,0,0
972,TRAIN,0,0
973,TRAIN,0,0
974,TRAIN,0,0
975,TRAIN,0,0
976,TRAIN,0,0
977,TRAIN,0,0
978,TEST,0,0
979,TRAIN,0,0
980,TRAIN,0,0
981,TRAIN,0,0
982,TRAIN,0,0
983,TRAIN,0,0
984,TRAIN,0,0
985,TRAIN,0,0
986,TRAIN,0,0
987,TRAIN,0,0
988,TRAIN,0,0
989,TRAIN,0,0
990,TEST,0,0
991,TRAIN,0,0
992,TRAIN,0,0
993,TRAIN,0,0
994,TRAIN,0,0
995,TRAIN,0,0
996,TRAIN,0,0
997,TRAIN,0,0
998,TRAIN,0,0
999,TEST,0,0
1000,TRAIN,0,0
1001,TEST,0,0
1002,TRAIN,0,0
1003,TEST,0,0
1004,TRAIN,0,0
1005,TRAIN,0,0
1006,TEST,0,0
1007,TRAIN,0,0
1008,TRAIN,0,0
1009,TRAIN,0,0
1010,TRAIN,0,0
1011,TRAIN,0,0
1012,TRAIN,0,0
1013,TRAIN,0,0
1014,TRAIN,0,0
1015,TRAIN,0,0
1016,TRAIN,0,0
1017,TEST,0,0
1018,TEST,0,0
1019,TRAIN,0,0
1020,TEST,0,0
1021,TRAIN,0,0
1022,TEST,0,0
1023,TRAIN,0,0
1024,TEST,0,0
1025,TEST,0,0
1026,TRAIN,0,0
1027,TEST,0,0
1028,TRAIN,0,0
1029,TEST,0,0
1030,TRAIN,0,0
1031,TRAIN,0,0
1032,TEST,0,0
1033,TRAIN,0,0
1034,TEST,0,0
1035,TRAIN,0,0
1036,TRAIN,0,0
1037,TRAIN,0,0
1038,TEST,0,0
1039,TRAIN,0,0
1040,TRAIN,0,0
1041,TEST,0,0
1042,TEST,0,0
1043,TRAIN,0,0
1044,TEST,0,0
1045,TRAIN,0,0
1046,TRAIN,0,0
1047,TEST,0,0
1048,TRAIN,0,0
1049,TRAIN,0,0
1050,TRAIN,0,0
1051,TEST,0,0
1052,TEST,0,0
1053,TRAIN,0,0
1054,TRAIN,0,0
1055,TEST,0,0
1056,TEST,0,0
1057,TEST,0,0
1058,TRAIN,0,0
1059,TRAIN,0,0
1060,TRAIN,0,0
1061,TEST,0,0
1062,TRAIN,0,0
1063,TRAIN,0,0
1064,TRAIN,0,0
1065,TRAIN,0,0
1066,TRAIN,0,0
1067,TRAIN,0,0
1068,TEST,0,0
1069,TRAIN,0,0
1070,TRAIN,0,0
1071,TEST,0,0
1072,TRAIN,0,0
1073,TEST,0,0
1074,TEST,0,0
1075,TEST,0,0
1076,TRAIN,0,0
1077,TRAIN,0,0
1078,TRAIN,0,0
1079,TRAIN,0,0
1080,TRAIN,0,0
1081,TRAIN,0,0
1082,TRAIN,0,0
1083,TRAIN,0,0
1084,TEST,0,0
1085,TRAIN,0,0
1086,TRAIN,0,0
1087,TRAIN,0,0
1088,TRAIN,0,0
1089,TRAIN,0,0
1090,TEST,0,0
1091,TRAIN,0,0
1092,TRAIN,0,0
1093,TRAIN,0,0
1094,TEST,0,0
1095,TRAIN,0,0
1096,TRAIN,0,0
1097,TRAIN,0,0
1098,TRAIN,0,0
1099,TRAIN,0,0
1100,TRAIN,0,0
1101,TRAIN,0,0
1102,TRAIN,0,0
1103,TRAIN,0,0
1104,TEST,0,0
1105,TRAIN,0,0
1106,TEST,0,0
1107,TRAIN,0,0
1108,TEST,0,0
1109,TRAIN,0,0
1110,TRAIN,0,0
1111,TRAIN,0,0
1112,TRAIN,0,0
1113,TEST,0,0
1114,TEST,0,0
1115,TRAIN,0,0
1116,TEST,0,0
1117,TEST,0,0
1118,TRAIN,0,0
1119,TRAIN,0,0
1120,TRAIN,0,0
1121,TRAIN,0,0
1122,TRAIN,0,0
1123,TEST,0,0
1124,TRAIN,0,0
1125,TRAIN,0,0
1126,TRAIN,0,0
1127,TRAIN,0,0
1128,TEST,0,0
1129,TRAIN,0,0
1130,TEST,0,0
1131,TRAIN,0,0
1132,TRAIN,0,0
1133,TRAIN,0,0
1134,TRAIN,0,0
1135,TRAIN,0,0
1136,TRAIN,0,0
1137,TRAIN,0,0
1138,TRAIN,0,0
1139,TRAIN,0,0
1140,TRAIN,0,0
1141,TRAIN,0,0
1142,TRAIN,0,0
1143,TRAIN,0,0
1144,TRAIN,0,0
1145,TRAIN,0,0
1146,TEST,0,0
1147,TRAIN,0,0
1148,TRAIN,0,0
1149,TEST,0,0
1150,TRAIN,0,0
1151,TRAIN,0,0
1152,TRAIN,0,0
1153,TRAIN,0,0
1154,TRAIN,0,0
1155,TRAIN,0,0
1156,TRAIN,0,0
1157,TEST,0,0
1158,TEST,0,0
1159,TEST,0,0
1160,TRAIN,0,0
1161,TEST,0,0
1162,TEST,0,0
1163,TEST,0,0
1164,TEST,0,0
1165,TRAIN,0,0
1166,TRAIN,0,0
1167,TRAIN,0,0
1168,TRAIN,0,0
1169,TRAIN,0,0
1170,TRAIN,0,0
1171,TRAIN,0,0
1172,TRAIN,0,0
1173,TEST,0,0
1174,TEST,0,0
1175,TEST,0,0
1176,TEST,0,0
1177,TRAIN,0,0
1178,TEST,0,0
1179,TRAIN,0,0
1180,TEST,0,0
1181,TEST,0,0
1182,TRAIN,0,0
1183,TEST,0,0
1184,TRAIN,0,0
1185,TRAIN,0,0
1186,TEST,0,0
1187,TEST,0,0
1188,TRAIN,0,0
1189,TEST,0,0
1190,TRAIN,0,0
1191,TRAIN,0,0
1192,TEST,0,0
1193,TRAIN,0,0
1194,TRAIN,0,0
1195,TRAIN,0,0
1196,TRAIN,0,0
1197,TRAIN,0,0
1198,TRAIN,0,0
1199,TRAIN,0,0
1200,TEST,0,0
1201,TRAIN,0,0
1202,TRAIN,0,0
1203,TRAIN,0,0
1204,TEST,0,0
1205,TRAIN,0,0
1206,TRAIN,0,0
1207,TEST,0,0
1208,TRAIN,0,0
1209,TRAIN,0,0
1210,TEST,0,0
1211,TRAIN,0,0
1212,TRAIN,0,0
1213,TEST,0,0
1214,TRAIN,0,0
1215,TRAIN,0,0
1216,TEST,0,0
1217,TRAIN,0,0
1218,TRAIN,0,0
1219,TRAIN,0,0
1220,TEST,0,0
1221,TEST,0,0
1222,TEST,0,0
1223,TRAIN,0,0
1224,TRAIN,0,0
1225,TEST,0,0
1226,TRAIN,0,0
1227,TRAIN,0,0
1228,TEST,0,0
1229,TRAIN,0,0
1230,TRAIN,0,0
1231,TRAIN,0,0
1232,TRAIN,0,0
1233,TRAIN,0,0
1234,TRAIN,0,0
1235,TEST,0,0
1236,TRAIN,0,0
1237,TEST,0,0
1238,TRAIN,0,0
1239,TRAIN,0,0
1240,TRAIN,0,0
1241,TRAIN,0,0
1242,TEST,0,0
1243,TRAIN,0,0
1244,TRAIN,0,0
1245,TRAIN,0,0
1246,TRAIN,0,0
1247,TRAIN,0,0
1248,TRAIN,0,0
1249,TRAIN,0,0
1250,TRAIN,0,0
1251,TRAIN,0,0
1252,TRAIN,0,0
1253,TEST,0,0
1254,TRAIN,0,0
1255,TRAIN,0,0
1256,TRAIN,0,0
1257,TEST,0,0
1258,TEST,0,0
1259,TRAIN,0,0
1260,TEST,0,0
1261,TEST,0,0
1262,TRAIN,0,0
1263,TEST,0,0
1264,TRAIN,0,0
1265,TRAIN,0,0
1266,TRAIN,0,0
1267,TRAIN,0,0
1268,TEST,0,0
1269,TRAIN,0,0
1270,TEST,0,0
1271,TRAIN,0,0
1272,TEST,0,0
1273,TRAIN,0,0
1274,TRAIN,0,0
1275,TRAIN,0,0
1276,TRAIN,0,0
1277,TRAIN,0,0
1278,TEST,0,0
1279,TRAIN,0,0
1280,TRAIN,0,0
1281,TEST,0,0
1282,TRAIN,0,0
1283,TRAIN,0,0
1284,TRAIN,0,0
1285,TRAIN,0,0
1286,TRAIN,0,0
1287,TRAIN,0,0
1288,TEST,0,0
1289,TRAIN,0,0
1290,TRAIN,0,0
1291,TRAIN,0,0
1292,TEST,0,0
1293,TEST,0,0
1294,TRAIN,0,0
1295,TEST,0,0
1296,TRAIN,0,0
1297,TRAIN,0,0
1298,TEST,0,0
1299,TEST,0,0
1300,TRAIN,0,0
1301,TRAIN,0,0
1302,TEST,0,0
1303,TRAIN,0,0
1304,TRAIN,0,0
1305,TRAIN,0,0
1306,TRAIN,0,0
1307,TRAIN,0,0
1308,TRAIN,0,0
1309,TRAIN,0,0
1310,TRAIN,0,0
1311,TRAIN,0,0
1312,TRAIN,0,0
1313,TEST,0,0
1314,TRAIN,0,0
1315,TEST,0,0
1316,TRAIN,0,0
1317,TRAIN,0,0
1318,TRAIN,0,0
1319,TRAIN,0,0
1320,TRAIN,0,0
1321,TRAIN,0,0
1322,TEST,0,0
1323,TEST,0,0
1324,TRAIN,0,0
1325,TRAIN,0,0
1326,TRAIN,0,0
1327,TRAIN,0,0
1328,TRAIN,0,0
1329,TRAIN,0,0
1330,TEST,0,0
1331,TRAIN,0,0
1332,TRAIN,0,0
1333,TRAIN,0,0
1334,TRAIN,0,0
1335,TRAIN,0,0
1336,TRAIN,0,0
1337,TRAIN,0,0
1338,TEST,0,0
1339,TRAIN,0,0
1340,TEST,0,0
1341,TRAIN,0,0
1342,TRAIN,0,0
1343,TRAIN,0,0
1344,TEST,0,0
1345,TEST,0,0
1346,TRAIN,0,0
1347,TRAIN,0,0
1348,TRAIN,0,0
1349,TRAIN,0,0
1350,TEST,0,0
1351,TEST,0,0
1352,TRAIN,0,0
1353,TRAIN,0,0
1354,TRAIN,0,0
1355,TRAIN,0,0
1356,TEST,0,0
1357,TRAIN,0,0
1358,TRAIN,0,0
1359,TRAIN,0,0
1360,TRAIN,0,0
1361,TRAIN,0,0
1362,TEST,0,0
1363,TRAIN,0,0
1364,TRAIN,0,0
1365,TRAIN,0,0
1366,TEST,0,0
1367,TRAIN,0,0
1368,TRAIN,0,0
1369,TRAIN,0,0
1370,TEST,0,0
1371,TRAIN,0,0
1372,TRAIN,0,0
1373,TRAIN,0,0
1374,TRAIN,0,0
1375,TRAIN,0,0
1376,TRAIN,0,0
1377,TRAIN,0,0
1378,TEST,0,0
1379,TRAIN,0,0
1380,TRAIN,0,0
1381,TRAIN,0,0
1382,TRAIN,0,0
1383,TRAIN,0,0
1384,TRAIN,0,0
1385,TRAIN,0,0
1386,TRAIN,0,0
1387,TRAIN,0,0
1388,TRAIN,0,0
1389,TRAIN,0,0
1390,TRAIN,0,0
1391,TEST,0,0
1392,TRAIN,0,0
1393,TEST,0,0
1394,TRAIN,0,0
1395,TEST,0,0
1396,TRAIN,0,0
1397,TEST,0,0
1398,TEST,0,0
1399,TRAIN,0,0
1400,TRAIN,0,0
1401,TRAIN,0,0
1402,TEST,0,0
1403,TRAIN,0,0
1404,TRAIN,0,0
1405,TRAIN,0,0
1406,TEST,0,0
1407,TEST,0,0
1408,TRAIN,0,0
1409,TRAIN,0,0
1410,TRAIN,0,0
1411,TEST,0,0
1412,TEST,0,0
1413,TEST,0,0
1414,TRAIN,0,0
1415,TRAIN,0,0
1416,TRAIN,0,0
1417,TEST,0,0
1418,TRAIN,0,0
1419,TEST,0,0
1420,TRAIN,0,0
1421,TEST,0,0
1422,TRAIN,0,0
1423,TRAIN,0,0
1424,TEST,0,0
1425,TRAIN,0,0
1426,TEST,0,0
1427,TEST,0,0
1428,TRAIN,0,0
1429,TEST,0,0
1430,TRAIN,0,0
1431,TRAIN,0,0
1432,TEST,0,0
1433,TRAIN,0,0
1434,TEST,0,0
1435,TRAIN,0,0
1436,TEST,0,0
1437,TEST,0,0
1438,TEST,0,0
1439,TRAIN,0,0
1440,TRAIN,0,0
1441,TRAIN,0,0
1442,TRAIN,0,0
1443,TRAIN,0,0
1444,TEST,0,0
1445,TRAIN,0,0
1446,TRAIN,0,0
1447,TRAIN,0,0
1448,TEST,0,0
1449,TRAIN,0,0
1450,TEST,0,0
1451,TEST,0,0
1452,TRAIN,0,0
1453,TRAIN,0,0
1454,TRAIN,0,0
1455,TEST,0,0
1456,TEST,0,0
1457,TEST,0,0
1458,TRAIN,0,0
1459,TRAIN,0,0
1460,TRAIN,0,0
1461,TEST,0,0
1462,TRAIN,0,0
1463,TRAIN,0,0
1464,TRAIN,0,0
1465,TRAIN,0,0
1466,TRAIN,0,0
1467,TRAIN,0,0
1468,TEST,0,0
1469,TRAIN,0,0
1470,TRAIN,0,0
1471,TRAIN,0,0
1472,TRAIN,0,0
1473,TRAIN,0,0
1474,TRAIN,0,0
1475,TRAIN,0,0
1476,TEST,0,0
1477,TRAIN,0,0
1478,TRAIN,0,0
1479,TEST,0,0
1480,TEST,0,0
1481,TRAIN,0,0
1482,TEST,0,0
1483,TEST,0,0
1484,TRAIN,0,0
1485,TEST,0,0
1486,TRAIN,0,0
1487,TRAIN,0,0
1488,TEST,0,0
1489,TRAIN,0,0
1490,TRAIN,0,0
1491,TEST,0,0
1492,TRAIN,0,0
1493,TRAIN,0,0
1494,TRAIN,0,0
1495,TRAIN,0,0
1496,TRAIN,0,0
1497,TRAIN,0,0
1498,TEST,0,0
1499,TRAIN,0,0
1500,TRAIN,0,0
1501,TRAIN,0,0
1502,TEST,0,0
1503,TEST,0,0
1504,TEST,0,0
1505,TEST,0,0
1506,TRAIN,0,0
1507,TRAIN,0,0
1508,TRAIN,0,0
1509,TRAIN,0,0
1510,TRAIN,0,0
1511,TRAIN,0,0
1512,TEST,0,0
1513,TRAIN,0,0
1514,TRAIN,0,0
1515,TRAIN,0,0
1516,TRAIN,0,0
1517,TRAIN,0,0
1518,TRAIN,0,0
1519,TRAIN,0,0
1520,TRAIN,0,0
1521,TRAIN,0,0
1522,TEST,0,0
1523,TRAIN,0,0
1524,TRAIN,0,0
1525,TRAIN,0,0
1526,TRAIN,0,0
1527,TRAIN,0,0
1528,TRAIN,0,0
1529,TRAIN,0,0
1530,TRAIN,0,0
1531,TRAIN,0,0
1532,TEST,0,0
1533,TEST,0,0
1534,TEST,0,0
1535,TRAIN,0,0
1536,TEST,0,0
1537,TEST,0,0
1538,TRAIN,0,0
1539,TEST,0,0
1540,TRAIN,0,0
1541,TRAIN,0,0
1542,TRAIN,0,0
1543,TEST,0,0
1544,TRAIN,0,0
1545,TRAIN,0,0
1546,TRAIN,0,0
1547,TRAIN,0,0
1548,TRAIN,0,0
1549,TRAIN,0,0
1550,TRAIN,0,0
1551,TRAIN,0,0
1552,TEST,0,0
1553,TRAIN,0,0
1554,TEST,0,0
1555,TRAIN,0,0
1556,TEST,0,0
1557,TEST,0,0
1558,TRAIN,0,0
1559,TRAIN,0,0
1560,TRAIN,0,0
1561,TRAIN,0,0
1562,TRAIN,0,0
1563,TEST,0,0
1564,TEST,0,0
1565,TEST,0,0
1566,TEST,0,0
1567,TRAIN,0,0
1568,TRAIN,0,0
1569,TEST,0,0
1570,TRAIN,0,0
1571,TRAIN,0,0
1572,TEST,0,0
1573,TRAIN,0,0
1574,TRAIN,0,0
1575,TRAIN,0,0
1576,TRAIN,0,0
1577,TRAIN,0,0
1578,TEST,0,0
1579,TRAIN,0,0
1580,TEST,0,0
1581,TRAIN,0,0
1582,TRAIN,0,0
1583,TRAIN,0,0
1584,TRAIN,0,0
1585,TRAIN,0,0
1586,TEST,0,0
1587,TRAIN,0,0
1588,TRAIN,0,0
1589,TEST,0,0
1590,TEST,0,0
1591,TRAIN,0,0
1592,TEST,0,0
1593,TRAIN,0,0
1594,TRAIN,0,0
1595,TRAIN,0,0
1596,TRAIN,0,0
1597,TRAIN,0,0
1598,TEST,0,0
1599,TRAIN,0,0
1600,TRAIN,0,0
1601,TRAIN,0,0
1602,TEST,0,0
1603,TRAIN,0,0
1604,TRAIN,0,0
1605,TRAIN,0,0
1606,TRAIN,0,0
1607,TRAIN,0,0
1608,TRAIN,0,0
1609,TEST,0,0
1610,TEST,0,0
1611,TEST,0,0
1612,TEST,0,0
1613,TRAIN,0,0
1614,TRAIN,0,0
1615,TRAIN,0,0
1616,TRAIN,0,0
1617,TRAIN,0,0
1618,TRAIN,0,0
1619,TRAIN,0,0
1620,TEST,0,0
1621,TEST,0,0
1622,TRAIN,0,0
1623,TRAIN,0,0
1624,TRAIN,0,0
1625,TRAIN,0,0
1626,TRAIN,0,0
1627,TRAIN,0,0
1628,TRAIN,0,0
1629,TRAIN,0,0
1630,TRAIN,0,0
1631,TRAIN,0,0
1632,TRAIN,0,0
1633,TRAIN,0,0
1634,TEST,0,0
1635,TRAIN,0,0
1636,TRAIN,0,0
1637,TRAIN,0,0
1638,TRAIN,0,0
1639,TRAIN,0,0
1640,TRAIN,0,0
1641,TEST,0,0
1642,TRAIN,0,0
1643,TRAIN,0,0
1644,TRAIN,0,0
1645,TRAIN,0,0
1646,TRAIN,0,0
1647,TRAIN,0,0
1648,TRAIN,0,0
1649,TRAIN,0,0
1650,TEST,0,0
1651,TRAIN,0,0
1652,TEST,0,0
1653,TRAIN,0,0
1654,TRAIN,0,0
1655,TRAIN,0,0
1656,TRAIN,0,0
1657,TEST,0,0
1658,TRAIN,0,0
1659,TEST,0,0
1660,TRAIN,0,0
1661,TRAIN,0,0
1662,TEST,0,0
1663,TRAIN,0,0
1664,TRAIN,0,0
1665,TRAIN,0,0
1666,TEST,0,0
1667,TRAIN,0,0
1668,TRAIN,0,0
1669,TRAIN,0,0
1670,TEST,0,0
1671,TRAIN,0,0
1672,TEST,0,0
1673,TRAIN,0,0
1674,TRAIN,0,0
1675,TEST,0,0
1676,TRAIN,0,0
1677,TRAIN,0,0
1678,TRAIN,0,0
1679,TRAIN,0,0
1680,TRAIN,0,0
1681,TRAIN,0,0
1682,TRAIN,0,0
1683,TRAIN,0,0
1684,TEST,0,0
1685,TRAIN,0,0
1686,TRAIN,0,0
1687,TRAIN,0,0
1688,TRAIN,0,0
1689,TRAIN,0,0
1690,TRAIN,0,0
1691,TRAIN,0,0
1692,TRAIN,0,0
1693,TRAIN,0,0
1694,TRAIN,0,0
1695,TRAIN,0,0
1696,TRAIN,0,0
1697,TEST,0,0
1698,TRAIN,0,0
1699,TRAIN,0,0
1700,TRAIN,0,0
1701,TRAIN,0,0
1702,TRAIN,0,0
1703,TRAIN,0,0
1704,TRAIN,0,0
1705,TRAIN,0,0
1706,TRAIN,0,0
1707,TRAIN,0,0
1708,TRAIN,0,0
1709,TRAIN,0,0
1710,TRAIN,0,0
1711,TRAIN,0,0
1712,TRAIN,0,0
1713,TRAIN,0,0
1714,TRAIN,0,0
1715,TRAIN,0,0
1716,TRAIN,0,0
1717,TRAIN,0,0
1718,TRAIN,0,0
1719,TRAIN,0,0
1720,TRAIN,0,0
1721,TEST,0,0
1722,TRAIN,0,0
1723,TEST,0,0
1724,TRAIN,0,0
1725,TRAIN,0,0
1726,TRAIN,0,0
1727,TRAIN,0,0
1728,TRAIN,0,0
1729,TRAIN,0,0
1730,TRAIN,0,0
1731,TRAIN,0,0
1732,TRAIN,0,0
1733,TRAIN,0,0
1734,TRAIN,0,0
1735,TRAIN,0,0
1736,TRAIN,0,0
1737,TRAIN,0,0
1738,TEST,0,0
1739,TEST,0,0
1740,TEST,0,0
1741,TRAIN,0,0
1742,TRAIN,0,0
1743,TRAIN,0,0
1744,TRAIN,0,0
1745,TEST,0,0
1746,TEST,0,0
1747,TEST,0,0
1748,TRAIN,0,0
1749,TRAIN,0,0
1750,TRAIN,0,0
1751,TRAIN,0,0
1752,TEST,0,0
1753,TRAIN,0,0
1754,TRAIN,0,0
1755,TRAIN,0,0
1756,TRAIN,0,0
1757,TRAIN,0,0
1758,TRAIN,0,0
1759,TRAIN,0,0
1760,TEST,0,0
1761,TRAIN,0,0
1762,TRAIN,0,0
1763,TRAIN,0,0
1764,TRAIN,0,0
1765,TEST,0,0
1766,TRAIN,0,0
1767,TEST,0,0
1768,TRAIN,0,0
1769,TRAIN,0,0
1770,TEST,0,0
1771,TRAIN,0,0
1772,TRAIN,0,0
1773,TRAIN,0,0
1774,TRAIN,0,0
1775,TEST,0,0
1776,TRAIN,0,0
1777,TEST,0,0
1778,TEST,0,0
1779,TEST,0,0
1780,TEST,0,0
1781,TRAIN,0,0
1782,TRAIN,0,0
1783,TEST,0,0
1784,TRAIN,0,0
1785,TRAIN,0,0
1786,TEST,0,0
1787,TRAIN,0,0
1788,TEST,0,0
1789,TRAIN,0,0
1790,TRAIN,0,0
1791,TRAIN,0,0
1792,TRAIN,0,0
1793,TEST,0,0
1794,TRAIN,0,0
1795,TRAIN,0,0
1796,TRAIN,0,0
1797,TRAIN,0,0
1798,TRAIN,0,0
1799,TRAIN,0,0
1800,TEST,0,0
1801,TRAIN,0,0
1802,TRAIN,0,0
1803,TRAIN,0,0
1804,TRAIN,0,0
1805,TRAIN,0,0
1806,TRAIN,0,0
1807,TRAIN,0,0
1808,TRAIN,0,0
1809,TRAIN,0,0
1810,TRAIN,0,0
1811,TRAIN,0,0
1812,TEST,0,0
1813,TRAIN,0,0
1814,TRAIN,0,0
1815,TEST,0,0
1816,TRAIN,0,0
1817,TRAIN,0,0
1818,TEST,0,0
1819,TRAIN,0,0
1820,TEST,0,0
1821,TRAIN,0,0
1822,TEST,0,0
1823,TRAIN,0,0
1824,TRAIN,0,0
1825,TRAIN,0,0
1826,TRAIN,0,0
1827,TRAIN,0,0
1828,TRAIN,0,0
1829,TRAIN,0,0
1830,TRAIN,0,0
1831,TEST,0,0
1832,TEST,0,0
1833,TRAIN,0,0
1834,TRAIN,0,0
1835,TRAIN,0,0
1836,TRAIN,0,0
1837,TEST,0,0
1838,TRAIN,0,0
1839,TEST,0,0
1840,TEST,0,0
1841,TRAIN,0,0
1842,TEST,0,0
1843,TRAIN,0,0
1844,TEST,0,0
1845,TRAIN,0,0
1846,TEST,0,0
1847,TRAIN,0,0
1848,TRAIN,0,0
1849,TRAIN,0,0
1850,TRAIN,0,0
1851,TRAIN,0,0
1852,TRAIN,0,0
1853,TRAIN,0,0
1854,TRAIN,0,0
1855,TRAIN,0,0
1856,TRAIN,0,0
1857,TRAIN,0,0
1858,TRAIN,0,0
1859,TEST,0,0
1860,TEST,0,0
1861,TRAIN,0,0
1862,TRAIN,0,0
1863,TRAIN,0,0
1864,TRAIN,0,0
1865,TRAIN,0,0
1866,TRAIN,0,0
1867,TEST,0,0
1868,TRAIN,0,0
1869,TEST,0,0
1870,TRAIN,0,0
1871,TRAIN,0,0
1872,TEST,0,0
1873,TEST,0,0
1874,TEST,0,0
1875,TRAIN,0,0
1876,TEST,0,0
1877,TEST,0,0
1878,TEST,0,0
1879,TRAIN,0,0
1880,TRAIN,0,0
1881,TRAIN,0,0
1882,TEST,0,0
1883,TRAIN,0,0
1884,TRAIN,0,0
1885,TEST,0,0
1886,TRAIN,0,0
1887,TRAIN,0,0
1888,TRAIN,0,0
1889,TRAIN,0,0
1890,TRAIN,0,0
1891,TRAIN,0,0
1892,TRAIN,0,0
1893,TRAIN,0,0
1894,TEST,0,0
1895,TRAIN,0,0
1896,TRAIN,0,0
1897,TRAIN,0,0
1898,TRAIN,0,0
1899,TRAIN,0,0
1900,TRAIN,0,0
1901,TRAIN,0,0
1902,TEST,0,0
1903,TRAIN,0,0
1904,TEST,0,0
1905,TRAIN,0,0
1906,TRAIN,0,0
1907,TEST,0,0
1908,TRAIN,0,0
1909,TRAIN,0,0
1910,TEST,0,0
1911,TRAIN,0,0
1912,TRAIN,0,0
1913,TRAIN,0,0
1914,TRAIN,0,0
1915,TRAIN,0,0
1916,TRAIN,0,0
1917,TRAIN,0,0
1918,TEST,0,0
1919,TEST,0,0
1920,TRAIN,0,0
1921,TEST,0,0
1922,TRAIN,0,0
1923,TEST,0,0
1924,TRAIN,0,0
1925,TRAIN,0,0
1926,TRAIN,0,0
1927,TRAIN,0,0
1928,TRAIN,0,0
1929,TEST,0,0
1930,TRAIN,0,0
1931,TRAIN,0,0
1932,TRAIN,0,0
1933,TRAIN,0,0
1934,TRAIN,0,0
1935,TRAIN,0,0
1936,TRAIN,0,0
1937,TRAIN,0,0
1938,TRAIN,0,0
1939,TRAIN,0,0
1940,TRAIN,0,0
1941,TRAIN,0,0
1942,TRAIN,0,0
1943,TRAIN,0,0
1944,TRAIN,0,0
1945,TRAIN,0,0
1946,TRAIN,0,0
1947,TRAIN,0,0
1948,TEST,0,0
1949,TRAIN,0,0
1950,TRAIN,0,0
1951,TRAIN,0,0
1952,TEST,0,0
1953,TRAIN,0,0
1954,TRAIN,0,0
1955,TRAIN,0,0
1956,TRAIN,0,0
1957,TRAIN,0,0
1958,TRAIN,0,0
1959,TRAIN,0,0
1960,TRAIN,0,0
1961,TEST,0,0
1962,TRAIN,0,0
1963,TRAIN,0,0
1964,TEST,0,0
1965,TEST,0,0
1966,TEST,0,0
1967,TRAIN,0,0
1968,TRAIN,0,0
1969,TRAIN,0,0
1970,TRAIN,0,0
1971,TEST,0,0
1972,TEST,0,0
1973,TEST,0,0
1974,TRAIN,0,0
1975,TRAIN,0,0
1976,TRAIN,0,0
1977,TRAIN,0,0
1978,TRAIN,0,0
1979,TRAIN,0,0
1980,TRAIN,0,0
1981,TRAIN,0,0
1982,TRAIN,0,0
1983,TRAIN,0,0
1984,TRAIN,0,0
1985,TRAIN,0,0
1986,TRAIN,0,0
1987,TRAIN,0,0
1988,TEST,0,0
1989,TRAIN,0,0
1990,TRAIN,0,0
1991,TEST,0,0
1992,TRAIN,0,0
1993,TRAIN,0,0
1994,TRAIN,0,0
1995,TRAIN,0,0
1996,TRAIN,0,0
1997,TRAIN,0,0
1998,TRAIN,0,0
1999,TRAIN,0,0
2000,TRAIN,0,0
2001,TRAIN,0,0
2002,TRAIN,0,0
2003,TRAIN,0,0
2004,TEST,0,0
2005,TEST,0,0
2006,TRAIN,0,0
2007,TRAIN,0,0
2008,TRAIN,0,0
2009,TRAIN,0,0
2010,TRAIN,0,0
2011,TRAIN,0,0
2012,TRAIN,0,0
2013,TRAIN,0,0
2014,TRAIN,0,0
2015,TRAIN,0,0
2016,TRAIN,0,0
2017,TRAIN,0,0
2018,TEST,0,0
2019,TRAIN,0,0
2020,TRAIN,0,0
2021,TRAIN,0,0
2022,TEST,0,0
2023,TEST,0,0
2024,TEST,0,0
2025,TEST,0,0
2026,TRAIN,0,0
2027,TRAIN,0,0
2028,TRAIN,0,0
2029,TEST,0,0
2030,TRAIN,0,0
2031,TRAIN,0,0
2032,TRAIN,0,0
2033,TRAIN,0,0
2034,TRAIN,0,0
2035,TRAIN,0,0
2036,TRAIN,0,0
2037,TEST,0,0
2038,TRAIN,0,0
2039,TRAIN,0,0
2040,TRAIN,0,0
2041,TRAIN,0,0
2042,TEST,0,0
2043,TRAIN,0,0
2044,TRAIN,0,0
2045,TRAIN,0,0
2046,TRAIN,0,0
2047,TRAIN,0,0
2048,TRAIN,0,0
2049,TRAIN,0,0
2050,TRAIN,0,0
2051,TRAIN,0,0
2052,TRAIN,0,0
2053,TRAIN,0,0
2054,TRAIN,0,0
2055,TRAIN,0,0
2056,TRAIN,0,0
2057,TRAIN,0,0
2058,TRAIN,0,0
2059,TRAIN,0,0
2060,TRAIN,0,0
2061,TRAIN,0,0
2062,TRAIN,0,0
2063,TRAIN,0,0
2064,TRAIN,0,0
2065,TRAIN,0,0
2066,TRAIN,0,0
2067,TRAIN,0,0
2068,TRAIN,0,0
2069,TEST,0,0
2070,TRAIN,0,0
2071,TRAIN,0,0
2072,TRAIN,0,0
2073,TEST,0,0
2074,TRAIN,0,0
2075,TRAIN,0,0
2076,TRAIN,0,0
2077,TRAIN,0,0
2078,TEST,0,0
2079,TRAIN,0,0
2080,TRAIN,0,0
2081,TRAIN,0,0
2082,TRAIN,0,0
2083,TRAIN,0,0
2084,TRAIN,0,0
2085,TRAIN,0,0
2086,TEST,0,0
2087,TRAIN,0,0
2088,TEST,0,0
2089,TRAIN,0,0
2090,TEST,0,0
2091,TRAIN,0,0
2092,TRAIN,0,0
2093,TRAIN,0,0
2094,TRAIN,0,0
2095,TRAIN,0,0
2096,TEST,0,0
2097,TRAIN,0,0
2098,TRAIN,0,0
2099,TEST,0,0
2100,TRAIN,0,0
2101,TRAIN,0,0
2102,TEST,0,0
2103,TRAIN,0,0
2104,TRAIN,0,0
2105,TRAIN,0,0
2106,TRAIN,0,0
2107,TRAIN,0,0
2108,TRAIN,0,0
2109,TRAIN,0,0
2110,TEST,0,0
2111,TRAIN,0,0
2112,TEST,0,0
2113,TRAIN,0,0
2114,TRAIN,0,0
2115,TRAIN,0,0
2116,TRAIN,0,0
2117,TRAIN,0,0
2118,TRAIN,0,0
2119,TRAIN,0,0
2120,TRAIN,0,0
2121,TEST,0,0
2122,TRAIN,0,0
2123,TRAIN,0,0
2124,TRAIN,0,0
2125,TRAIN,0,0
2126,TRAIN,0,0
2127,TEST,0,0
2128,TRAIN,0,0
2129,TRAIN,0,0
2130,TRAIN,0,0
2131,TRAIN,0,0
2132,TRAIN,0,0
2133,TRAIN,0,0
2134,TRAIN,0,0
2135,TRAIN,0,0
2136,TRAIN,0,0
2137,TRAIN,0,0
2138,TRAIN,0,0
2139,TRAIN,0,0
2140,TRAIN,0,0
2141,TRAIN,0,0
2142,TRAIN,0,0
2143,TRAIN,0,0
2144,TRAIN,0,0
2145,TRAIN,0,0
2146,TEST,0,0
2147,TRAIN,0,0
2148,TRAIN,0,0
2149,TRAIN,0,0
2150,TRAIN,0,0
2151,TRAIN,0,0
2152,TRAIN,0,0
2153,TRAIN,0,0
2154,TEST,0,0
2155,TRAIN,0,0
2156,TRAIN,0,0
2157,TEST,0,0
2158,TRAIN,0,0
2159,TEST,0,0
2160,TRAIN,0,0
2161,TRAIN,0,0
2162,TRAIN,0,0
2163,TRAIN,0,0
2164,TEST,0,0
2165,TRAIN,0,0
2166,TRAIN,0,0
2167,TRAIN,0,0
2168,TEST,0,0
2169,TRAIN,0,0
2170,TEST,0,0
2171,TEST,0,0
2172,TRAIN,0,0
2173,TRAIN,0,0
2174,TRAIN,0,0
2175,TRAIN,0,0
2176,TEST,0,0
2177,TRAIN,0,0
2178,TRAIN,0,0
2179,TEST,0,0
2180,TRAIN,0,0
2181,TEST,0,0
2182,TEST,0,0
2183,TRAIN,0,0
2184,TRAIN,0,0
2185,TEST,0,0
2186,TRAIN,0,0
2187,TRAIN,0,0
2188,TRAIN,0,0
2189,TRAIN,0,0
2190,TRAIN,0,0
2191,TEST,0,0
2192,TRAIN,0,0
2193,TRAIN,0,0
2194,TRAIN,0,0
2195,TEST,0,0
2196,TEST,0,0
2197,TRAIN,0,0
2198,TRAIN,0,0
2199,TRAIN,0,0
2200,TRAIN,0,0
2201,TRAIN,0,0
2202,TEST,0,0
2203,TRAIN,0,0
2204,TRAIN,0,0
2205,TRAIN,0,0
2206,TEST,0,0
2207,TRAIN,0,0
2208,TRAIN,0,0
2209,TRAIN,0,0
2210,TRAIN,0,0
2211,TRAIN,0,0
2212,TRAIN,0,0
2213,TEST,0,0
2214,TRAIN,0,0
2215,TRAIN,0,0
2216,TEST,0,0
2217,TRAIN,0,0
2218,TEST,0,0
2219,TRAIN,0,0
2220,TRAIN,0,0
2221,TRAIN,0,0
2222,TEST,0,0
2223,TEST,0,0
2224,TRAIN,0,0
2225,TEST,0,0
2226,TRAIN,0,0
2227,TRAIN,0,0
2228,TRAIN,0,0
2229,TRAIN,0,0
2230,TEST,0,0
2231,TRAIN,0,0
2232,TEST,0,0
2233,TEST,0,0
2234,TRAIN,0,0
2235,TRAIN,0,0
2236,TEST,0,0
2237,TRAIN,0,0
2238,TRAIN,0,0
2239,TRAIN,0,0
2240,TEST,0,0
2241,TRAIN,0,0
2242,TRAIN,0,0
2243,TRAIN,0,0
2244,TRAIN,0,0
2245,TRAIN,0,0
2246,TRAIN,0,0
2247,TEST,0,0
2248,TRAIN,0,0
2249,TRAIN,0,0
2250,TEST,0,0
2251,TRAIN,0,0
2252,TEST,0,0
2253,TRAIN,0,0
2254,TRAIN,0,0
2255,TRAIN,0,0
2256,TRAIN,0,0
2257,TRAIN,0,0
2258,TEST,0,0
2259,TEST,0,0
2260,TRAIN,0,0
2261,TRAIN,0,0
2262,TRAIN,0,0
2263,TRAIN,0,0
2264,TRAIN,0,0
2265,TRAIN,0,0
2266,TEST,0,0
2267,TRAIN,0,0
2268,TEST,0,0
2269,TEST,0,0
2270,TRAIN,0,0
2271,TRAIN,0,0
2272,TRAIN,0,0
2273,TRAIN,0,0
2274,TRAIN,0,0
2275,TRAIN,0,0
2276,TRAIN,0,0
2277,TRAIN,0,0
2278,TRAIN,0,0
2279,TRAIN,0,0
2280,TRAIN,0,0
2281,TEST,0,0
2282,TEST,0,0
2283,TRAIN,0,0
2284,TRAIN,0,0
2285,TEST,0,0
2286,TRAIN,0,0
2287,TRAIN,0,0
2288,TEST,0,0
2289,TRAIN,0,0
2290,TEST,0,0
2291,TRAIN,0,0
2292,TEST,0,0
2293,TRAIN,0,0
2294,TRAIN,0,0
2295,TEST,0,0
2296,TRAIN,0,0
2297,TRAIN,0,0
2298,TEST,0,0
2299,TRAIN,0,0
2300,TRAIN,0,0
2301,TRAIN,0,0
2302,TEST,0,0
2303,TRAIN,0,0
2304,TEST,0,0
2305,TRAIN,0,0
2306,TRAIN,0,0
2307,TEST,0,0
2308,TRAIN,0,0
2309,TRAIN,0,0
2310,TRAIN,0,0
2311,TRAIN,0,0
2312,TEST,0,0
2313,TRAIN,0,0
2314,TRAIN,0,0
2315,TRAIN,0,0
2316,TEST,0,0
2317,TRAIN,0,0
2318,TRAIN,0,0
2319,TRAIN,0,0
2320,TRAIN,0,0
2321,TRAIN,0,0
2322,TRAIN,0,0
2323,TEST,0,0
2324,TRAIN,0,0
2325,TEST,0,0
2326,TRAIN,0,0
2327,TRAIN,0,0
2328,TEST,0,0
2329,TEST,0,0
2330,TRAIN,0,0
2331,TRAIN,0,0
2332,TRAIN,0,0
2333,TRAIN,0,0
2334,TRAIN,0,0
2335,TRAIN,0,0
2336,TRAIN,0,0
2337,TRAIN,0,0
2338,TRAIN,0,0
2339,TEST,0,0
2340,TRAIN,0,0
2341,TRAIN,0,0
2342,TEST,0,0
2343,TRAIN,0,0
2344,TEST,0,0
2345,TRAIN,0,0
2346,TRAIN,0,0
2347,TRAIN,0,0
2348,TRAIN,0,0
2349,TRAIN,0,0
2350,TRAIN,0,0
2351,TRAIN,0,0
2352,TRAIN,0,0
2353,TRAIN,0,0
2354,TRAIN,0,0
2355,TEST,0,0
2356,TRAIN,0,0
2357,TRAIN,0,0
2358,TRAIN,0,0
2359,TEST,0,0
2360,TRAIN,0,0
2361,TRAIN,0,0
2362,TRAIN,0,0
2363,TRAIN,0,0
2364,TRAIN,0,0
2365,TRAIN,0,0
2366,TRAIN,0,0
2367,TEST,0,0
2368,TRAIN,0,0
2369,TEST,0,0
2370,TEST,0,0
2371,TRAIN,0,0
2372,TRAIN,0,0
2373,TRAIN,0,0
2374,TEST,0,0
2375,TRAIN,0,0
2376,TRAIN,0,0
2377,TEST,0,0
2378,TEST,0,0
2379,TRAIN,0,0
2380,TRAIN,0,0
2381,TEST,0,0
2382,TRAIN,0,0
2383,TRAIN,0,0
2384,TEST,0,0
2385,TRAIN,0,0
2386,TRAIN,0,0
2387,TRAIN,0,0
2388,TRAIN,0,0
2389,TRAIN,0,0
2390,TRAIN,0,0
2391,TRAIN,0,0
2392,TEST,0,0
2393,TRAIN,0,0
2394,TRAIN,0,0
2395,TRAIN,0,0
2396,TRAIN,0,0
2397,TRAIN,0,0
2398,TRAIN,0,0
2399,TRAIN,0,0
2400,TRAIN,0,0
2401,TRAIN,0,0
2402,TEST,0,0
2403,TRAIN,0,0
2404,TRAIN,0,0
2405,TRAIN,0,0
2406,TEST,0,0
2407,TEST,0,0
2408,TRAIN,0,0
2409,TEST,0,0
2410,TRAIN,0,0
2411,TEST,0,0
2412,TRAIN,0,0
2413,TRAIN,0,0
2414,TEST,0,0
2415,TEST,0,0
2416,TEST,0,0
2417,TEST,0,0
2418,TRAIN,0,0
2419,TRAIN,0,0
2420,TRAIN,0,0
2421,TRAIN,0,0
2422,TRAIN,0,0
2423,TRAIN,0,0
2424,TRAIN,0,0
2425,TRAIN,0,0
2426,TRAIN,0,0
2427,TRAIN,0,0
2428,TRAIN,0,0
2429,TRAIN,0,0
2430,TRAIN,0,0
2431,TRAIN,0,0
2432,TRAIN,0,0
2433,TRAIN,0,0
2434,TRAIN,0,0
2435,TRAIN,0,0
2436,TEST,0,0
2437,TEST,0,0
2438,TRAIN,0,0
2439,TRAIN,0,0
2440,TRAIN,0,0
2441,TRAIN,0,0
2442,TEST,0,0
2443,TRAIN,0,0
2444,TRAIN,0,0
2445,TRAIN,0,0
2446,TEST,0,0
2447,TEST,0,0
2448,TRAIN,0,0
2449,TRAIN,0,0
2450,TEST,0,0
2451,TEST,0,0
2452,TRAIN,0,0
2453,TEST,0,0
2454,TRAIN,0,0
2455,TRAIN,0,0
2456,TEST,0,0
2457,TRAIN,0,0
2458,TRAIN,0,0
2459,TRAIN,0,0
2460,TRAIN,0,0
2461,TRAIN,0,0
2462,TRAIN,0,0
2463,TEST,0,0
2464,TRAIN,0,0
2465,TEST,0,0
2466,TRAIN,0,0
2467,TRAIN,0,0
2468,TRAIN,0,0
2469,TRAIN,0,0
2470,TRAIN,0,0
2471,TEST,0,0
2472,TRAIN,0,0
2473,TEST,0,0
2474,TRAIN,0,0
2475,TRAIN,0,0
2476,TEST,0,0
2477,TRAIN,0,0
2478,TEST,0,0
2479,TRAIN,0,0
2480,TEST,0,0
2481,TEST,0,0
2482,TRAIN,0,0
2483,TRAIN,0,0
2484,TRAIN,0,0
2485,TRAIN,0,0
2486,TRAIN,0,0
2487,TEST,0,0
2488,TRAIN,0,0
2489,TRAIN,0,0
2490,TRAIN,0,0
2491,TRAIN,0,0
2492,TRAIN,0,0
2493,TEST,0,0
2494,TRAIN,0,0
2495,TRAIN,0,0
2496,TEST,0,0
2497,TRAIN,0,0
2498,TEST,0,0
2499,TEST,0,0
2500,TRAIN,0,0
2501,TRAIN,0,0
2502,TRAIN,0,0
2503,TEST,0,0
2504,TRAIN,0,0
2505,TRAIN,0,0
2506,TRAIN,0,0
2507,TRAIN,0,0
2508,TRAIN,0,0
2509,TRAIN,0,0
2510,TRAIN,0,0
2511,TRAIN,0,0
2512,TRAIN,0,0
2513,TRAIN,0,0
2514,TRAIN,0,0
2515,TRAIN,0,0
2516,TRAIN,0,0
2517,TEST,0,0
2518,TRAIN,0,0
2519,TRAIN,0,0
2520,TEST,0,0
2521,TRAIN,0,0
2522,TRAIN,0,0
2523,TRAIN,0,0
2524,TRAIN,0,0
2525,TEST,0,0
2526,TEST,0,0
2527,TRAIN,0,0
2528,TEST,0,0
2529,TRAIN,0,0
2530,TEST,0,0
2531,TRAIN,0,0
2532,TRAIN,0,0
2533,TRAIN,0,0
2534,TEST,0,0
2535,TRAIN,0,0
2536,TRAIN,0,0
2537,TRAIN,0,0
2538,TRAIN,0,0
2539,TRAIN,0,0
2540,TRAIN,0,0
2541,TRAIN,0,0
2542,TRAIN,0,0
2543,TEST,0,0
2544,TRAIN,0,0
2545,TEST,0,0
2546,TRAIN,0,0
2547,TEST,0,0
2548,TEST,0,0
2549,TRAIN,0,0
2550,TRAIN,0,0
2551,TRAIN,0,0
2552,TEST,0,0
2553,TRAIN,0,0
2554,TRAIN,0,0
2555,TRAIN,0,0
2556,TRAIN,0,0
2557,TRAIN,0,0
2558,TRAIN,0,0
2559,TRAIN,0,0
2560,TRAIN,0,0
2561,TRAIN,0,0
2562,TEST,0,0
2563,TRAIN,0,0
2564,TEST,0,0
2565,TRAIN,0,0
2566,TRAIN,0,0
2567,TEST,0,0
2568,TRAIN,0,0
2569,TRAIN,0,0
2570,TEST,0,0
2571,TRAIN,0,0
2572,TEST,0,0
2573,TRAIN,0,0
2574,TRAIN,0,0
2575,TRAIN,0,0
2576,TRAIN,0,0
2577,TEST,0,0
2578,TEST,0,0
2579,TRAIN,0,0
2580,TRAIN,0,0
2581,TRAIN,0,0
2582,TRAIN,0,0
2583,TRAIN,0,0
2584,TEST,0,0
2585,TRAIN,0,0
2586,TRAIN,0,0
2587,TEST,0,0
2588,TRAIN,0,0
2589,TRAIN,0,0
2590,TRAIN,0,0
2591,TEST,0,0
2592,TEST,0,0
2593,TRAIN,0,0
2594,TEST,0,0
2595,TRAIN,0,0
2596,TRAIN,0,0
2597,TRAIN,0,0
2598,TRAIN,0,0
2599,TRAIN,0,0
2600,TRAIN,0,0
2601,TRAIN,0,0
2602,TRAIN,0,0
2603,TRAIN,0,0
2604,TRAIN,0,0
2605,TEST,0,0
2606,TEST,0,0
2607,TRAIN,0,0
2608,TRAIN,0,0
2609,TEST,0,0
2610,TEST,0,0
2611,TRAIN,0,0
2612,TRAIN,0,0
2613,TRAIN,0,0
2614,TRAIN,0,0
2615,TEST,0,0
2616,TRAIN,0,0
2617,TRAIN,0,0
2618,TRAIN,0,0
2619,TRAIN,0,0
2620,TRAIN,0,0
2621,TRAIN,0,0
2622,TRAIN,0,0
2623,TEST,0,0
2624,TRAIN,0,0
2625,TRAIN,0,0
2626,TRAIN,0,0
2627,TRAIN,0,0
2628,TEST,0,0
2629,TRAIN,0,0
2630,TEST,0,0
2631,TEST,0,0
2632,TRAIN,0,0
2633,TEST,0,0
2634,TEST,0,0
2635,TRAIN,0,0
2636,TRAIN,0,0
2637,TRAIN,0,0
2638,TEST,0,0
2639,TRAIN,0,0
2640,TRAIN,0,0
2641,TRAIN,0,0
2642,TRAIN,0,0
2643,TRAIN,0,0
2644,TEST,0,0
2645,TRAIN,0,0
2646,TEST,0,0
2647,TEST,0,0
2648,TRAIN,0,0
2649,TEST,0,0
2650,TEST,0,0
2651,TEST,0,0
2652,TRAIN,0,0
2653,TEST,0,0
2654,TEST,0,0
2655,TRAIN,0,0
2656,TRAIN,0,0
2657,TRAIN,0,0
2658,TEST,0,0
2659,TEST,0,0
2660,TRAIN,0,0
2661,TRAIN,0,0
2662,TRAIN,0,0
2663,TRAIN,0,0
2664,TEST,0,0
2665,TRAIN,0,0
2666,TRAIN,0,0
2667,TRAIN,0,0
2668,TRAIN,0,0
2669,TEST,0,0
2670,TRAIN,0,0
2671,TRAIN,0,0
2672,TEST,0,0
2673,TRAIN,0,0
2674,TRAIN,0,0
2675,TRAIN,0,0
2676,TRAIN,0,0
2677,TEST,0,0
2678,TRAIN,0,0
2679,TRAIN,0,0
2680,TEST,0,0
2681,TRAIN,0,0
2682,TRAIN,0,0
2683,TRAIN,0,0
2684,TRAIN,0,0
2685,TEST,0,0
2686,TRAIN,0,0
2687,TRAIN,0,0
2688,TEST,0,0
2689,TRAIN,0,0
2690,TRAIN,0,0
2691,TRAIN,0,0
2692,TRAIN,0,0
2693,TRAIN,0,0
2694,TEST,0,0
2695,TRAIN,0,0
2696,TEST,0,0
2697,TEST,0,0
2698,TEST,0,0
2699,TRAIN,0,0
2700,TRAIN,0,0
2701,TRAIN,0,0
2702,TEST,0,0
2703,TRAIN,0,0
2704,TRAIN,0,0
2705,TRAIN,0,0
2706,TRAIN,0,0
2707,TRAIN,0,0
2708,TRAIN,0,0
2709,TRAIN,0,0
2710,TRAIN,0,0
2711,TRAIN,0,0
2712,TRAIN,0,0
2713,TRAIN,0,0
2714,TEST,0,0
2715,TRAIN,0,0
2716,TEST,0,0
2717,TRAIN,0,0
2718,TEST,0,0
2719,TRAIN,0,0
2720,TRAIN,0,0
2721,TEST,0,0
2722,TEST,0,0
2723,TRAIN,0,0
2724,TRAIN,0,0
2725,TRAIN,0,0
2726,TRAIN,0,0
2727,TEST,0,0
2728,TRAIN,0,0
2729,TRAIN,0,0
2730,TRAIN,0,0
2731,TRAIN,0,0
2732,TRAIN,0,0
2733,TRAIN,0,0
2734,TRAIN,0,0
2735,TRAIN,0,0
2736,TEST,0,0
2737,TRAIN,0,0
2738,TRAIN,0,0
2739,TRAIN,0,0
2740,TEST,0,0
2741,TRAIN,0,0
2742,TRAIN,0,0
2743,TRAIN,0,0
2744,TRAIN,0,0
2745,TRAIN,0,0
2746,TRAIN,0,0
2747,TRAIN,0,0
2748,TRAIN,0,0
2749,TEST,0,0
2750,TRAIN,0,0
2751,TRAIN,0,0
2752,TEST,0,0
2753,TRAIN,0,0
2754,TRAIN,0,0
2755,TEST,0,0
2756,TRAIN,0,0
2757,TEST,0,0
2758,TEST,0,0
2759,TEST,0,0
2760,TRAIN,0,0
2761,TRAIN,0,0
2762,TRAIN,0,0
2763,TEST,0,0
2764,TEST,0,0
2765,TRAIN,0,0
2766,TRAIN,0,0
2767,TEST,0,0
2768,TRAIN,0,0
2769,TRAIN,0,0
2770,TRAIN,0,0
2771,TRAIN,0,0
2772,TEST,0,0
2773,TRAIN,0,0
2774,TRAIN,0,0
2775,TRAIN,0,0
2776,TRAIN,0,0
2777,TRAIN,0,0
2778,TRAIN,0,0
2779,TRAIN,0,0
2780,TRAIN,0,0
2781,TRAIN,0,0
2782,TRAIN,0,0
2783,TRAIN,0,0
2784,TRAIN,0,0
2785,TRAIN,0,0
2786,TRAIN,0,0
2787,TRAIN,0,0
2788,TEST,0,0
2789,TRAIN,0,0
2790,TRAIN,0,0
2791,TRAIN,0,0
2792,TEST,0,0
2793,TRAIN,0,0
2794,TRAIN,0,0
2795,TRAIN,0,0
2796,TEST,0,0
2797,TRAIN,0,0
2798,TEST,0,0
2799,TRAIN,0,0
2800,TEST,0,0
2801,TEST,0,0
2802,TRAIN,0,0
2803,TEST,0,0
2804,TEST,0,0
2805,TEST,0,0
2806,TRAIN,0,0
2807,TRAIN,0,0
2808,TRAIN,0,0
2809,TRAIN,0,0
2810,TEST,0,0
2811,TRAIN,0,0
2812,TEST,0,0
2813,TRAIN,0,0
2814,TRAIN,0,0
2815,TRAIN,0,0
2816,TRAIN,0,0
2817,TEST,0,0
2818,TRAIN,0,0
2819,TRAIN,0,0
2820,TRAIN,0,0
2821,TRAIN,0,0
2822,TRAIN,0,0
2823,TRAIN,0,0
2824,TRAIN,0,0
2825,TEST,0,0
2826,TRAIN,0,0
2827,TRAIN,0,0
2828,TRAIN,0,0
2829,TRAIN,0,0
2830,TEST,0,0
2831,TRAIN,0,0
2832,TRAIN,0,0
2833,TRAIN,0,0
2834,TRAIN,0,0
2835,TRAIN,0,0
2836,TEST,0,0
2837,TRAIN,0,0
2838,TRAIN,0,0
2839,TRAIN,0,0
2840,TRAIN,0,0
2841,TRAIN,0,0
2842,TRAIN,0,0
2843,TEST,0,0
2844,TRAIN,0,0
2845,TRAIN,0,0
2846,TEST,0,0
2847,TRAIN,0,0
2848,TRAIN,0,0
2849,TRAIN,0,0
2850,TEST,0,0
2851,TRAIN,0,0
2852,TRAIN,0,0
2853,TRAIN,0,0
2854,TRAIN,0,0
2855,TEST,0,0
2856,TRAIN,0,0
2857,TEST,0,0
2858,TRAIN,0,0
2859,TRAIN,0,0
2860,TEST,0,0
2861,TRAIN,0,0
2862,TRAIN,0,0
2863,TEST,0,0
2864,TRAIN,0,0
2865,TRAIN,0,0
2866,TRAIN,0,0
2867,TRAIN,0,0
2868,TRAIN,0,0
2869,TRAIN,0,0
2870,TRAIN,0,0
2871,TRAIN,0,0
2872,TRAIN,0,0
2873,TEST,0,0
2874,TRAIN,0,0
2875,TRAIN,0,0
2876,TEST,0,0
2877,TRAIN,0,0
2878,TRAIN,0,0
2879,TRAIN,0,0
2880,TRAIN,0,0
2881,TEST,0,0
2882,TRAIN,0,0
2883,TRAIN,0,0
2884,TRAIN,0,0
2885,TRAIN,0,0
2886,TRAIN,0,0
2887,TEST,0,0
2888,TRAIN,0,0
2889,TRAIN,0,0
2890,TRAIN,0,0
2891,TRAIN,0,0
2892,TRAIN,0,0
2893,TRAIN,0,0
2894,TRAIN,0,0
2895,TRAIN,0,0
2896,TRAIN,0,0
2897,TRAIN,0,0
2898,TRAIN,0,0
2899,TRAIN,0,0
2900,TRAIN,0,0
2901,TRAIN,0,0
2902,TRAIN,0,0
2903,TRAIN,0,0
2904,TRAIN,0,0
2905,TRAIN,0,0
2906,TRAIN,0,0
2907,TRAIN,0,0
2908,TRAIN,0,0
2909,TRAIN,0,0
2910,TRAIN,0,0
2911,TRAIN,0,0
2912,TRAIN,0,0
2913,TRAIN,0,0
2914,TRAIN,0,0
2915,TRAIN,0,0
2916,TRAIN,0,0
2917,TRAIN,0,0
2918,TEST,0,0
2919,TRAIN,0,0
2920,TEST,0,0
2921,TRAIN,0,0
2922,TEST,0,0
2923,TRAIN,0,0
2924,TRAIN,0,0
2925,TRAIN,0,0
2926,TRAIN,0,0
2927,TEST,0,0
2928,TRAIN,0,0
2929,TRAIN,0,0
2930,TRAIN,0,0
2931,TRAIN,0,0
2932,TRAIN,0,0
2933,TRAIN,0,0
2934,TEST,0,0
2935,TRAIN,0,0
2936,TRAIN,0,0
2937,TRAIN,0,0
2938,TRAIN,0,0
2939,TRAIN,0,0
2940,TRAIN,0,0
2941,TEST,0,0
2942,TRAIN,0,0
2943,TRAIN,0,0
2944,TRAIN,0,0
2945,TRAIN,0,0
2946,TRAIN,0,0
2947,TRAIN,0,0
2948,TEST,0,0
2949,TRAIN,0,0
2950,TRAIN,0,0
2951,TRAIN,0,0
2952,TRAIN,0,0
2953,TEST,0,0
2954,TRAIN,0,0
2955,TRAIN,0,0
2956,TRAIN,0,0
2957,TRAIN,0,0
2958,TRAIN,0,0
2959,TRAIN,0,0
2960,TRAIN,0,0
2961,TRAIN,0,0
2962,TEST,0,0
2963,TEST,0,0
2964,TEST,0,0
2965,TRAIN,0,0
2966,TRAIN,0,0
2967,TRAIN,0,0
2968,TRAIN,0,0
2969,TRAIN,0,0
2970,TRAIN,0,0
2971,TEST,0,0
2972,TRAIN,0,0
2973,TRAIN,0,0
2974,TRAIN,0,0
2975,TRAIN,0,0
2976,TRAIN,0,0
2977,TRAIN,0,0
2978,TRAIN,0,0
2979,TRAIN,0,0
2980,TRAIN,0,0
2981,TRAIN,0,0
2982,TRAIN,0,0
2983,TRAIN,0,0
2984,TRAIN,0,0
2985,TEST,0,0
2986,TRAIN,0,0
2987,TEST,0,0
2988,TRAIN,0,0
2989,TRAIN,0,0
2990,TEST,0,0
2991,TRAIN,0,0
2992,TRAIN,0,0
2993,TRAIN,0,0
2994,TRAIN,0,0
2995,TRAIN,0,0
2996,TRAIN,0,0
2997,TRAIN,0,0
2998,TRAIN,0,0
2999,TRAIN,0,0
3000,TEST,0,0
3001,TRAIN,0,0
3002,TRAIN,0,0
3003,TRAIN,0,0
3004,TEST,0,0
3005,TRAIN,0,0
3006,TRAIN,0,0
3007,TRAIN,0,0
3008,TRAIN,0,0
3009,TRAIN,0,0
3010,TRAIN,0,0
3011,TRAIN,0,0
3012,TRAIN,0,0
3013,TEST,0,0
3014,TRAIN,0,0
3015,TRAIN,0,0
3016,TRAIN,0,0
3017,TRAIN,0,0
3018,TRAIN,0,0
3019,TRAIN,0,0
3020,TRAIN,0,0
3021,TRAIN,0,0
3022,TRAIN,0,0
3023,TRAIN,0,0
3024,TRAIN,0,0
3025,TRAIN,0,0
3026,TRAIN,0,0
3027,TRAIN,0,0
3028,TRAIN,0,0
3029,TRAIN,0,0
3030,TRAIN,0,0
3031,TRAIN,0,0
3032,TRAIN,0,0
3033,TRAIN,0,0
3034,TEST,0,0
3035,TEST,0,0
3036,TRAIN,0,0
3037,TRAIN,0,0
3038,TEST,0,0
3039,TRAIN,0,0
3040,TRAIN,0,0
3041,TRAIN,0,0
3042,TRAIN,0,0
3043,TEST,0,0
3044,TRAIN,0,0
3045,TRAIN,0,0
3046,TRAIN,0,0
3047,TRAIN,0,0
3048,TEST,0,0
3049,TRAIN,0,0
3050,TRAIN,0,0
3051,TRAIN,0,0
3052,TRAIN,0,0
3053,TEST,0,0
3054,TRAIN,0,0
3055,TRAIN,0,0
3056,TRAIN,0,0
3057,TRAIN,0,0
3058,TRAIN,0,0
3059,TRAIN,0,0
3060,TRAIN,0,0
3061,TEST,0,0
3062,TEST,0,0
3063,TRAIN,0,0
3064,TEST,0,0
3065,TRAIN,0,0
3066,TRAIN,0,0
3067,TRAIN,0,0
3068,TRAIN,0,0
3069,TRAIN,0,0
3070,TRAIN,0,0
3071,TRAIN,0,0
3072,TRAIN,0,0
3073,TRAIN,0,0
3074,TRAIN,0,0
3075,TRAIN,0,0
3076,TRAIN,0,0
3077,TRAIN,0,0
3078,TRAIN,0,0
3079,TRAIN,0,0
3080,TRAIN,0,0
3081,TEST,0,0
3082,TRAIN,0,0
3083,TRAIN,0,0
3084,TRAIN,0,0
3085,TRAIN,0,0
3086,TRAIN,0,0
3087,TRAIN,0,0
3088,TRAIN,0,0
3089,TRAIN,0,0
3090,TRAIN,0,0
3091,TRAIN,0,0
3092,TRAIN,0,0
3093,TRAIN,0,0
3094,TRAIN,0,0
3095,TRAIN,0,0
3096,TRAIN,0,0
3097,TRAIN,0,0
3098,TRAIN,0,0
3099,TRAIN,0,0
3100,TRAIN,0,0
3101,TEST,0,0
3102,TEST,0,0
3103,TRAIN,0,0
3104,TRAIN,0,0
3105,TEST,0,0
3106,TRAIN,0,0
3107,TRAIN,0,0
3108,TRAIN,0,0
3109,TRAIN,0,0
3110,TRAIN,0,0
3111,TRAIN,0,0
3112,TRAIN,0,0
3113,TRAIN,0,0
3114,TRAIN,0,0
3115,TRAIN,0,0
3116,TEST,0,0
3117,TRAIN,0,0
3118,TRAIN,0,0
3119,TEST,0,0
3120,TRAIN,0,0
3121,TEST,0,0
3122,TRAIN,0,0
3123,TRAIN,0,0
3124,TRAIN,0,0
3125,TRAIN,0,0
3126,TRAIN,0,0
3127,TRAIN,0,0
3128,TRAIN,0,0
3129,TEST,0,0
3130,TEST,0,0
3131,TRAIN,0,0
3132,TEST,0,0
3133,TRAIN,0,0
3134,TEST,0,0
3135,TEST,0,0
3136,TRAIN,0,0
3137,TRAIN,0,0
3138,TEST,0,0
3139,TEST,0,0
3140,TRAIN,0,0
3141,TRAIN,0,0
3142,TRAIN,0,0
3143,TRAIN,0,0
3144,TRAIN,0,0
3145,TRAIN,0,0
3146,TRAIN,0,0
3147,TRAIN,0,0
3148,TRAIN,0,0
3149,TRAIN,0,0
3150,TRAIN,0,0
3151,TRAIN,0,0
3152,TRAIN,0,0
3153,TRAIN,0,0
3154,TEST,0,0
3155,TRAIN,0,0
3156,TRAIN,0,0
3157,TRAIN,0,0
3158,TEST,0,0
3159,TEST,0,0
3160,TRAIN,0,0
3161,TEST,0,0
3162,TRAIN,0,0
3163,TRAIN,0,0
3164,TRAIN,0,0
3165,TRAIN,0,0
3166,TRAIN,0,0
3167,TRAIN,0,0
3168,TEST,0,0
3169,TEST,0,0
3170,TRAIN,0,0
3171,TRAIN,0,0
3172,TRAIN,0,0
3173,TRAIN,0,0
3174,TEST,0,0
3175,TRAIN,0,0
3176,TRAIN,0,0
3177,TRAIN,0,0
3178,TRAIN,0,0
3179,TRAIN,0,0
3180,TRAIN,0,0
3181,TRAIN,0,0
3182,TRAIN,0,0
3183,TRAIN,0,0
3184,TRAIN,0,0
3185,TRAIN,0,0
3186,TRAIN,0,0
3187,TRAIN,0,0
3188,TEST,0,0
3189,TEST,0,0
3190,TRAIN,0,0
3191,TRAIN,0,0
3192,TRAIN,0,0
3193,TEST,0,0
3194,TRAIN,0,0
3195,TEST,0,0
3196,TEST,0,0
3197,TRAIN,0,0
3198,TRAIN,0,0
3199,TEST,0,0
3200,TEST,0,0
3201,TRAIN,0,0
3202,TRAIN,0,0
3203,TEST,0,0
3204,TEST,0,0
3205,TEST,0,0
3206,TRAIN,0,0
3207,TRAIN,0,0
3208,TEST,0,0
3209,TRAIN,0,0
3210,TRAIN,0,0
3211,TRAIN,0,0
3212,TEST,0,0
3213,TRAIN,0,0
3214,TRAIN,0,0
3215,TRAIN,0,0
3216,TRAIN,0,0
3217,TRAIN,0,0
3218,TEST,0,0
3219,TRAIN,0,0
3220,TRAIN,0,0
3221,TRAIN,0,0
3222,TRAIN,0,0
3223,TRAIN,0,0
3224,TEST,0,0
3225,TRAIN,0,0
3226,TRAIN,0,0
3227,TEST,0,0
3228,TEST,0,0
3229,TRAIN,0,0
3230,TEST,0,0
3231,TRAIN,0,0
3232,TEST,0,0
3233,TRAIN,0,0
3234,TRAIN,0,0
3235,TEST,0,0
3236,TRAIN,0,0
3237,TRAIN,0,0
3238,TRAIN,0,0
3239,TRAIN,0,0
3240,TEST,0,0
3241,TRAIN,0,0
3242,TRAIN,0,0
3243,TRAIN,0,0
3244,TRAIN,0,0
3245,TRAIN,0,0
3246,TRAIN,0,0
3247,TRAIN,0,0
3248,TEST,0,0
3249,TRAIN,0,0
3250,TRAIN,0,0
3251,TRAIN,0,0
3252,TRAIN,0,0
3253,TRAIN,0,0
3254,TRAIN,0,0
3255,TRAIN,0,0
3256,TRAIN,0,0
3257,TRAIN,0,0
3258,TEST,0,0
3259,TRAIN,0,0
3260,TEST,0,0
3261,TRAIN,0,0
3262,TEST,0,0
3263,TRAIN,0,0
3264,TEST,0,0
3265,TEST,0,0
3266,TRAIN,0,0
3267,TRAIN,0,0
3268,TRAIN,0,0
3269,TRAIN,0,0
3270,TRAIN,0,0
3271,TRAIN,0,0
3272,TRAIN,0,0
3273,TRAIN,0,0
3274,TEST,0,0
3275,TRAIN,0,0
3276,TRAIN,0,0
3277,TRAIN,0,0
3278,TRAIN,0,0
3279,TEST,0,0
3280,TRAIN,0,0
3281,TEST,0,0
3282,TRAIN,0,0
3283,TRAIN,0,0
3284,TRAIN,0,0
3285,TRAIN,0,0
3286,TEST,0,0
3287,TRAIN,0,0
3288,TEST,0,0
3289,TRAIN,0,0
3290,TRAIN,0,0
3291,TEST,0,0
3292,TRAIN,0,0
3293,TRAIN,0,0
3294,TRAIN,0,0
3295,TRAIN,0,0
3296,TEST,0,0
3297,TRAIN,0,0
3298,TRAIN,0,0
3299,TEST,0,0
3300,TRAIN,0,0
3301,TRAIN,0,0
3302,TRAIN,0,0
3303,TRAIN,0,0
3304,TRAIN,0,0
3305,TEST,0,0
3306,TRAIN,0,0
3307,TEST,0,0
3308,TRAIN,0,0
3309,TRAIN,0,0
3310,TRAIN,0,0
3311,TEST,0,0
3312,TRAIN,0,0
3313,TRAIN,0,0
3314,TRAIN,0,0
3315,TEST,0,0
3316,TRAIN,0,0
3317,TEST,0,0
3318,TRAIN,0,0
3319,TEST,0,0
3320,TEST,0,0
3321,TEST,0,0
3322,TRAIN,0,0
3323,TRAIN,0,0
3324,TRAIN,0,0
3325,TRAIN,0,0
3326,TRAIN,0,0
3327,TRAIN,0,0
3328,TRAIN,0,0
3329,TRAIN,0,0
3330,TRAIN,0,0
3331,TEST,0,0
3332,TEST,0,0
3333,TEST,0,0
3334,TRAIN,0,0
3335,TRAIN,0,0
3336,TRAIN,0,0
3337,TRAIN,0,0
3338,TRAIN,0,0
3339,TRAIN,0,0
3340,TRAIN,0,0
3341,TRAIN,0,0
3342,TRAIN,0,0
3343,TRAIN,0,0
3344,TRAIN,0,0
3345,TRAIN,0,0
3346,TRAIN,0,0
3347,TRAIN,0,0
3348,TRAIN,0,0
3349,TRAIN,0,0
3350,TRAIN,0,0
3351,TEST,0,0
3352,TRAIN,0,0
3353,TRAIN,0,0
3354,TRAIN,0,0
3355,TRAIN,0,0
3356,TRAIN,0,0
3357,TRAIN,0,0
3358,TRAIN,0,0
3359,TRAIN,0,0
3360,TRAIN,0,0
3361,TRAIN,0,0
3362,TEST,0,0
3363,TEST,0,0
3364,TRAIN,0,0
3365,TRAIN,0,0
3366,TEST,0,0
3367,TRAIN,0,0
3368,TEST,0,0
3369,TRAIN,0,0
3370,TRAIN,0,0
3371,TRAIN,0,0
3372,TRAIN,0,0
3373,TRAIN,0,0
3374,TRAIN,0,0
3375,TRAIN,0,0
3376,TRAIN,0,0
3377,TRAIN,0,0
3378,TRAIN,0,0
3379,TEST,0,0
3380,TRAIN,0,0
3381,TRAIN,0,0
3382,TRAIN,0,0
3383,TEST,0,0
3384,TEST,0,0
3385,TRAIN,0,0
3386,TRAIN,0,0
3387,TRAIN,0,0
3388,TRAIN,0,0
3389,TRAIN,0,0
3390,TRAIN,0,0
3391,TRAIN,0,0
3392,TEST,0,0
3393,TRAIN,0,0
3394,TRAIN,0,0
3395,TRAIN,0,0
3396,TRAIN,0,0
3397,TRAIN,0,0
3398,TRAIN,0,0
3399,TRAIN,0,0
3400,TRAIN,0,0
3401,TRAIN,0,0
3402,TRAIN,0,0
3403,TEST,0,0
3404,TRAIN,0,0
3405,TRAIN,0,0
3406,TEST,0,0
3407,TEST,0,0
3408,TRAIN,0,0
3409,TRAIN,0,0
3410,TRAIN,0,0
3411,TRAIN,0,0
3412,TRAIN,0,0
3413,TRAIN,0,0
3414,TRAIN,0,0
3415,TEST,0,0
3416,TEST,0,0
3417,TEST,0,0
3418,TEST,0,0
3419,TRAIN,0,0
3420,TRAIN,0,0
3421,TRAIN,0,0
3422,TRAIN,0,0
3423,TEST,0,0
3424,TRAIN,0,0
3425,TRAIN,0,0
3426,TRAIN,0,0
3427,TRAIN,0,0
3428,TEST,0,0
3429,TEST,0,0
3430,TEST,0,0
3431,TRAIN,0,0
3432,TEST,0,0
3433,TRAIN,0,0
3434,TRAIN,0,0
3435,TEST,0,0
3436,TRAIN,0,0
3437,TRAIN,0,0
3438,TRAIN,0,0
3439,TRAIN,0,0
3440,TRAIN,0,0
3441,TEST,0,0
3442,TRAIN,0,0
3443,TRAIN,0,0
3444,TRAIN,0,0
3445,TRAIN,0,0
3446,TRAIN,0,0
3447,TRAIN,0,0
3448,TRAIN,0,0
3449,TRAIN,0,0
3450,TRAIN,0,0
3451,TEST,0,0
3452,TRAIN,0,0
3453,TRAIN,0,0
3454,TRAIN,0,0
3455,TRAIN,0,0
3456,TEST,0,0
3457,TRAIN,0,0
3458,TRAIN,0,0
3459,TRAIN,0,0
3460,TRAIN,0,0
3461,TRAIN,0,0
3462,TRAIN,0,0
3463,TRAIN,0,0
3464,TRAIN,0,0
3465,TRAIN,0,0
3466,TEST,0,0
3467,TRAIN,0,0
3468,TRAIN,0,0
3469,TRAIN,0,0
3470,TRAIN,0,0
3471,TRAIN,0,0
3472,TRAIN,0,0
3473,TRAIN,0,0
3474,TRAIN,0,0
3475,TEST,0,0
3476,TRAIN,0,0
3477,TRAIN,0,0
3478,TRAIN,0,0
3479,TRAIN,0,0
3480,TRAIN,0,0
3481,TRAIN,0,0
3482,TRAIN,0,0
3483,TRAIN,0,0
3484,TEST,0,0
3485,TRAIN,0,0
3486,TRAIN,0,0
3487,TRAIN,0,0
3488,TRAIN,0,0
3489,TRAIN,0,0
3490,TRAIN,0,0
3491,TRAIN,0,0
3492,TRAIN,0,0
3493,TRAIN,0,0
3494,TEST,0,0
3495,TEST,0,0
3496,TRAIN,0,0
3497,TRAIN,0,0
3498,TRAIN,0,0
3499,TRAIN,0,0
3500,TRAIN,0,0
3501,TRAIN,0,0
3502,TRAIN,0,0
3503,TEST,0,0
3504,TRAIN,0,0
3505,TEST,0,0
3506,TRAIN,0,0
3507,TRAIN,0,0
3508,TRAIN,0,0
3509,TRAIN,0,0
3510,TRAIN,0,0
3511,TRAIN,0,0
3512,TRAIN,0,0
3513,TRAIN,0,0
3514,TRAIN,0,0
3515,TRAIN,0,0
3516,TEST,0,0
3517,TEST,0,0
3518,TRAIN,0,0
3519,TRAIN,0,0
3520,TRAIN,0,0
3521,TRAIN,0,0
3522,TRAIN,0,0
3523,TRAIN,0,0
3524,TRAIN,0,0
3525,TEST,0,0
3526,TEST,0,0
3527,TRAIN,0,0
3528,TEST,0,0
3529,TRAIN,0,0
3530,TRAIN,0,0
3531,TRAIN,0,0
3532,TEST,0,0
3533,TRAIN,0,0
3534,TEST,0,0
3535,TRAIN,0,0
3536,TEST,0,0
3537,TRAIN,0,0
3538,TRAIN,0,0
3539,TRAIN,0,0
3540,TRAIN,0,0
3541,TRAIN,0,0
3542,TRAIN,0,0
3543,TRAIN,0,0
3544,TEST,0,0
3545,TRAIN,0,0
3546,TRAIN,0,0
3547,TRAIN,0,0
3548,TRAIN,0,0
3549,TRAIN,0,0
3550,TEST,0,0
3551,TRAIN,0,0
3552,TEST,0,0
3553,TEST,0,0
3554,TRAIN,0,0
3555,TRAIN,0,0
3556,TRAIN,0,0
3557,TEST,0,0
3558,TRAIN,0,0
3559,TRAIN,0,0
3560,TRAIN,0,0
3561,TRAIN,0,0
3562,TRAIN,0,0
3563,TRAIN,0,0
3564,TRAIN,0,0
3565,TRAIN,0,0
3566,TRAIN,0,0
3567,TEST,0,0
3568,TRAIN,0,0
3569,TRAIN,0,0
3570,TEST,0,0
3571,TEST,0,0
3572,TRAIN,0,0
3573,TEST,0,0
3574,TEST,0,0
3575,TEST,0,0
3576,TRAIN,0,0
3577,TRAIN,0,0
3578,TEST,0,0
3579,TRAIN,0,0
3580,TRAIN,0,0
3581,TRAIN,0,0
3582,TRAIN,0,0
3583,TRAIN,0,0
3584,TRAIN,0,0
3585,TRAIN,0,0
3586,TEST,0,0
3587,TRAIN,0,0
3588,TEST,0,0
3589,TRAIN,0,0
3590,TRAIN,0,0
3591,TEST,0,0
3592,TRAIN,0,0
3593,TRAIN,0,0
3594,TRAIN,0,0
3595,TRAIN,0,0
3596,TEST,0,0
3597,TEST,0,0
3598,TEST,0,0
3599,TRAIN,0,0
3600,TEST,0,0
3601,TRAIN,0,0
3602,TRAIN,0,0
3603,TRAIN,0,0
3604,TRAIN,0,0
3605,TRAIN,0,0
3606,TEST,0,0
3607,TRAIN,0,0
3608,TRAIN,0,0
3609,TRAIN,0,0
3610,TEST,0,0
3611,TEST,0,0
3612,TRAIN,0,0
3613,TRAIN,0,0
3614,TRAIN,0,0
3615,TEST,0,0
3616,TRAIN,0,0
3617,TEST,0,0
3618,TEST,0,0
3619,TEST,0,0
3620,TRAIN,0,0
3621,TRAIN,0,0
3622,TRAIN,0,0
3623,TRAIN,0,0
3624,TRAIN,0,0
3625,TRAIN,0,0
3626,TRAIN,0,0
3627,TRAIN,0,0
3628,TRAIN,0,0
3629,TEST,0,0
3630,TRAIN,0,0
3631,TRAIN,0,0
3632,TRAIN,0,0
3633,TEST,0,0
3634,TRAIN,0,0
3635,TRAIN,0,0
3636,TRAIN,0,0
3637,TRAIN,0,0
3638,TRAIN,0,0
3639,TEST,0,0
3640,TRAIN,0,0
3641,TRAIN,0,0
3642,TEST,0,0
3643,TRAIN,0,0
3644,TRAIN,0,0
3645,TRAIN,0,0
3646,TRAIN,0,0
3647,TRAIN,0,0
3648,TRAIN,0,0
3649,TEST,0,0
3650,TEST,0,0
3651,TRAIN,0,0
3652,TRAIN,0,0
3653,TEST,0,0
3654,TRAIN,0,0
3655,TRAIN,0,0
3656,TRAIN,0,0
3657,TRAIN,0,0
3658,TRAIN,0,0
3659,TRAIN,0,0
3660,TRAIN,0,0
3661,TRAIN,0,0
3662,TRAIN,0,0
3663,TRAIN,0,0
3664,TRAIN,0,0
3665,TRAIN,0,0
3666,TRAIN,0,0
3667,TRAIN,0,0
3668,TEST,0,0
3669,TEST,0,0
3670,TEST,0,0
3671,TRAIN,0,0
3672,TRAIN,0,0
3673,TRAIN,0,0
3674,TRAIN,0,0
3675,TRAIN,0,0
3676,TRAIN,0,0
3677,TEST,0,0
3678,TRAIN,0,0
3679,TRAIN,0,0
3680,TRAIN,0,0
3681,TRAIN,0,0
3682,TEST,0,0
3683,TRAIN,0,0
3684,TEST,0,0
3685,TRAIN,0,0
3686,TRAIN,0,0
3687,TRAIN,0,0
3688,TRAIN,0,0
3689,TEST,0,0
3690,TRAIN,0,0
3691,TRAIN,0,0
3692,TRAIN,0,0
3693,TEST,0,0
3694,TEST,0,0
3695,TRAIN,0,0
3696,TRAIN,0,0
3697,TRAIN,0,0
3698,TRAIN,0,0
3699,TRAIN,0,0
3700,TEST,0,0
3701,TRAIN,0,0
3702,TEST,0,0
3703,TRAIN,0,0
3704,TRAIN,0,0
3705,TEST,0,0
3706,TRAIN,0,0
3707,TRAIN,0,0
3708,TRAIN,0,0
3709,TRAIN,0,0
3710,TRAIN,0,0
3711,TEST,0,0
3712,TRAIN,0,0
3713,TRAIN,0,0
3714,TRAIN,0,0
3715,TEST,0,0
3716,TRAIN,0,0
3717,TRAIN,0,0
3718,TRAIN,0,0
3719,TRAIN,0,0
3720,TRAIN,0,0
3721,TRAIN,0,0
3722,TRAIN,0,0
3723,TRAIN,0,0
3724,TEST,0,0
3725,TRAIN,0,0
3726,TRAIN,0,0
3727,TRAIN,0,0
3728,TRAIN,0,0
3729,TRAIN,0,0
3730,TRAIN,0,0
3731,TEST,0,0
3732,TEST,0,0
3733,TRAIN,0,0
3734,TRAIN,0,0
3735,TRAIN,0,0
3736,TRAIN,0,0
3737,TRAIN,0,0
3738,TEST,0,0
3739,TRAIN,0,0
3740,TRAIN,0,0
3741,TRAIN,0,0
3742,TRAIN,0,0
3743,TRAIN,0,0
3744,TRAIN,0,0
3745,TRAIN,0,0
3746,TRAIN,0,0
3747,TRAIN,0,0
3748,TRAIN,0,0
3749,TRAIN,0,0
3750,TRAIN,0,0
3751,TEST,0,0
3752,TRAIN,0,0
3753,TEST,0,0
3754,TEST,0,0
3755,TRAIN,0,0
3756,TRAIN,0,0
3757,TRAIN,0,0
3758,TRAIN,0,0
3759,TEST,0,0
3760,TRAIN,0,0
3761,TRAIN,0,0
3762,TRAIN,0,0
3763,TRAIN,0,0
3764,TRAIN,0,0
3765,TRAIN,0,0
3766,TRAIN,0,0
3767,TRAIN,0,0
3768,TRAIN,0,0
3769,TRAIN,0,0
3770,TRAIN,0,0
3771,TRAIN,0,0
3772,TRAIN,0,0
3773,TRAIN,0,0
3774,TRAIN,0,0
3775,TEST,0,0
3776,TEST,0,0
3777,TRAIN,0,0
3778,TEST,0,0
3779,TRAIN,0,0
3780,TRAIN,0,0
3781,TRAIN,0,0
3782,TRAIN,0,0
3783,TRAIN,0,0
3784,TRAIN,0,0
3785,TEST,0,0
3786,TRAIN,0,0
3787,TEST,0,0
3788,TRAIN,0,0
3789,TRAIN,0,0
3790,TRAIN,0,0
3791,TRAIN,0,0
3792,TEST,0,0
3793,TRAIN,0,0
3794,TRAIN,0,0
3795,TRAIN,0,0
3796,TRAIN,0,0
3797,TRAIN,0,0
3798,TRAIN,0,0
3799,TRAIN,0,0
3800,TEST,0,0
3801,TRAIN,0,0
3802,TRAIN,0,0
3803,TEST,0,0
3804,TRAIN,0,0
3805,TRAIN,0,0
3806,TRAIN,0,0
3807,TRAIN,0,0
3808,TRAIN,0,0
3809,TRAIN,0,0
3810,TRAIN,0,0
3811,TRAIN,0,0
3812,TRAIN,0,0
3813,TRAIN,0,0
3814,TRAIN,0,0
3815,TRAIN,0,0
3816,TRAIN,0,0
3817,TRAIN,0,0
3818,TRAIN,0,0
3819,TRAIN,0,0
3820,TRAIN,0,0
3821,TEST,0,0
3822,TRAIN,0,0
3823,TEST,0,0
3824,TRAIN,0,0
3825,TRAIN,0,0
3826,TEST,0,0
3827,TRAIN,0,0
3828,TRAIN,0,0
3829,TEST,0,0
3830,TRAIN,0,0
3831,TRAIN,0,0
3832,TEST,0,0
3833,TRAIN,0,0
3834,TRAIN,0,0
3835,TRAIN,0,0
3836,TRAIN,0,0
3837,TRAIN,0,0
3838,TRAIN,0,0
3839,TRAIN,0,0
3840,TRAIN,0,0
3841,TEST,0,0
3842,TRAIN,0,0
3843,TRAIN,0,0
3844,TRAIN,0,0
3845,TEST,0,0
3846,TRAIN,0,0
3847,TRAIN,0,0
3848,TRAIN,0,0
3849,TRAIN,0,0
3850,TEST,0,0
3851,TEST,0,0
3852,TRAIN,0,0
3853,TEST,0,0
3854,TRAIN,0,0
3855,TRAIN,0,0
3856,TRAIN,0,0
3857,TRAIN,0,0
3858,TRAIN,0,0
3859,TRAIN,0,0
3860,TRAIN,0,0
3861,TRAIN,0,0
3862,TRAIN,0,0
3863,TRAIN,0,0
3864,TRAIN,0,0
3865,TRAIN,0,0
3866,TRAIN,0,0
3867,TRAIN,0,0
3868,TRAIN,0,0
3869,TRAIN,0,0
3870,TRAIN,0,0
3871,TEST,0,0
3872,TRAIN,0,0
3873,TRAIN,0,0
3874,TEST,0,0
3875,TRAIN,0,0
3876,TRAIN,0,0
3877,TRAIN,0,0
3878,TEST,0,0
3879,TRAIN,0,0
3880,TRAIN,0,0
3881,TRAIN,0,0
3882,TRAIN,0,0
3883,TRAIN,0,0
3884,TRAIN,0,0
3885,TRAIN,0,0
3886,TEST,0,0
3887,TRAIN,0,0
3888,TRAIN,0,0
3889,TRAIN,0,0
3890,TRAIN,0,0
3891,TRAIN,0,0
3892,TEST,0,0
3893,TRAIN,0,0
3894,TRAIN,0,0
3895,TRAIN,0,0
3896,TRAIN,0,0
3897,TEST,0,0
3898,TRAIN,0,0
3899,TRAIN,0,0
3900,TRAIN,0,0
3901,TEST,0,0
3902,TRAIN,0,0
3903,TEST,0,0
3904,TRAIN,0,0
3905,TRAIN,0,0
3906,TRAIN,0,0
3907,TRAIN,0,0
3908,TRAIN,0,0
3909,TRAIN,0,0
3910,TRAIN,0,0
3911,TRAIN,0,0
3912,TRAIN,0,0
3913,TEST,0,0
3914,TRAIN,0,0
3915,TRAIN,0,0
3916,TRAIN,0,0
3917,TRAIN,0,0
3918,TRAIN,0,0
3919,TRAIN,0,0
3920,TRAIN,0,0
3921,TEST,0,0
3922,TRAIN,0,0
3923,TRAIN,0,0
3924,TEST,0,0
3925,TEST,0,0
3926,TRAIN,0,0
3927,TRAIN,0,0
3928,TEST,0,0
3929,TEST,0,0
3930,TRAIN,0,0
3931,TRAIN,0,0
3932,TRAIN,0,0
3933,TRAIN,0,0
3934,TRAIN,0,0
3935,TRAIN,0,0
3936,TRAIN,0,0
3937,TEST,0,0
3938,TRAIN,0,0
3939,TRAIN,0,0
3940,TRAIN,0,0
3941,TEST,0,0
3942,TEST,0,0
3943,TRAIN,0,0
3944,TRAIN,0,0
3945,TRAIN,0,0
3946,TEST,0,0
3947,TRAIN,0,0
3948,TEST,0,0
3949,TRAIN,0,0
3950,TEST,0,0
3951,TEST,0,0
3952,TRAIN,0,0
3953,TEST,0,0
3954,TEST,0,0
3955,TRAIN,0,0
3956,TRAIN,0,0
3957,TEST,0,0
3958,TRAIN,0,0
3959,TRAIN,0,0
3960,TEST,0,0
3961,TRAIN,0,0
3962,TRAIN,0,0
3963,TRAIN,0,0
3964,TRAIN,0,0
3965,TRAIN,0,0
3966,TRAIN,0,0
3967,TRAIN,0,0
3968,TEST,0,0
3969,TRAIN,0,0
3970,TRAIN,0,0
3971,TEST,0,0
3972,TEST,0,0
3973,TEST,0,0
3974,TRAIN,0,0
3975,TRAIN,0,0
3976,TRAIN,0,0
3977,TRAIN,0,0
3978,TRAIN,0,0
3979,TEST,0,0
3980,TRAIN,0,0
3981,TRAIN,0,0
3982,TRAIN,0,0
3983,TEST,0,0
3984,TEST,0,0
3985,TRAIN,0,0
3986,TRAIN,0,0
3987,TRAIN,0,0
3988,TRAIN,0,0
3989,TEST,0,0
3990,TRAIN,0,0
3991,TRAIN,0,0
3992,TRAIN,0,0
3993,TRAIN,0,0
3994,TRAIN,0,0
3995,TRAIN,0,0
3996,TRAIN,0,0
3997,TRAIN,0,0
3998,TRAIN,0,0
3999,TEST,0,0
4000,TRAIN,0,0
4001,TRAIN,0,0
4002,TRAIN,0,0
4003,TEST,0,0
4004,TEST,0,0
4005,TRAIN,0,0
4006,TRAIN,0,0
4007,TRAIN,0,0
4008,TEST,0,0
4009,TRAIN,0,0
4010,TRAIN,0,0
4011,TRAIN,0,0
4012,TRAIN,0,0
4013,TRAIN,0,0
4014,TRAIN,0,0
4015,TEST,0,0
4016,TRAIN,0,0
4017,TRAIN,0,0
4018,TEST,0,0
4019,TRAIN,0,0
4020,TEST,0,0
4021,TRAIN,0,0
4022,TRAIN,0,0
4023,TEST,0,0
4024,TRAIN,0,0
4025,TRAIN,0,0
4026,TRAIN,0,0
4027,TRAIN,0,0
4028,TRAIN,0,0
4029,TRAIN,0,0
4030,TEST,0,0
4031,TRAIN,0,0
4032,TEST,0,0
4033,TRAIN,0,0
4034,TRAIN,0,0
4035,TRAIN,0,0
4036,TEST,0,0
4037,TRAIN,0,0
4038,TRAIN,0,0
4039,TRAIN,0,0
4040,TEST,0,0
4041,TRAIN,0,0
4042,TEST,0,0
4043,TRAIN,0,0
4044,TRAIN,0,0
4045,TRAIN,0,0
4046,TEST,0,0
4047,TEST,0,0
4048,TRAIN,0,0
4049,TEST,0,0
4050,TEST,0,0
4051,TRAIN,0,0
4052,TEST,0,0
4053,TRAIN,0,0
4054,TEST,0,0
4055,TRAIN,0,0
4056,TEST,0,0
4057,TRAIN,0,0
4058,TRAIN,0,0
4059,TEST,0,0
4060,TRAIN,0,0
4061,TRAIN,0,0
4062,TRAIN,0,0
4063,TEST,0,0
4064,TRAIN,0,0
4065,TRAIN,0,0
4066,TRAIN,0,0
4067,TRAIN,0,0
4068,TRAIN,0,0
4069,TRAIN,0,0
4070,TRAIN,0,0
4071,TRAIN,0,0
4072,TRAIN,0,0
4073,TRAIN,0,0
4074,TRAIN,0,0
4075,TRAIN,0,0
4076,TEST,0,0
4077,TEST,0,0
4078,TEST,0,0
4079,TRAIN,0,0
4080,TRAIN,0,0
4081,TRAIN,0,0
4082,TRAIN,0,0
4083,TEST,0,0
4084,TRAIN,0,0
4085,TRAIN,0,0
4086,TRAIN,0,0
4087,TRAIN,0,0
4088,TRAIN,0,0
4089,TRAIN,0,0
4090,TRAIN,0,0
4091,TRAIN,0,0
4092,TRAIN,0,0
4093,TRAIN,0,0
4094,TRAIN,0,0
4095,TRAIN,0,0
4096,TEST,0,0
4097,TRAIN,0,0
4098,TRAIN,0,0
4099,TRAIN,0,0
4100,TRAIN,0,0
4101,TRAIN,0,0
4102,TRAIN,0,0
4103,TEST,0,0
4104,TRAIN,0,0
4105,TEST,0,0
4106,TEST,0,0
4107,TRAIN,0,0
4108,TEST,0,0
4109,TRAIN,0,0
4110,TRAIN,0,0
4111,TRAIN,0,0
4112,TEST,0,0
4113,TRAIN,0,0
4114,TRAIN,0,0
4115,TRAIN,0,0
4116,TRAIN,0,0
4117,TRAIN,0,0
4118,TRAIN,0,0
4119,TEST,0,0
4120,TRAIN,0,0
4121,TEST,0,0
4122,TRAIN,0,0
4123,TRAIN,0,0
4124,TRAIN,0,0
4125,TEST,0,0
4126,TRAIN,0,0
4127,TEST,0,0
4128,TRAIN,0,0
4129,TRAIN,0,0
4130,TRAIN,0,0
4131,TRAIN,0,0
4132,TRAIN,0,0
4133,TRAIN,0,0
4134,TRAIN,0,0
4135,TRAIN,0,0
4136,TRAIN,0,0
4137,TEST,0,0
4138,TRAIN,0,0
4139,TEST,0,0
4140,TRAIN,0,0
4141,TRAIN,0,0
4142,TRAIN,0,0
4143,TEST,0,0
4144,TRAIN,0,0
4145,TEST,0,0
4146,TRAIN,0,0
4147,TEST,0,0
4148,TEST,0,0
4149,TRAIN,0,0
4150,TRAIN,0,0
4151,TRAIN,0,0
4152,TRAIN,0,0
4153,TRAIN,0,0
4154,TRAIN,0,0
4155,TRAIN,0,0
4156,TRAIN,0,0
4157,TEST,0,0
4158,TRAIN,0,0
4159,TRAIN,0,0
4160,TRAIN,0,0
4161,TRAIN,0,0
4162,TRAIN,0,0
4163,TEST,0,0
4164,TRAIN,0,0
4165,TRAIN,0,0
4166,TEST,0,0
4167,TRAIN,0,0
4168,TEST,0,0
4169,TRAIN,0,0
4170,TRAIN,0,0
4171,TEST,0,0
4172,TEST,0,0
4173,TRAIN,0,0
4174,TRAIN,0,0
4175,TRAIN,0,0
4176,TRAIN,0,0
4177,TRAIN,0,0
4178,TRAIN,0,0
4179,TEST,0,0
4180,TEST,0,0
4181,TRAIN,0,0
4182,TRAIN,0,0
4183,TRAIN,0,0
4184,TRAIN,0,0
4185,TRAIN,0,0
4186,TRAIN,0,0
4187,TRAIN,0,0
4188,TRAIN,0,0
4189,TRAIN,0,0
4190,TRAIN,0,0
4191,TRAIN,0,0
4192,TRAIN,0,0
4193,TRAIN,0,0
4194,TRAIN,0,0
4195,TEST,0,0
4196,TEST,0,0
4197,TRAIN,0,0
4198,TRAIN,0,0
4199,TRAIN,0,0
4200,TEST,0,0
4201,TRAIN,0,0
4202,TEST,0,0
4203,TEST,0,0
4204,TEST,0,0
4205,TRAIN,0,0
4206,TRAIN,0,0
4207,TEST,0,0
4208,TRAIN,0,0
4209,TRAIN,0,0
4210,TEST,0,0
4211,TRAIN,0,0
4212,TRAIN,0,0
4213,TEST,0,0
4214,TRAIN,0,0
4215,TRAIN,0,0
4216,TRAIN,0,0
4217,TRAIN,0,0
4218,TRAIN,0,0
4219,TEST,0,0
4220,TEST,0,0
4221,TRAIN,0,0
4222,TEST,0,0
4223,TEST,0,0
4224,TRAIN,0,0
4225,TRAIN,0,0
4226,TRAIN,0,0
4227,TRAIN,0,0
4228,TRAIN,0,0
4229,TEST,0,0
4230,TRAIN,0,0
4231,TEST,0,0
4232,TRAIN,0,0
4233,TRAIN,0,0
4234,TRAIN,0,0
4235,TEST,0,0
4236,TRAIN,0,0
4237,TRAIN,0,0
4238,TEST,0,0
4239,TEST,0,0
4240,TEST,0,0
4241,TEST,0,0
4242,TRAIN,0,0
4243,TRAIN,0,0
4244,TEST,0,0
4245,TRAIN,0,0
4246,TEST,0,0
4247,TRAIN,0,0
4248,TEST,0,0
4249,TRAIN,0,0
4250,TRAIN,0,0
4251,TRAIN,0,0
4252,TRAIN,0,0
4253,TRAIN,0,0
4254,TRAIN,0,0
4255,TRAIN,0,0
4256,TRAIN,0,0
4257,TRAIN,0,0
4258,TEST,0,0
4259,TRAIN,0,0
4260,TRAIN,0,0
4261,TRAIN,0,0
4262,TRAIN,0,0
4263,TRAIN,0,0
4264,TRAIN,0,0
4265,TEST,0,0
4266,TRAIN,0,0
4267,TEST,0,0
4268,TEST,0,0
4269,TRAIN,0,0
4270,TRAIN,0,0
4271,TRAIN,0,0
4272,TRAIN,0,0
4273,TRAIN,0,0
4274,TEST,0,0
4275,TRAIN,0,0
4276,TRAIN,0,0
4277,TEST,0,0
4278,TRAIN,0,0
4279,TRAIN,0,0
4280,TEST,0,0
4281,TRAIN,0,0
4282,TRAIN,0,0
4283,TEST,0,0
4284,TRAIN,0,0
4285,TRAIN,0,0
4286,TRAIN,0,0
4287,TRAIN,0,0
4288,TRAIN,0,0
4289,TRAIN,0,0
4290,TRAIN,0,0
4291,TEST,0,0
4292,TRAIN,0,0
4293,TRAIN,0,0
4294,TRAIN,0,0
4295,TRAIN,0,0
4296,TRAIN,0,0
4297,TRAIN,0,0
4298,TRAIN,0,0
4299,TRAIN,0,0
4300,TRAIN,0,0
4301,TRAIN,0,0
4302,TEST,0,0
4303,TRAIN,0,0
4304,TRAIN,0,0
4305,TRAIN,0,0
4306,TRAIN,0,0
4307,TRAIN,0,0
4308,TRAIN,0,0
4309,TRAIN,0,0
4310,TRAIN,0,0
4311,TRAIN,0,0
4312,TRAIN,0,0
4313,TRAIN,0,0
4314,TEST,0,0
4315,TRAIN,0,0
4316,TEST,0,0
4317,TEST,0,0
4318,TRAIN,0,0
4319,TRAIN,0,0
4320,TRAIN,0,0
4321,TRAIN,0,0
4322,TEST,0,0
4323,TRAIN,0,0
4324,TRAIN,0,0
4325,TRAIN,0,0
4326,TRAIN,0,0
4327,TRAIN,0,0
4328,TRAIN,0,0
4329,TEST,0,0
4330,TRAIN,0,0
4331,TRAIN,0,0
4332,TRAIN,0,0
4333,TRAIN,0,0
4334,TRAIN,0,0
4335,TRAIN,0,0
4336,TRAIN,0,0
4337,TRAIN,0,0
4338,TRAIN,0,0
4339,TRAIN,0,0
4340,TRAIN,0,0
4341,TEST,0,0
4342,TRAIN,0,0
4343,TEST,0,0
