{
  "about": {
    "datasetID": "AUGDATA_taxi_vehicle_collisions_weather_hourly_dataset",
    "datasetName": "NYC Taxi, Vehicle Collision, and Weather Datasets",
    "description": "This dataset contains hourly passenger pickup numbers (Taxi), vehicle collision numbers (Vehicle Collision) and various weather attributes (Weather) between Jan 2014 to December 2014",
    "license": "",
    "datasetSchemaVersion": "3.1.2",
    "redacted": false
  },
  "dataResources": [
    {
      "resID": "0",
      "resPath": "tables/learningData.csv",
      "resType": "table",
      "resFormat": [
        "text/csv"
      ],
      "isCollection": false,
      "columns": [
        {
          "colIndex": 0,
          "colName": "d3mIndex",
          "colType": "integer",
          "role": [
            "index"
          ]
        },
        {
          "colIndex": 1,
          "colName": "datetime",
          "colType": "dateTime",
          "role": [
            "attribute"
          ]
        },
        {
          "colIndex": 2,
          "colName": "n. trips",
          "colType": "integer",
          "role": [
            "attribute"
          ]
        },
        {
          "colIndex": 3,
          "colName": "n. collisions",
          "colType": "integer",
          "role": [
            "suggestedTarget"
          ]
        },
        {
          "colIndex": 4,
          "colName": "Amt[PrecipHourly1]",
          "colType": "real",
          "role": [
            "attribute"
          ]
        },
        {
          "colIndex": 5,
          "colName": "Temp[Temp]",
          "colType": "real",
          "role": [
            "attribute"
          ]
        },
        {
          "colIndex": 6,
          "colName": "Visby[Visibility]",
          "colType": "real",
          "role": [
            "attribute"
          ]
        }
      ]
    }
  ]
}