pickup_datetime,n. trips,price,distance
2014-10-01,458010,12.71630881421803,2.8353703412589115
2014-10-02,467301,12.956863327919264,2.9186927483571052
2014-10-03,485297,12.671244969575334,2.9098518226983345
2014-10-04,467371,11.664008229008648,2.783913978402511
2014-10-05,416216,13.248501379091625,3.264131652795714
2014-10-06,409584,12.819958396812373,3.0465925426774594
2014-10-07,436891,12.670980198722333,2.842589524618229
2014-10-08,456070,12.951355559453594,2.9129006073628942
2014-10-09,477361,13.05727279773589,2.9670034627881297
2014-10-10,489982,13.289041658673176,3.019509757501301
2014-10-11,509530,12.369134947893157,2.8417740859222707
2014-10-12,437673,13.473332145231717,3.275619172304458
2014-10-13,389171,12.789273738279574,3.184846558453676
2014-10-14,431529,13.076875204215705,3.000649759344193
2014-10-15,456636,12.929852157955134,2.8974250606609444
2014-10-16,481635,13.045838030874004,2.934890570660388
2014-10-17,492494,13.259944791205578,3.0017330972561123
2014-10-18,513702,12.351174961358922,2.8711085999275525
2014-10-19,461858,12.923985532349773,3.209669054124957
2014-10-20,416422,12.91599843428061,3.0947850497811995
2014-10-21,445571,12.662419928586017,2.866535052775018
2014-10-22,461722,12.985638566063562,2.8055784649637063
2014-10-23,471818,13.431451364721145,2.9389341440979697
2014-10-24,492064,13.23232931082136,2.9995612969044
2014-10-25,500873,12.43947343937485,2.864224064782907
2014-10-26,441193,13.147944346351832,3.2621520287039814
2014-10-27,411856,12.853844086282587,3.0493286245678575
2014-10-28,434802,12.930154323117192,2.8750921798887537
2014-10-29,454041,12.830072900905424,2.8555819188134404
2014-10-30,469494,13.372798417019176,2.9321863964182353
2014-10-31,494320,13.041266912121705,2.855534775044669
