pickup_datetime,n. trips,price,distance
2015-04-01,440246,12.79219613579677,137.92509076743266
2015-04-02,444300,13.339533423362548,26.205818050866394
2015-04-03,444077,12.441200287337532,2.9013691319298114
2015-04-04,440170,11.68318938137535,2.7420459595156204
2015-04-05,377462,12.66100415406051,3.3764426087923725
2015-04-06,375754,12.848287363541008,3.102918904389544
2015-04-07,425909,12.312186875600144,26.46138468546076
2015-04-08,443492,12.554405220387252,40.3819143524573
2015-04-09,460476,12.609907530468432,2.845223095231889
2015-04-10,468077,12.541500137797815,26.159091196533485
2015-04-11,473730,12.487086125007892,2.8446034238912494
2015-04-12,407342,13.067273715943825,13.543651747180508
2015-04-13,377158,13.406065945836993,25.372608323301808
2015-04-14,411892,12.680195755197916,2.920989142784968
2015-04-15,427092,13.161297167823284,6.141966765942746
2015-04-16,452157,13.230780414767395,58.64736761788502
2015-04-17,469283,13.101268786638293,12.123717841899392
2015-04-18,500928,12.706761869969299,34.796833536954324
2015-04-19,445785,13.093807530535992,14.569940150520978
2015-04-20,397259,12.674624237588043,101.16214960516794
2015-04-21,426137,13.055096928921893,25.952618571022132
2015-04-22,432491,13.075228663717816,49.82863525483736
2015-04-23,463486,13.304421277018038,40.735433799511725
2015-04-24,474068,13.338052304732615,84.89869004024789
2015-04-25,489474,12.492031057829386,3.1827071509416416
2015-04-26,424608,13.334241253108715,4.4899186072801776
2015-04-27,393526,12.805991903965642,65.11868105284059
2015-04-28,411771,12.778136707053141,14.28185926157972
2015-04-29,427507,13.270552014352933,31.57187718563849
2015-04-30,446132,13.523053916777958,59.955133749652724
