pickup_datetime,n. trips,price,distance
2014-05-01,492691,13.221899466399833,3.0073783365234372
2014-05-02,516985,13.25932406162655,3.0610162770681058
2014-05-03,544063,12.367156579293212,2.888066841523818
2014-05-04,475789,12.89862441124111,3.265811021271997
2014-05-05,461342,12.881849517277857,3.0473075289047387
2014-05-06,483245,12.66449583544579,2.9010666225205743
2014-05-07,484552,13.047276226287378,2.940976303884847
2014-05-08,508104,13.066891581251086,2.9304926944090326
2014-05-09,523936,12.857689412447325,2.937823264673377
2014-05-10,527537,12.226365487160145,2.90010876962195
2014-05-11,454120,13.178730269532286,3.3074775169559096
2014-05-12,437492,12.980724447532756,3.0911887074505975
2014-05-13,473044,12.704873119625233,2.8819673222785966
2014-05-14,466666,13.42454054934365,2.9930215400307856
2014-05-15,495003,13.401503021193816,3.002166714141118
2014-05-16,515834,13.097461237529906,2.9795096484527974
2014-05-17,506831,13.173988528720619,3.051231080971813
2014-05-18,473932,13.391479494948646,3.337025016247125
2014-05-19,452923,13.034362419219164,3.1106126206882654
2014-05-20,472199,13.200203325292938,3.0021541765230197
2014-05-21,483979,13.2652881633294,3.0134206442840994
2014-05-22,489262,13.400477515114604,2.996743053823934
2014-05-23,495859,13.034234449712523,3.028155705553421
2014-05-24,413311,12.474357033807474,3.07671772587728
2014-05-25,378073,12.670601550494217,3.196783557672748
2014-05-26,336173,13.361480428231895,3.5673904804966132
2014-05-27,432969,12.927632925220975,3.0214714910305016
2014-05-28,472420,13.095683861817871,2.9233209855636413
2014-05-29,489739,13.086012672055933,2.9277690974171695
2014-05-30,503977,12.932678257142687,2.9285175117118274
2014-05-31,511991,12.416783712994954,2.9438769431494283
