pickup_datetime,n. trips,price,distance
2015-07-01,390084,12.86397209319015,6.351731088688668
2015-07-02,365953,13.531942134645673,2.9640127284105295
2015-07-03,304176,12.21381736231653,13.96493069801698
2015-07-04,254353,12.2660366105373,3.1069001348519976
2015-07-05,275555,13.400666944893018,3.5540817622615593
2015-07-06,315526,13.026762358727932,28.59065560365949
2015-07-07,367579,12.721538390386801,2.89313189817689
2015-07-08,393186,12.632679724100015,2.84657920170094
2015-07-09,405656,12.844575034018927,10.706256803794112
2015-07-10,401014,12.977839252494876,2.970353578678102
2015-07-11,407202,12.240935015053923,2.9164665694176466
2015-07-12,364211,12.977728706711195,21.98363605162906
2015-07-13,350162,12.998022600967522,5.069938742639117
2015-07-14,385566,12.870518925423884,2.8835363076620424
2015-07-15,404755,13.15334100875834,2.920693431829131
2015-07-16,400140,13.617980631778835,3.036435647523346
2015-07-17,365045,13.439466942431721,3.136269062718206
2015-07-18,403824,12.41221886267282,3.3806817573993304
2015-07-19,395475,12.846761893924999,16.916951716289727
2015-07-20,374211,13.029819620481453,3.069479090673481
2015-07-21,375036,13.187478855363189,2.941168314508458
2015-07-22,392078,13.440653492417292,3.3649821974199403
2015-07-23,404102,13.363837620204773,3.00595344739696
2015-07-24,403878,13.176966385888765,3.393422716760914
2015-07-25,387034,12.608803903532998,23.89061898954578
2015-07-26,349537,13.084615219561853,3.316611860833042
2015-07-27,348629,13.161014746334889,3.1218255509437496
2015-07-28,384234,12.786799242128458,2.884974598812275
2015-07-29,405923,12.855743527713356,2.869082067288611
2015-07-30,390844,13.643239681305039,2.9365224744399048
2015-07-31,397815,14.078646054070324,33.80260382338488
