pickup_datetime,n. trips,price,distance
2015-10-01,394043,13.962517567879605,10.665816319538784
2015-10-02,414289,13.265911501391498,2.891695169314202
2015-10-03,412691,11.949912258808627,6.850586467841227
2015-10-04,365206,13.07083262596997,3.2545758010547674
2015-10-05,344810,12.931851077404907,6.989518662451956
2015-10-06,374278,12.946541180619722,10.979169654641685
2015-10-07,390959,13.495234692128813,3.0102950693038397
2015-10-08,407578,13.72093977103765,3.0537799145194167
2015-10-09,402648,13.91975253819709,3.074957357294802
2015-10-10,432672,12.839573672435442,2.9735564815841853
2015-10-11,378262,13.649434043070645,3.3341782150995147
2015-10-12,328405,13.423256375511919,3.371189659109938
2015-10-13,379473,13.318767870177824,3.041565223349149
2015-10-14,392801,13.416414571245971,2.9942404678196373
2015-10-15,407496,13.770598337161553,10.420384568192084
2015-10-16,430414,13.548175570497204,3.018252682301149
2015-10-17,459236,12.441615291484082,2.8326969357802985
2015-10-18,400212,13.241216830080033,3.2507403576104323
2015-10-19,366862,13.201457169180754,3.1249387508110105
2015-10-20,377804,13.261254327640742,2.9539000645837272
2015-10-21,389756,13.718784495941025,2.989711178275638
2015-10-22,410692,13.67779411335011,6.3701071362480794
2015-10-23,428675,13.553203685775905,3.0143555607395376
2015-10-24,436244,13.204983151630715,9.775210570231053
2015-10-25,390337,13.146900037659735,3.2800817754914218
2015-10-26,356914,13.278230526121112,3.1251008926521013
2015-10-27,381755,13.018621209938283,2.8898857120403747
2015-10-28,386939,13.363088212870727,2.8293289381530355
2015-10-29,403670,14.018508212153447,3.056532613273189
2015-10-30,428785,13.755674825378646,2.9811222873933576
2015-10-31,441582,12.37426299079216,2.99015571286891
