pickup_datetime,n. trips,price,distance
2015-05-01,461547,13.320663117732273,3.2973256244759255
2015-05-02,507619,12.223464232032258,65.75921714908195
2015-05-03,434789,13.347524960383053,21.689065132743515
2015-05-04,390266,13.310247062260064,3.1220065032567543
2015-05-05,432452,12.825263589947511,2.920268584721588
2015-05-06,444948,13.060438770373127,21.657263792621823
2015-05-07,442222,13.635058635707805,3.0278561898774994
2015-05-08,449009,13.372183720148096,2.9944551445517673
2015-05-09,469017,12.42231012948354,3.9637350032088223
2015-05-10,405427,13.131131646387603,3.2879797102807142
2015-05-11,395280,13.292097070431046,3.1113298927342585
2015-05-12,424512,13.326462597052576,2.9662025572893786
2015-05-13,439371,13.644668309924816,3.013146270463981
2015-05-14,439936,14.225445655731697,6.4525490980505795
2015-05-15,457541,13.874626164649667,3.1670612032584833
2015-05-16,479580,13.202818841486252,28.65510094249117
2015-05-17,423198,13.603307269883087,3.3911757144411223
2015-05-18,403641,13.353086752832306,3.1209759662670598
2015-05-19,432943,13.519293001619104,34.985551123357794
2015-05-20,441232,13.597186650106924,3.2007114171230113
2015-05-21,446819,13.605995224016835,3.0230236852058265
2015-05-22,419629,13.283709276527565,10.240163692213384
2015-05-23,383363,12.432653203360752,22.737707160053322
2015-05-24,336652,12.61913005121011,29.36254390290235
2015-05-25,301706,13.327928579478014,5.729822774489098
2015-05-26,387134,13.136643694431351,3.0669600190115576
2015-05-27,415919,13.172136185170633,39.102920111848555
2015-05-28,432112,13.495516069907758,3.021087842966643
2015-05-29,441299,13.322475713745062,2.9722119243415914
2015-05-30,451080,12.670873038042,5.3483488294759285
2015-05-31,368019,14.069834356378305,74.75849480597697
