pickup_datetime,n. trips,price,distance
2015-11-01,390105,13.630845105804815,3.383905589520746
2015-11-02,348560,13.69493590773465,4.025528689465311
2015-11-03,364999,13.218320077589219,2.9526909388792815
2015-11-04,384089,13.295586231316147,2.9360287849951656
2015-11-05,402181,13.718217693028711,4.306203326363161
2015-11-06,419288,13.480477857701587,31.147359666863455
2015-11-07,443933,12.425708361396852,2.8019889713087616
2015-11-08,392409,13.208530996995462,12.010514361290904
2015-11-09,352729,13.331268055646094,49.848245111685216
2015-11-10,378051,13.347783050434966,11.823951900669515
2015-11-11,372002,13.599291267251227,3.0022484018902995
2015-11-12,406649,13.560020730408738,19.445181249675883
2015-11-13,427717,13.285576911836527,2.9469407107970818
2015-11-14,446987,12.490061858622262,2.8005891446506688
2015-11-15,381213,13.365768323745485,3.3698601306881297
2015-11-16,347615,13.452371733095498,3.218945011003604
2015-11-17,384488,13.099343048417595,2.897944643265914
2015-11-18,391321,13.436196932952699,2.926001211281837
2015-11-19,394591,13.846855858344428,2.9317156498754473
2015-11-20,422421,13.738937505474363,3.0829668979526423
2015-11-21,439304,12.30202185730152,2.819816846648437
2015-11-22,376593,12.607752587010351,34.96888356926421
2015-11-23,366012,12.384122952252904,2.7825759537938564
2015-11-24,377950,13.017484826035147,6.387016377827705
2015-11-25,358723,13.523274671543188,557.6070528513743
2015-11-26,242393,12.606557326325415,20.54534470879959
2015-11-27,275078,11.600929590879666,8.780151011712954
2015-11-28,344527,12.374626545960087,17.98760500628387
2015-11-29,333746,13.381608079197933,3.4111479088888355
2015-11-30,347002,13.47437660301667,12.843833868393066
