pickup_datetime,n. trips,price,distance
2014-02-01,533783,11.66935282689782,2.6683142400563704
2014-02-02,464225,11.818760536377837,2.938030653239303
2014-02-03,382517,11.991616137322005,2.87642353150318
2014-02-04,454444,12.093126127751713,2.7498352492276914
2014-02-05,413853,11.553309218490625,2.563866686963682
2014-02-06,478790,12.81987426637983,2.805764677624905
2014-02-07,512218,12.600088946503247,2.7546977068357985
2014-02-08,549967,11.460329983435372,2.61354339442182
2014-02-09,466492,11.846333077523306,2.92122276480635
2014-02-10,435911,12.100635152588488,2.781288818130316
2014-02-11,489373,12.054596923001471,2.619890512962579
2014-02-12,481968,12.454526607575604,2.704277005942249
2014-02-13,326187,11.140053711521308,2.624996183170955
2014-02-14,472229,12.686881915341926,2.8669739046099045
2014-02-15,491375,11.505373452047827,2.730041353345265
2014-02-16,457332,11.660077886524455,2.8536460601925615
2014-02-17,391723,12.013999126934085,2.9978695915225266
2014-02-18,419655,12.086690257473402,2.803025127783552
2014-02-19,446126,12.741120042319883,2.7676771360557217
2014-02-20,466020,12.728851701643707,2.8362519205185084
2014-02-21,503515,12.169909655124476,2.74844413771184
2014-02-22,522080,11.936215828991726,2.795342476248884
2014-02-23,442458,12.51848374308974,3.126542587093074
2014-02-24,439480,12.034400700828252,2.849953240192856
2014-02-25,472383,11.847014795197964,2.6967199708710616
2014-02-26,492982,11.915173840018499,2.713058164395547
2014-02-27,512342,12.218254252042582,2.7624798669638513
2014-02-28,544363,12.20926679440006,2.760871936557235
