{
    "DataLicense": "LicenseRef-Unisoc-General-1.0",
    "DataCopyright": "2022 Unisoc (Shanghai) Technologies Co., Ltd.",
    "name": "Pipeline_Rear_Auto_Capture",
    "stream": "capture_stream",
    "nodes": [
        {
            "type": "DummyNode",
            "vendor": "SPRD",
            "id": "SourceNode0"
        },
        {
            "type": "DummyNode",
            "vendor": "SPRD",
            "id": "SourceNode2"
        },
        {
            "type": "DummyNode",
            "vendor": "SPRD",
            "id": "SourceNode3"
        },
        {
            "type": "DummyNode",
            "vendor": "SPRD",
            "id": "SinkNode"
        },
        {
            "type": "MultiFrameRouterNode",
            "vendor": "SPRD",
            "id": "cap_MF_router"
        },
        {
            "type": "DeWarpingNode",
            "vendor": "SPRD",
            "id": "cap_DeWarping"
        },
        {
            "type": "MFNRNode",
            "vendor": "SPRD",
            "id": "cap_MFNR"
        },
        {
            "type": "HDR3Node",
            "vendor": "SPRD",
            "id": "cap_HDR3"
        },
        {
            "type": "YNRCNRNode",
            "vendor": "SPRD",
            "id": "cap_YNRCNR"
        },
        {
            "type": "YNRCNRNode",
            "vendor": "SPRD",
            "id": "cap_YNRCNR_MFSR"
        },
        {
            "type": "DeWarpPortraitNode",
            "vendor": "SPRD",
            "id": "cap_DeWarpPortrait"
        },
        {
            "type": "FaceBeautyNode",
            "vendor": "SPRD",
            "id": "cap_FaceBeauty"
        },
        {
            "type": "WaterMarkNode",
            "vendor": "SPRD",
            "id": "cap_WaterMark"
        },
        {
            "type": "MfsrNode",
            "vendor": "SPRD",
            "id": "cap_MFSR"
        },
        {
            "type": "PCCNode",
            "vendor": "SPRD",
            "id": "cap_PCC"
        },
        {
            "type": "FilterCapNode",
            "vendor": "SPRD",
            "id": "cap_Filter"
        },
        {
            "type": "JpegNode",
            "vendor": "SPRD",
            "id": "cap_Jpeg"
        }
    ],
    "rootNodes": ["SourceNode0", "SourceNode2", "SourceNode3"],
    "linkages": [
        {
            "from": {
                "name": "SourceNode0",
                "port": "result_out"
            },
            "to": {
                "name": "cap_MF_router",
                "port": "cin0"
            }
        },
        {
            "from": {
                "name": "SourceNode2",
                "port": "result_out"
            },
            "to": {
                "name": "cap_DeWarping",
                "port": "in0"
            }
        },
        {
            "from": {
                "name": "SourceNode3",
                "port": "result_out"
            },
            "to": {
                "name": "cap_MF_router",
                "port": "cin0"
            }
        },
        {
            "from": {
                "name": "cap_DeWarping",
                "port": "out0"
            },
            "to": {
                "name": "cap_MF_router",
                "port": "cin0"
            }
        },
        {
            "from": {
                "name": "cap_MF_router",
                "port": "flash"
            },
            "to": {
                "name": "cap_YNRCNR",
                "port": "in0"
            }
        },
        {
            "from": {
                "name": "cap_MF_router",
                "port": "single"
            },
            "to": {
                "name": "cap_YNRCNR",
                "port": "in0"
            }
        },
        {
            "from": {
                "name": "cap_MF_router",
                "port": "hdr"
            },
            "to": {
                "name": "cap_HDR3",
                "port": "in0"
            }
        },
        {
            "from": {
                "name": "cap_HDR3",
                "port": "out0"
            },
            "to": {
                "name": "cap_YNRCNR",
                "port": "in0"
            }
        },
        {
            "from": {
                "name": "cap_MF_router",
                "port": "mfnr"
            },
            "to": {
                "name": "cap_MFNR",
                "port": "in0"
            }
        },
        {
            "from": {
                "name": "cap_MFNR",
                "port": "out0"
            },
            "to": {
                "name": "cap_YNRCNR",
                "port": "in0"
            }
        },
        {
            "from": {
                "name": "cap_MF_router",
                "port": "mfsr"
            },
            "to": {
                "name": "cap_MFSR",
                "port": "mfsr_in"
            }
        },
        {
            "from": {
                "name": "cap_MFSR",
                "port": "mfsr_out"
            },
            "to": {
                "name": "cap_YNRCNR_MFSR",
                "port": "in0"
            }
        },
        {
            "from": {
                "name": "cap_YNRCNR_MFSR",
                "port": "out0"
            },
            "to": {
                "name": "cap_MFSR",
                "port": "mfsr_post_in"
            }
        },
        {
            "from": {
                "name": "cap_MFSR",
                "port": "mfsr_post_out"
            },
            "to": {
                "name": "cap_DeWarpPortrait",
                "port": "in0"
            }
        },
        {
            "from": {
                "name": "cap_YNRCNR",
                "port": "out0"
            },
            "to": {
                "name": "cap_DeWarpPortrait",
                "port": "in0"
            }
        },
        {
            "from": {
                "name": "cap_DeWarpPortrait",
                "port": "out0"
            },
            "to": {
                "name": "cap_PCC",
                "port": "in0"
            }
        },
        {
            "from": {
                "name": "cap_PCC",
                "port": "out0"
            },
            "to": {
                "name": "cap_FaceBeauty",
                "port": "in0"
            }
        },
        {
            "from": {
                "name": "cap_FaceBeauty",
                "port": "out0"
            },
            "to": {
                "name": "cap_Filter",
                "port": "in0"
            }
        },
        {
            "from": {
                "name": "cap_Filter",
                "port": "out0"
            },
            "to": {
                "name": "cap_WaterMark",
                "port": "in0"
            }
        },
        {
            "from": {
                "name": "cap_WaterMark",
                "port": "out0"
            },
            "to": {
                "name": "cap_Jpeg",
                "port": "in0"
            }
        },
        {
            "from": {
                "name": "cap_Jpeg",
                "port": "out0"
            },
            "to": {
                "name": "SinkNode",
                "port": "in0"
            }
        }
    ]
}
