{
    "DataLicense": "LicenseRef-Unisoc-General-1.0",
    "DataCopyright": "2022 Unisoc (Shanghai) Technologies Co., Ltd.",
    "name": "Pipeline_Ultrawide_Preview",
    "stream": "preview_stream",
    "nodes": [
        {
            "type": "DummyNode",
            "vendor": "SPRD",
            "id": "SourceNode0"
        },
        {
            "type": "DummyNode",
            "vendor": "SPRD",
            "id": "SourceNode1"
        },
        {
            "type": "DummyNode",
            "vendor": "SPRD",
            "id": "SourceNode2"
        },
        {
            "type": "DummyNode",
            "vendor": "SPRD",
            "id": "SourceNode3"
        },
        {
            "type": "DummyNode",
            "vendor": "SPRD",
            "id": "SinkNode"
        },
        {
            "type": "DeWarpingNode",
            "vendor": "SPRD",
            "id": "prev_DeWarping"
        },
        {
            "type": "FaceBeautyNode",
            "vendor": "SPRD",
            "id": "prev_FaceBeauty"
        }
    ],
    "rootNodes": ["SourceNode0","SourceNode2"],
    "linkages": [
        {
            "from": {
                "name": "SourceNode0",
                "port": "result_out"
            },
            "to": {
                "name": "prev_FaceBeauty",
                "port": "in0"
            }
        },
        {
            "from": {
                "name": "SourceNode2",
                "port": "result_out"
            },
            "to": {
                "name": "prev_DeWarping",
                "port": "in0"
            }
        },
        {
            "from": {
                "name": "prev_DeWarping",
                "port": "out0"
            },
            "to": {
                "name": "prev_FaceBeauty",
                "port": "in0"
            }
        },
        {
            "from": {
                "name": "prev_FaceBeauty",
                "port": "out0"
            },
            "to": {
                "name": "SinkNode",
                "port": "in0"
            }
        }
    ]
}
