{
    "DataLicense": "LicenseRef-Unisoc-General-1.0",
    "DataCopyright": "2023 Unisoc (Shanghai) Technologies Co., Ltd.",
    "name": "Pipeline_Rear_Simple_Preview",
    "stream": "preview_stream",
    "nodes": [
        {
            "type": "DummyNode",
            "vendor": "SPRD",
            "id": "SourceNode0"
        },
        {
            "type": "DummyNode",
            "vendor": "SPRD",
            "id": "SourceNode2"
        },
        {
            "type": "DummyNode",
            "vendor": "SPRD",
            "id": "SourceNode3"
        },
        {
            "type": "DummyNode",
            "vendor": "SPRD",
            "id": "SourceNode4"
        },
        {
            "type": "DummyNode",
            "vendor": "SPRD",
            "id": "SinkNode"
        }
    ],
    "rootNodes": ["SourceNode0", "SourceNode2", "SourceNode3", "SourceNode4"],
    "linkages": [
        {
            "from": {
                "name": "SourceNode0",
                "port": "result_out"
            },
            "to": {
                "name": "SinkNode",
                "port": "in0"
            }
        },
        {
            "from": {
                "name": "SourceNode2",
                "port": "result_out"
            },
            "to": {
                "name": "SinkNode",
                "port": "in0"
            }
        },
        {
            "from": {
                "name": "SourceNode3",
                "port": "result_out"
            },
            "to": {
                "name": "SinkNode",
                "port": "in0"
            }
        },
        {
            "from": {
                "name": "SourceNode4",
                "port": "result_out"
            },
            "to": {
                "name": "SinkNode",
                "port": "in0"
            }
        }
    ]
}
