{
    "DataLicense": "LicenseRef-Unisoc-General-1.0",
    "DataCopyright": "2023 Unisoc (Shanghai) Technologies Co., Ltd.",
    "session": {
        "name": "Session_Rear_RawMFNR",
        "usecase": {
            "facing": "rear",
            "stream_list": [
                {
                    "dir": "output",
                    "max_width": 1440,
                    "max_height": 1080,
                    "formats": [ "NV12" ]
                },
                {
                    "dir": "output",
                    "max_width": 4000,
                    "max_height": 3000,
                    "formats": [ "JPEG" ]
                },
                {
                    "dir": "output",
                    "max_width": 320,
                    "max_height": 240,
                    "formats": [ "NV12"]
                },
                {
                    "dir": "output",
                    "max_width": 8000,
                    "max_height": 6000,
                    "formats": [ "RAW"]
                }
            ]
        },
        "pipeline": [
            "Pipeline_Rear_NightPro_Raw_Yuv_Capture",
            "Pipeline_Rear_Simple_Preview",
            "Pipeline_Async",
            "Pipeline_Rear_NightPro_Raw_Capture"
        ]
    }
}
