{
    "DataLicense": "LicenseRef-Unisoc-General-1.0",
    "DataCopyright": "2022 Unisoc (Shanghai) Technologies Co., Ltd.",
    "name": "Pipeline_ThirdParty_Auto_Capture",
    "stream": "capture_stream",
    "nodes": [
        {
            "type": "DummyNode",
            "vendor": "SPRD",
            "id": "SourceNode0"
        },
        {
            "type": "DummyNode",
            "vendor": "SPRD",
            "id": "SourceNode1"
        },
        {
            "type": "DummyNode",
            "vendor": "SPRD",
            "id": "SourceNode2"
        },
        {
            "type": "DummyNode",
            "vendor": "SPRD",
            "id": "SourceNode3"
        },
        {
            "type": "DummyNode",
            "vendor": "SPRD",
            "id": "SinkNode"
        },
        {
            "type": "ThirdpartyRouterNode",
            "vendor": "SPRD",
            "id": "third_party_router"
        },
        {
            "type": "ThirdpartyRouterNode",
            "vendor": "SPRD",
            "id": "output_router"
        },
        {
            "type": "MultiFrameRouterNode",
            "vendor": "SPRD",
            "id": "cap_MF_router"
        },
        {
            "type": "MFNRNode",
            "vendor": "SPRD",
            "id": "cap_MFNR"
        },
        {
            "type": "HDR4Node",
            "vendor": "SPRD",
            "id": "cap_HDR"
        },
        {
            "type": "YNRCNRNode",
            "vendor": "SPRD",
            "id": "cap_YNRCNR"
        },
        {
            "type": "FaceBeautyNode",
            "vendor": "SPRD",
            "id": "cap_FaceBeauty"
        },
        {
            "type": "JpegNode",
            "vendor": "SPRD",
            "id": "cap_Jpeg"
        }
    ],
    "rootNodes": ["SourceNode0","SourceNode1","SourceNode2","SourceNode3"],
    "linkages": [
        {
            "from": {
                "name": "SourceNode0",
                "port": "result_out"
            },
            "to": {
                "name": "third_party_router",
                "port": "in0"
            }
        },
        {
            "from": {
                "name": "SourceNode1",
                "port": "result_out"
            },
            "to": {
                "name": "third_party_router",
                "port": "in0"
            }
        },
        {
            "from": {
                "name": "SourceNode2",
                "port": "result_out"
            },
            "to": {
                "name": "third_party_router",
                "port": "in0"
            }
        },
        {
            "from": {
                "name": "SourceNode3",
                "port": "result_out"
            },
            "to": {
                "name": "third_party_router",
                "port": "in0"
            }
        },
        {
            "from": {
                "name": "third_party_router",
                "port": "xts"
            },
            "to": {
                "name": "cap_Jpeg",
                "port": "in0"
            }
        },
        {
            "from": {
                "name": "third_party_router",
                "port": "camera_go"
            },
            "to": {
                "name": "cap_MF_router",
                "port": "cin0"
            }
        },
        {
            "from": {
                "name": "third_party_router",
                "port": "default"
            },
            "to": {
                "name": "cap_MF_router",
                "port": "cin0"
            }
        },
        {
            "from": {
                "name": "cap_MF_router",
                "port": "mfnr"
            },
            "to": {
                "name": "cap_MFNR",
                "port": "in0"
            }
        },
        {
            "from": {
                "name": "cap_MFNR",
                "port": "out0"
            },
            "to": {
                "name": "output_router",
                "port": "in0"
            }
        },
        {
            "from": {
                "name": "cap_MF_router",
                "port": "hdr"
            },
            "to": {
                "name": "cap_HDR",
                "port": "in0"
            }
        },
        {
            "from": {
                "name": "cap_HDR",
                "port": "out0"
            },
            "to": {
                "name": "output_router",
                "port": "in0"
            }
        },
        {
            "from": {
                "name": "cap_MF_router",
                "port": "single"
            },
            "to": {
                "name": "output_router",
                "port": "in0"
            }
        },
        {
            "from": {
                "name": "cap_MF_router",
                "port": "flash"
            },
            "to": {
                "name": "output_router",
                "port": "in0"
            }
        },
        {
            "from": {
                "name": "output_router",
                "port": "camera_go"
            },
            "to": {
                "name": "cap_Jpeg",
                "port": "in0"
            }
        },
        {
            "from": {
                "name": "output_router",
                "port": "default"
            },
            "to": {
                "name": "cap_YNRCNR",
                "port": "in0"
            }
        },
        {
            "from": {
                "name": "cap_YNRCNR",
                "port": "out0"
            },
            "to": {
                "name": "cap_FaceBeauty",
                "port": "in0"
            }
        },
        {
            "from": {
                "name": "cap_FaceBeauty",
                "port": "out0"
            },
            "to": {
                "name": "cap_Jpeg",
                "port": "in0"
            }
        },
        {
            "from": {
                "name": "cap_Jpeg",
                "port": "out0"
            },
            "to": {
                "name": "SinkNode",
                "port": "in0"
            }
        }
    ]
}
