{
    "DataLicense": "LicenseRef-Unisoc-General-1.0",
    "DataCopyright": "2023 Unisoc (Shanghai) Technologies Co., Ltd.",
    "name": "Pipeline_Single_Portrait_Preview",
    "stream": "preview_stream",
    "nodes": [
        {
            "type": "DummyNode",
            "vendor": "SPRD",
            "id": "SourceNode0"
        },
        {
            "type": "DummyNode",
            "vendor": "SPRD",
            "id": "SourceNode1"
        },
        {
            "type": "DummyNode",
            "vendor": "SPRD",
            "id": "SinkNode"
        },
        {
            "type": "FaceBeautyNode",
            "vendor": "SPRD",
            "id": "prev_FaceBeauty"
        },
        {
            "type": "ArcPrevBokehNode",
            "vendor": "SPRD",
            "id": "prev_PrevBlur"
        },
        {
            "type": "LptNode",
            "vendor": "SPRD",
            "id": "prev_Lpt"
        }
    ],
    "rootNodes": ["SourceNode0","SourceNode1"],
    "linkages": [
        {
            "from": {
                "name": "SourceNode0",
                "port": "result_out"
            },
            "to": {
                "name": "prev_PrevBlur",
                "port": "in0"
            }
        },
        {
            "from": {
                "name": "SourceNode1",
                "port": "result_out"
            },
            "to": {
                "name": "prev_PrevBlur",
                "port": "in0"
            }
        },
        {
            "from": {
                "name": "prev_PrevBlur",
                "port": "out0"
            },
            "to": {
                "name": "prev_FaceBeauty",
                "port": "in0"
            }
        },
		{
            "from": {
                "name": "prev_FaceBeauty",
                "port": "out0"
            },
            "to": {
                "name": "prev_Lpt",
                "port": "in0"
            }
        },
        {
            "from": {
                "name": "prev_Lpt",
                "port": "out0"
            },
            "to": {
                "name": "SinkNode",
                "port": "in0"
            }
        }
    ]
}
