{
  "flag_artifacts": [
    {
      "flag_declaration": {
        "name": "RELEASE_ACONFIG_FLAG_DEFAULT_PERMISSION",
        "namespace": "android_UNKNOWN",
        "description": "The default permission for all flags",
        "value": {
          "Val": {
            "StringValue": "READ_WRITE"
          }
        },
        "workflow": 3,
        "containers": [
          "product",
          "system",
          "system_ext",
          "vendor"
        ]
      },
      "value": {
        "Val": {
          "StringValue": "READ_ONLY"
        }
      }
    },
    {
      "flag_declaration": {
        "name": "RELEASE_ACONFIG_VALUE_SETS",
        "namespace": "android_UNKNOWN",
        "description": "Aconfig value sets assembled by release-config",
        "value": {
          "Val": {
            "UnspecifiedValue": false
          }
        },
        "workflow": 3,
        "containers": [
          "system",
          "system_ext",
          "product",
          "vendor"
        ]
      },
      "value": {
        "Val": {
          "StringValue": "aconfig_value_set-platform_build_release-root aconfig_value_set-platform_build_release-ap3a aconfig_value_set-platform_device_moto_release-a15r0"
        }
      }
    },
    {
      "flag_declaration": {
        "name": "RELEASE_AIDL_USE_UNFROZEN",
        "namespace": "android_UNKNOWN",
        "description": "Enables the use of the unfrozen versions of AIDL interfaces. When this is `False` the libraries of the latest unfrozen version of a stable interface will behave like the last frozen version. When this is `True` the libraries behave like the lastest unfrozen version like they always have.",
        "value": {
          "Val": {
            "BoolValue": true
          }
        },
        "workflow": 1,
        "containers": [
          "product",
          "system",
          "system_ext",
          "vendor"
        ]
      },
      "value": {
        "Val": {
          "BoolValue": false
        }
      }
    },
    {
      "flag_declaration": {
        "name": "RELEASE_APEX_BOOT_JARS_PREBUILT_EXCLUDED_LIST",
        "namespace": "android_UNKNOWN",
        "description": "jars need to be excluded from Apex Boot Jars for targets with mainline prebuilts enabled.",
        "value": {
          "Val": {
            "StringValue": ""
          }
        },
        "workflow": 2,
        "containers": [
          "product",
          "system",
          "system_ext",
          "vendor"
        ]
      },
      "value": {
        "Val": {
          "StringValue": ""
        }
      }
    },
    {
      "flag_declaration": {
        "name": "RELEASE_APEX_CONTRIBUTIONS_ADBD",
        "namespace": "android_UNKNOWN",
        "description": "The contributions made by apexes (source or prebuilts) to the rest of the build.",
        "value": {
          "Val": {
            "UnspecifiedValue": false
          }
        },
        "workflow": 2,
        "containers": [
          "product",
          "system",
          "system_ext",
          "vendor"
        ]
      },
      "value": {
        "Val": {
          "StringValue": "adbd.google.contributions.prebuilt"
        }
      }
    },
    {
      "flag_declaration": {
        "name": "RELEASE_APEX_CONTRIBUTIONS_ADSERVICES",
        "namespace": "android_UNKNOWN",
        "description": "",
        "value": {
          "Val": {
            "UnspecifiedValue": false
          }
        },
        "workflow": 2,
        "containers": [
          "product",
          "system",
          "system_ext",
          "vendor"
        ]
      },
      "value": {
        "Val": {
          "StringValue": "adservices.google.contributions.prebuilt"
        }
      }
    },
    {
      "flag_declaration": {
        "name": "RELEASE_APEX_CONTRIBUTIONS_APPSEARCH",
        "namespace": "android_UNKNOWN",
        "description": "",
        "value": {
          "Val": {
            "UnspecifiedValue": false
          }
        },
        "workflow": 2,
        "containers": [
          "product",
          "system",
          "system_ext",
          "vendor"
        ]
      },
      "value": {
        "Val": {
          "StringValue": "appsearch.google.contributions.prebuilt"
        }
      }
    },
    {
      "flag_declaration": {
        "name": "RELEASE_APEX_CONTRIBUTIONS_ART",
        "namespace": "android_UNKNOWN",
        "description": "",
        "value": {
          "Val": {
            "UnspecifiedValue": false
          }
        },
        "workflow": 2,
        "containers": [
          "product",
          "system",
          "system_ext",
          "vendor"
        ]
      },
      "value": {
        "Val": {
          "StringValue": "art.google.contributions.prebuilt"
        }
      }
    },
    {
      "flag_declaration": {
        "name": "RELEASE_APEX_CONTRIBUTIONS_BLUETOOTH",
        "namespace": "android_UNKNOWN",
        "description": "",
        "value": {
          "Val": {
            "UnspecifiedValue": false
          }
        },
        "workflow": 2,
        "containers": [
          "product",
          "system",
          "system_ext",
          "vendor"
        ]
      },
      "value": {
        "Val": null
      }
    },
    {
      "flag_declaration": {
        "name": "RELEASE_APEX_CONTRIBUTIONS_CAPTIVEPORTALLOGIN",
        "namespace": "android_UNKNOWN",
        "description": "",
        "value": {
          "Val": {
            "UnspecifiedValue": false
          }
        },
        "workflow": 2,
        "containers": [
          "product",
          "system",
          "system_ext",
          "vendor"
        ]
      },
      "value": {
        "Val": {
          "StringValue": "captiveportallogin.google.contributions.prebuilt"
        }
      }
    },
    {
      "flag_declaration": {
        "name": "RELEASE_APEX_CONTRIBUTIONS_CELLBROADCAST",
        "namespace": "android_UNKNOWN",
        "description": "",
        "value": {
          "Val": {
            "UnspecifiedValue": false
          }
        },
        "workflow": 2,
        "containers": [
          "product",
          "system",
          "system_ext",
          "vendor"
        ]
      },
      "value": {
        "Val": {
          "StringValue": "cellbroadcast.google.contributions.prebuilt"
        }
      }
    },
    {
      "flag_declaration": {
        "name": "RELEASE_APEX_CONTRIBUTIONS_CONFIGINFRASTRUCTURE",
        "namespace": "android_UNKNOWN",
        "description": "",
        "value": {
          "Val": {
            "UnspecifiedValue": false
          }
        },
        "workflow": 2,
        "containers": [
          "product",
          "system",
          "system_ext",
          "vendor"
        ]
      },
      "value": {
        "Val": {
          "StringValue": "configinfrastructure.google.contributions.prebuilt"
        }
      }
    },
    {
      "flag_declaration": {
        "name": "RELEASE_APEX_CONTRIBUTIONS_CONNECTIVITY",
        "namespace": "android_UNKNOWN",
        "description": "",
        "value": {
          "Val": {
            "UnspecifiedValue": false
          }
        },
        "workflow": 2,
        "containers": [
          "product",
          "system",
          "system_ext",
          "vendor"
        ]
      },
      "value": {
        "Val": {
          "StringValue": "connectivity.google.contributions.prebuilt"
        }
      }
    },
    {
      "flag_declaration": {
        "name": "RELEASE_APEX_CONTRIBUTIONS_CONSCRYPT",
        "namespace": "android_UNKNOWN",
        "description": "",
        "value": {
          "Val": {
            "UnspecifiedValue": false
          }
        },
        "workflow": 2,
        "containers": [
          "product",
          "system",
          "system_ext",
          "vendor"
        ]
      },
      "value": {
        "Val": {
          "StringValue": "conscrypt.google.contributions.prebuilt"
        }
      }
    },
    {
      "flag_declaration": {
        "name": "RELEASE_APEX_CONTRIBUTIONS_CRASHRECOVERY",
        "namespace": "android_UNKNOWN",
        "description": "",
        "value": {
          "Val": {
            "UnspecifiedValue": false
          }
        },
        "workflow": 2,
        "containers": [
          "product",
          "system",
          "system_ext",
          "vendor"
        ]
      },
      "value": {
        "Val": null
      }
    },
    {
      "flag_declaration": {
        "name": "RELEASE_APEX_CONTRIBUTIONS_DEVICELOCK",
        "namespace": "android_UNKNOWN",
        "description": "",
        "value": {
          "Val": {
            "UnspecifiedValue": false
          }
        },
        "workflow": 2,
        "containers": [
          "product",
          "system",
          "system_ext",
          "vendor"
        ]
      },
      "value": {
        "Val": {
          "StringValue": "devicelock.google.contributions.prebuilt"
        }
      }
    },
    {
      "flag_declaration": {
        "name": "RELEASE_APEX_CONTRIBUTIONS_DOCUMENTSUIGOOGLE",
        "namespace": "android_UNKNOWN",
        "description": "",
        "value": {
          "Val": {
            "UnspecifiedValue": false
          }
        },
        "workflow": 2,
        "containers": [
          "product",
          "system",
          "system_ext",
          "vendor"
        ]
      },
      "value": {
        "Val": {
          "StringValue": "documentsui.google.contributions.prebuilt"
        }
      }
    },
    {
      "flag_declaration": {
        "name": "RELEASE_APEX_CONTRIBUTIONS_EXTSERVICES",
        "namespace": "android_UNKNOWN",
        "description": "",
        "value": {
          "Val": {
            "UnspecifiedValue": false
          }
        },
        "workflow": 2,
        "containers": [
          "product",
          "system",
          "system_ext",
          "vendor"
        ]
      },
      "value": {
        "Val": {
          "StringValue": "extservices.google.contributions.prebuilt"
        }
      }
    },
    {
      "flag_declaration": {
        "name": "RELEASE_APEX_CONTRIBUTIONS_HEALTHFITNESS",
        "namespace": "android_UNKNOWN",
        "description": "",
        "value": {
          "Val": {
            "UnspecifiedValue": false
          }
        },
        "workflow": 2,
        "containers": [
          "product",
          "system",
          "system_ext",
          "vendor"
        ]
      },
      "value": {
        "Val": {
          "StringValue": "healthfitness.google.contributions.prebuilt"
        }
      }
    },
    {
      "flag_declaration": {
        "name": "RELEASE_APEX_CONTRIBUTIONS_IPSEC",
        "namespace": "android_UNKNOWN",
        "description": "",
        "value": {
          "Val": {
            "UnspecifiedValue": false
          }
        },
        "workflow": 2,
        "containers": [
          "product",
          "system",
          "system_ext",
          "vendor"
        ]
      },
      "value": {
        "Val": {
          "StringValue": "ipsec.google.contributions.prebuilt"
        }
      }
    },
    {
      "flag_declaration": {
        "name": "RELEASE_APEX_CONTRIBUTIONS_MEDIA",
        "namespace": "android_UNKNOWN",
        "description": "",
        "value": {
          "Val": {
            "UnspecifiedValue": false
          }
        },
        "workflow": 2,
        "containers": [
          "product",
          "system",
          "system_ext",
          "vendor"
        ]
      },
      "value": {
        "Val": {
          "StringValue": "media.google.contributions.prebuilt"
        }
      }
    },
    {
      "flag_declaration": {
        "name": "RELEASE_APEX_CONTRIBUTIONS_MEDIAPROVIDER",
        "namespace": "android_UNKNOWN",
        "description": "",
        "value": {
          "Val": {
            "UnspecifiedValue": false
          }
        },
        "workflow": 2,
        "containers": [
          "product",
          "system",
          "system_ext",
          "vendor"
        ]
      },
      "value": {
        "Val": {
          "StringValue": "mediaprovider.google.contributions.prebuilt"
        }
      }
    },
    {
      "flag_declaration": {
        "name": "RELEASE_APEX_CONTRIBUTIONS_MODULE_METADATA",
        "namespace": "android_UNKNOWN",
        "description": "",
        "value": {
          "Val": {
            "UnspecifiedValue": false
          }
        },
        "workflow": 2,
        "containers": [
          "product",
          "system",
          "system_ext",
          "vendor"
        ]
      },
      "value": {
        "Val": {
          "StringValue": "modulemetadata.google.contributions.prebuilt"
        }
      }
    },
    {
      "flag_declaration": {
        "name": "RELEASE_APEX_CONTRIBUTIONS_NETWORKSTACKGOOGLE",
        "namespace": "android_UNKNOWN",
        "description": "",
        "value": {
          "Val": {
            "UnspecifiedValue": false
          }
        },
        "workflow": 2,
        "containers": [
          "product",
          "system",
          "system_ext",
          "vendor"
        ]
      },
      "value": {
        "Val": {
          "StringValue": "networkstack.google.contributions.prebuilt"
        }
      }
    },
    {
      "flag_declaration": {
        "name": "RELEASE_APEX_CONTRIBUTIONS_NEURALNETWORKS",
        "namespace": "android_UNKNOWN",
        "description": "",
        "value": {
          "Val": {
            "UnspecifiedValue": false
          }
        },
        "workflow": 2,
        "containers": [
          "product",
          "system",
          "system_ext",
          "vendor"
        ]
      },
      "value": {
        "Val": {
          "StringValue": "neuralnetworks.google.contributions.prebuilt"
        }
      }
    },
    {
      "flag_declaration": {
        "name": "RELEASE_APEX_CONTRIBUTIONS_ONDEVICEPERSONALIZATION",
        "namespace": "android_UNKNOWN",
        "description": "",
        "value": {
          "Val": {
            "UnspecifiedValue": false
          }
        },
        "workflow": 2,
        "containers": [
          "product",
          "system",
          "system_ext",
          "vendor"
        ]
      },
      "value": {
        "Val": {
          "StringValue": "ondevicepersonalization.google.contributions.prebuilt"
        }
      }
    },
    {
      "flag_declaration": {
        "name": "RELEASE_APEX_CONTRIBUTIONS_PERMISSION",
        "namespace": "android_UNKNOWN",
        "description": "",
        "value": {
          "Val": {
            "UnspecifiedValue": false
          }
        },
        "workflow": 2,
        "containers": [
          "product",
          "system",
          "system_ext",
          "vendor"
        ]
      },
      "value": {
        "Val": {
          "StringValue": "permission.google.contributions.prebuilt"
        }
      }
    },
    {
      "flag_declaration": {
        "name": "RELEASE_APEX_CONTRIBUTIONS_REMOTEKEYPROVISIONING",
        "namespace": "android_UNKNOWN",
        "description": "",
        "value": {
          "Val": {
            "UnspecifiedValue": false
          }
        },
        "workflow": 2,
        "containers": [
          "product",
          "system",
          "system_ext",
          "vendor"
        ]
      },
      "value": {
        "Val": null
      }
    },
    {
      "flag_declaration": {
        "name": "RELEASE_APEX_CONTRIBUTIONS_RESOLV",
        "namespace": "android_UNKNOWN",
        "description": "",
        "value": {
          "Val": {
            "UnspecifiedValue": false
          }
        },
        "workflow": 2,
        "containers": [
          "product",
          "system",
          "system_ext",
          "vendor"
        ]
      },
      "value": {
        "Val": {
          "StringValue": "resolv.google.contributions.prebuilt"
        }
      }
    },
    {
      "flag_declaration": {
        "name": "RELEASE_APEX_CONTRIBUTIONS_SCHEDULING",
        "namespace": "android_UNKNOWN",
        "description": "",
        "value": {
          "Val": {
            "UnspecifiedValue": false
          }
        },
        "workflow": 2,
        "containers": [
          "product",
          "system",
          "system_ext",
          "vendor"
        ]
      },
      "value": {
        "Val": {
          "StringValue": "scheduling.google.contributions.prebuilt"
        }
      }
    },
    {
      "flag_declaration": {
        "name": "RELEASE_APEX_CONTRIBUTIONS_SDKEXTENSIONS",
        "namespace": "android_UNKNOWN",
        "description": "",
        "value": {
          "Val": {
            "UnspecifiedValue": false
          }
        },
        "workflow": 2,
        "containers": [
          "product",
          "system",
          "system_ext",
          "vendor"
        ]
      },
      "value": {
        "Val": {
          "StringValue": "sdkextensions.google.contributions.prebuilt"
        }
      }
    },
    {
      "flag_declaration": {
        "name": "RELEASE_APEX_CONTRIBUTIONS_STATSD",
        "namespace": "android_UNKNOWN",
        "description": "",
        "value": {
          "Val": {
            "UnspecifiedValue": false
          }
        },
        "workflow": 2,
        "containers": [
          "product",
          "system",
          "system_ext",
          "vendor"
        ]
      },
      "value": {
        "Val": {
          "StringValue": "statsd.google.contributions.prebuilt"
        }
      }
    },
    {
      "flag_declaration": {
        "name": "RELEASE_APEX_CONTRIBUTIONS_SWCODEC",
        "namespace": "android_UNKNOWN",
        "description": "",
        "value": {
          "Val": {
            "UnspecifiedValue": false
          }
        },
        "workflow": 2,
        "containers": [
          "product",
          "system",
          "system_ext",
          "vendor"
        ]
      },
      "value": {
        "Val": {
          "StringValue": "swcodec.google.contributions.prebuilt"
        }
      }
    },
    {
      "flag_declaration": {
        "name": "RELEASE_APEX_CONTRIBUTIONS_TZDATA",
        "namespace": "android_UNKNOWN",
        "description": "",
        "value": {
          "Val": {
            "UnspecifiedValue": false
          }
        },
        "workflow": 2,
        "containers": [
          "product",
          "system",
          "system_ext",
          "vendor"
        ]
      },
      "value": {
        "Val": {
          "StringValue": "tzdata.google.contributions.prebuilt"
        }
      }
    },
    {
      "flag_declaration": {
        "name": "RELEASE_APEX_CONTRIBUTIONS_UWB",
        "namespace": "android_UNKNOWN",
        "description": "",
        "value": {
          "Val": {
            "UnspecifiedValue": false
          }
        },
        "workflow": 2,
        "containers": [
          "product",
          "system",
          "system_ext",
          "vendor"
        ]
      },
      "value": {
        "Val": null
      }
    },
    {
      "flag_declaration": {
        "name": "RELEASE_APEX_CONTRIBUTIONS_WIFI",
        "namespace": "android_UNKNOWN",
        "description": "",
        "value": {
          "Val": {
            "UnspecifiedValue": false
          }
        },
        "workflow": 2,
        "containers": [
          "product",
          "system",
          "system_ext",
          "vendor"
        ]
      },
      "value": {
        "Val": {
          "StringValue": "wifi.google.contributions.prebuilt"
        }
      }
    },
    {
      "flag_declaration": {
        "name": "RELEASE_AVATAR_PICKER_APP",
        "namespace": "android_UNKNOWN",
        "description": "Move User avatar picker from SettingsLib to preinstalled app.",
        "value": {
          "Val": {
            "BoolValue": false
          }
        },
        "workflow": 1,
        "containers": [
          "product",
          "system",
          "system_ext",
          "vendor"
        ]
      },
      "value": {
        "Val": {
          "BoolValue": true
        }
      }
    },
    {
      "flag_declaration": {
        "name": "RELEASE_AVF_ENABLE_DEVICE_ASSIGNMENT",
        "namespace": "android_UNKNOWN",
        "description": "Enables assigning hardware devices to the guest VMs. If this flag is enabled, then RELEASE_AVF_ENABLE_MICRODROID_VENDOR_MODULES must also be enabled.",
        "value": {
          "Val": {
            "BoolValue": false
          }
        },
        "workflow": 1,
        "containers": [
          "product",
          "system",
          "system_ext",
          "vendor"
        ]
      },
      "value": {
        "Val": {
          "BoolValue": true
        }
      }
    },
    {
      "flag_declaration": {
        "name": "RELEASE_AVF_ENABLE_DICE_CHANGES",
        "namespace": "android_UNKNOWN",
        "description": "Enables new DICE functionality in Microdroid VMs.",
        "value": {
          "Val": {
            "BoolValue": false
          }
        },
        "workflow": 1,
        "containers": [
          "product",
          "system",
          "system_ext",
          "vendor"
        ]
      },
      "value": {
        "Val": {
          "BoolValue": true
        }
      }
    },
    {
      "flag_declaration": {
        "name": "RELEASE_AVF_ENABLE_LLPVM_CHANGES",
        "namespace": "android_UNKNOWN",
        "description": "Enables new llPvm functionality in Microdroid VMs.",
        "value": {
          "Val": {
            "BoolValue": false
          }
        },
        "workflow": 1,
        "containers": [
          "product",
          "system",
          "system_ext",
          "vendor"
        ]
      },
      "value": {
        "Val": {
          "BoolValue": true
        }
      }
    },
    {
      "flag_declaration": {
        "name": "RELEASE_AVF_ENABLE_REMOTE_ATTESTATION",
        "namespace": "android_UNKNOWN",
        "description": "Enables pVM remote attestation in Microdroid VM.",
        "value": {
          "Val": {
            "BoolValue": false
          }
        },
        "workflow": 1,
        "containers": [
          "product",
          "system",
          "system_ext",
          "vendor"
        ]
      },
      "value": {
        "Val": {
          "BoolValue": true
        }
      }
    },
    {
      "flag_declaration": {
        "name": "RELEASE_AVF_ENABLE_VENDOR_MODULES",
        "namespace": "android_UNKNOWN",
        "description": "Enables loading vendor modules (both kernel \u0026 userspace) in Microdroid VM.",
        "value": {
          "Val": {
            "BoolValue": false
          }
        },
        "workflow": 1,
        "containers": [
          "product",
          "system",
          "system_ext",
          "vendor"
        ]
      },
      "value": {
        "Val": {
          "BoolValue": true
        }
      }
    },
    {
      "flag_declaration": {
        "name": "RELEASE_AVF_ENABLE_VIRT_CPUFREQ",
        "namespace": "android_UNKNOWN",
        "description": "Enables Virtual Cpufreq support in Microdroid VM.",
        "value": {
          "Val": {
            "BoolValue": false
          }
        },
        "workflow": 1,
        "containers": [
          "product",
          "system",
          "system_ext",
          "vendor"
        ]
      },
      "value": {
        "Val": {
          "BoolValue": true
        }
      }
    },
    {
      "flag_declaration": {
        "name": "RELEASE_AVF_SUPPORT_CUSTOM_VM_WITH_PARAVIRTUALIZED_DEVICES",
        "namespace": "android_UNKNOWN",
        "description": "Enable running custom VMs with paravirtualized devices.",
        "value": {
          "Val": {
            "BoolValue": false
          }
        },
        "workflow": 1,
        "containers": [
          "product",
          "system",
          "system_ext",
          "vendor"
        ]
      },
      "value": {
        "Val": {
          "BoolValue": false
        }
      }
    },
    {
      "flag_declaration": {
        "name": "RELEASE_BINDER_DEATH_RECIPIENT_WEAK_FROM_JNI",
        "namespace": "android_UNKNOWN",
        "description": "If enabled, DeathRecipient is not strongly referenced from JNI.",
        "value": {
          "Val": {
            "BoolValue": false
          }
        },
        "workflow": 1,
        "containers": [
          "product",
          "system",
          "system_ext",
          "vendor"
        ]
      },
      "value": {
        "Val": {
          "BoolValue": true
        }
      }
    },
    {
      "flag_declaration": {
        "name": "RELEASE_BOARD_API_LEVEL",
        "namespace": "android_UNKNOWN",
        "description": "The API level of current vendor API surface. It has YYYYMM format.",
        "value": {
          "Val": {
            "StringValue": ""
          }
        },
        "workflow": 2,
        "containers": [
          "product",
          "system",
          "system_ext",
          "vendor"
        ]
      },
      "value": {
        "Val": {
          "StringValue": "202404"
        }
      }
    },
    {
      "flag_declaration": {
        "name": "RELEASE_BOARD_API_LEVEL_FROZEN",
        "namespace": "android_UNKNOWN",
        "description": "Set to True to freeze the board API level with vendor FRC",
        "value": {
          "Val": {
            "BoolValue": false
          }
        },
        "workflow": 1,
        "containers": [
          "product",
          "system",
          "system_ext",
          "vendor"
        ]
      },
      "value": {
        "Val": {
          "BoolValue": true
        }
      }
    },
    {
      "flag_declaration": {
        "name": "RELEASE_BUILD_FLAGS_IN_PROTOBUF",
        "namespace": "android_UNKNOWN",
        "description": "Enable protobuf version of build flag processing. When true, the canonical source of truth for build flags is in the protobuf version of the data.",
        "value": {
          "Val": {
            "BoolValue": true
          }
        },
        "workflow": 1,
        "containers": [
          "product",
          "system",
          "system_ext",
          "vendor"
        ]
      },
      "value": {
        "Val": {
          "BoolValue": true
        }
      }
    },
    {
      "flag_declaration": {
        "name": "RELEASE_CRASHRECOVERY_FILE_MOVE",
        "namespace": "android_UNKNOWN",
        "description": "If true, then files are moved from platform to apex",
        "value": {
          "Val": {
            "BoolValue": false
          }
        },
        "workflow": 1,
        "containers": [
          "product",
          "system",
          "system_ext",
          "vendor"
        ]
      },
      "value": {
        "Val": {
          "BoolValue": false
        }
      }
    },
    {
      "flag_declaration": {
        "name": "RELEASE_CRASHRECOVERY_MODULE",
        "namespace": "android_UNKNOWN",
        "description": "If true, then crashrecovery module is enabled as an apex",
        "value": {
          "Val": {
            "BoolValue": false
          }
        },
        "workflow": 1,
        "containers": [
          "product",
          "system",
          "system_ext",
          "vendor"
        ]
      },
      "value": {
        "Val": {
          "BoolValue": false
        }
      }
    },
    {
      "flag_declaration": {
        "name": "RELEASE_CREATE_ACONFIG_STORAGE_FILE",
        "namespace": "android_UNKNOWN",
        "description": "Enable build system to create new aconfig storage files.",
        "value": {
          "Val": {
            "BoolValue": false
          }
        },
        "workflow": 1,
        "containers": [
          "product",
          "system",
          "system_ext",
          "vendor"
        ]
      },
      "value": {
        "Val": {
          "BoolValue": false
        }
      }
    },
    {
      "flag_declaration": {
        "name": "RELEASE_DEFAULT_MODULE_BUILD_FROM_SOURCE",
        "namespace": "android_UNKNOWN",
        "description": "The behavior for the tree wrt building mainline modules or using prebuilts",
        "value": {
          "Val": {
            "BoolValue": true
          }
        },
        "workflow": 1,
        "containers": [
          "product",
          "system",
          "system_ext",
          "vendor"
        ]
      },
      "value": {
        "Val": {
          "BoolValue": true
        }
      }
    },
    {
      "flag_declaration": {
        "name": "RELEASE_DEPRECATE_VNDK",
        "namespace": "android_UNKNOWN",
        "description": "feature flag to deprecate VNDK",
        "value": {
          "Val": {
            "BoolValue": true
          }
        },
        "workflow": 1,
        "containers": [
          "product",
          "system",
          "system_ext",
          "vendor"
        ]
      },
      "value": {
        "Val": {
          "BoolValue": true
        }
      }
    },
    {
      "flag_declaration": {
        "name": "RELEASE_DISABLE_VERIFY_OVERLAPS_CHECK",
        "namespace": "android_UNKNOWN",
        "description": "Disable verify_overlaps check for mainline prebuilts. Only used in non-AOSP builds.",
        "value": {
          "Val": {
            "BoolValue": false
          }
        },
        "workflow": 1,
        "containers": [
          "product",
          "system",
          "system_ext",
          "vendor"
        ]
      },
      "value": {
        "Val": {
          "BoolValue": true
        }
      }
    },
    {
      "flag_declaration": {
        "name": "RELEASE_HARDWARE_BLUETOOTH_RANGING_SERVICE",
        "namespace": "android_UNKNOWN",
        "description": "Enables Bluetooth Ranging Service",
        "value": {
          "Val": {
            "BoolValue": true
          }
        },
        "workflow": 1,
        "containers": [
          "product",
          "system",
          "system_ext",
          "vendor"
        ]
      },
      "value": {
        "Val": {
          "BoolValue": true
        }
      }
    },
    {
      "flag_declaration": {
        "name": "RELEASE_HIDDEN_API_EXPORTABLE_STUBS",
        "namespace": "android_UNKNOWN",
        "description": "b/319697968: Flag to determine the dependency of hiddenapi to the stubs that contain all flagged apis (\"everything\" stubs), or to the stubs that contain only the enabled flagged apis (\"exportable\" stubs).",
        "value": {
          "Val": {
            "BoolValue": false
          }
        },
        "workflow": 1,
        "containers": [
          "product",
          "system",
          "system_ext",
          "vendor"
        ]
      },
      "value": {
        "Val": {
          "BoolValue": true
        }
      }
    },
    {
      "flag_declaration": {
        "name": "RELEASE_LARGE_SYSTEM_PROPERTY_NODE",
        "namespace": "android_UNKNOWN",
        "description": "Allow system property storage node to be 1M to accomodate aconfig flags.",
        "value": {
          "Val": {
            "BoolValue": false
          }
        },
        "workflow": 1,
        "containers": [
          "product",
          "system",
          "system_ext",
          "vendor"
        ]
      },
      "value": {
        "Val": {
          "BoolValue": false
        }
      }
    },
    {
      "flag_declaration": {
        "name": "RELEASE_MAINLINE_MODULE_PREBUILT_VERSION",
        "namespace": "android_UNKNOWN",
        "description": "The version of mainline prebuilts used when prebuilts are enabled.",
        "value": {
          "Val": {
            "StringValue": "mainline_module_prebuilt_nightly"
          }
        },
        "workflow": 2,
        "containers": [
          "product",
          "system",
          "system_ext",
          "vendor"
        ]
      },
      "value": {
        "Val": {
          "StringValue": "mainline_module_prebuilt_nightly"
        }
      }
    },
    {
      "flag_declaration": {
        "name": "RELEASE_MOVE_PDFRENDERER_TO_MODULE",
        "namespace": "android_UNKNOWN",
        "description": "If true, then files are moved from platform to apex",
        "value": {
          "Val": {
            "BoolValue": false
          }
        },
        "workflow": 1,
        "containers": [
          "product",
          "system",
          "system_ext",
          "vendor"
        ]
      },
      "value": {
        "Val": {
          "BoolValue": false
        }
      }
    },
    {
      "flag_declaration": {
        "name": "RELEASE_NDK_ABI_MONITORED",
        "namespace": "android_UNKNOWN",
        "description": "Enables ABI monitoring of NDK libraries.",
        "value": {
          "Val": {
            "BoolValue": false
          }
        },
        "workflow": 1,
        "containers": [
          "product",
          "system",
          "system_ext",
          "vendor"
        ]
      },
      "value": {
        "Val": {
          "BoolValue": false
        }
      }
    },
    {
      "flag_declaration": {
        "name": "RELEASE_PACKAGE_LIBANDROID_RUNTIME_PUNCH_HOLES",
        "namespace": "android_UNKNOWN",
        "description": "b/301631861: Flag to enable punching holes in apks and shared libs",
        "value": {
          "Val": {
            "BoolValue": false
          }
        },
        "workflow": 1,
        "containers": [
          "product",
          "system",
          "system_ext",
          "vendor"
        ]
      },
      "value": {
        "Val": {
          "BoolValue": true
        }
      }
    },
    {
      "flag_declaration": {
        "name": "RELEASE_PACKAGE_PROFILING_MODULE",
        "namespace": "android_UNKNOWN",
        "description": "Flag will control the release of the Profiling module apex.",
        "value": {
          "Val": {
            "BoolValue": false
          }
        },
        "workflow": 1,
        "containers": [
          "product",
          "system",
          "system_ext",
          "vendor"
        ]
      },
      "value": {
        "Val": {
          "BoolValue": true
        }
      }
    },
    {
      "flag_declaration": {
        "name": "RELEASE_PACKAGE_SOUND_PICKER",
        "namespace": "android_UNKNOWN",
        "description": "This flag will control the rollout of new versions of the SoundPicker app.",
        "value": {
          "Val": {
            "StringValue": "SoundPicker"
          }
        },
        "workflow": 2,
        "containers": [
          "product",
          "system",
          "system_ext",
          "vendor"
        ]
      },
      "value": {
        "Val": {
          "StringValue": "SoundPicker"
        }
      }
    },
    {
      "flag_declaration": {
        "name": "RELEASE_PACKAGE_TZDATA_MODULE",
        "namespace": "android_UNKNOWN",
        "description": "tzdata to be installed to the system image.",
        "value": {
          "Val": {
            "StringValue": "com.android.tzdata"
          }
        },
        "workflow": 2,
        "containers": [
          "product",
          "system",
          "system_ext",
          "vendor"
        ]
      },
      "value": {
        "Val": {
          "StringValue": "com.android.tzdata"
        }
      }
    },
    {
      "flag_declaration": {
        "name": "RELEASE_PLATFORM_SDK_EXTENSION_VERSION",
        "namespace": "android_UNKNOWN",
        "description": "The sdk extension version of this release configuration.",
        "value": {
          "Val": {
            "StringValue": "12"
          }
        },
        "workflow": 3,
        "containers": [
          "product",
          "system",
          "system_ext",
          "vendor"
        ]
      },
      "value": {
        "Val": {
          "StringValue": "13"
        }
      }
    },
    {
      "flag_declaration": {
        "name": "RELEASE_PLATFORM_SDK_VERSION",
        "namespace": "android_UNKNOWN",
        "description": "The SDK version of the platform, e.g. 34 for UDC. This should only be increased when the API is finalized and the codename is set to rel, not during development.",
        "value": {
          "Val": {
            "StringValue": "34"
          }
        },
        "workflow": 3,
        "containers": [
          "product",
          "system",
          "system_ext",
          "vendor"
        ]
      },
      "value": {
        "Val": {
          "StringValue": "35"
        }
      }
    },
    {
      "flag_declaration": {
        "name": "RELEASE_PLATFORM_SECURITY_PATCH",
        "namespace": "android_UNKNOWN",
        "description": "Used to indicate the security patch that has been applied to the device. It must signify that the build includes all security patches issued up through the designated Android Public Security Bulletin. It must be of the form \"YYYY-MM-DD\" on production devices. It must match one of the Android Security Patch Level strings of the Public Security Bulletins. If there is no $PLATFORM_SECURITY_PATCH set, keep it empty.",
        "value": {
          "Val": {
            "StringValue": "2023-12-05"
          }
        },
        "workflow": 3,
        "containers": [
          "product",
          "system",
          "system_ext",
          "vendor"
        ]
      },
      "value": {
        "Val": {
          "StringValue": "2024-11-01"
        }
      }
    },
    {
      "flag_declaration": {
        "name": "RELEASE_PLATFORM_VERSION",
        "namespace": "android_UNKNOWN",
        "description": "The platform version. This is the 4 letter code, e.g. UD1A, UPB1, ZP1A, etc.",
        "value": {
          "Val": {
            "StringValue": "ZP1A"
          }
        },
        "workflow": 3,
        "containers": [
          "product",
          "system",
          "system_ext",
          "vendor"
        ]
      },
      "value": {
        "Val": {
          "StringValue": "AP3A"
        }
      }
    },
    {
      "flag_declaration": {
        "name": "RELEASE_PLATFORM_VERSION_ALL_CODENAMES",
        "namespace": "android_UNKNOWN",
        "description": "A comma separated list of all codenames that are in preview. This variable is sort of a lie for historical reasons and only includes codenames up to and including the currently active codename",
        "value": {
          "Val": {
            "StringValue": "VanillaIceCream"
          }
        },
        "workflow": 3,
        "containers": [
          "product",
          "system",
          "system_ext",
          "vendor"
        ]
      },
      "value": {
        "Val": {
          "StringValue": "REL"
        }
      }
    },
    {
      "flag_declaration": {
        "name": "RELEASE_PLATFORM_VERSION_ALL_PREVIEW_CODENAMES",
        "namespace": "android_UNKNOWN",
        "description": "A comma separated list of all preview codenames the platform will accept apps built against",
        "value": {
          "Val": {
            "StringValue": "VanillaIceCream"
          }
        },
        "workflow": 3,
        "containers": [
          "product",
          "system",
          "system_ext",
          "vendor"
        ]
      },
      "value": {
        "Val": {
          "StringValue": "REL"
        }
      }
    },
    {
      "flag_declaration": {
        "name": "RELEASE_PLATFORM_VERSION_CODENAME",
        "namespace": "android_UNKNOWN",
        "description": "Set to REL for production platform builds, otherwise the codename string, e.g. UpsideDownCake or VanillaIceCream",
        "value": {
          "Val": {
            "StringValue": "VanillaIceCream"
          }
        },
        "workflow": 3,
        "containers": [
          "product",
          "system",
          "system_ext",
          "vendor"
        ]
      },
      "value": {
        "Val": {
          "StringValue": "REL"
        }
      }
    },
    {
      "flag_declaration": {
        "name": "RELEASE_PLATFORM_VERSION_KNOWN_CODENAMES",
        "namespace": "android_UNKNOWN",
        "description": "A comma separated list of all known codenames. For REL (finalized) configurations, it has to only contain finalized codenames.",
        "value": {
          "Val": {
            "StringValue": "Base,Base11,Cupcake,Donut,Eclair,Eclair01,EclairMr1,Froyo,Gingerbread,GingerbreadMr1,Honeycomb,HoneycombMr1,HoneycombMr2,IceCreamSandwich,IceCreamSandwichMr1,JellyBean,JellyBeanMr1,JellyBeanMr2,Kitkat,KitkatWatch,Lollipop,LollipopMr1,M,N,NMr1,O,OMr1,P,Q,R,S,Sv2,Tiramisu,UpsideDownCake,VanillaIceCream"
          }
        },
        "workflow": 3,
        "containers": [
          "product",
          "system",
          "system_ext",
          "vendor"
        ]
      },
      "value": {
        "Val": {
          "StringValue": "Base,Base11,Cupcake,Donut,Eclair,Eclair01,EclairMr1,Froyo,Gingerbread,GingerbreadMr1,Honeycomb,HoneycombMr1,HoneycombMr2,IceCreamSandwich,IceCreamSandwichMr1,JellyBean,JellyBeanMr1,JellyBeanMr2,Kitkat,KitkatWatch,Lollipop,LollipopMr1,M,N,NMr1,O,OMr1,P,Q,R,S,Sv2,Tiramisu,UpsideDownCake,VanillaIceCream"
        }
      }
    },
    {
      "flag_declaration": {
        "name": "RELEASE_PLATFORM_VERSION_LAST_STABLE",
        "namespace": "android_UNKNOWN",
        "description": "The last stable version name of the platform that was released.  During development, this stays at that previous version, while the codename indicates further work based on the previous version.",
        "value": {
          "Val": {
            "StringValue": "14"
          }
        },
        "workflow": 3,
        "containers": [
          "product",
          "system",
          "system_ext",
          "vendor"
        ]
      },
      "value": {
        "Val": {
          "StringValue": "15"
        }
      }
    },
    {
      "flag_declaration": {
        "name": "RELEASE_PLATFORM_VNDK_VERSION",
        "namespace": "android_UNKNOWN",
        "description": "The PLATFORM_VNDK_VERSION will be set to this version when the PLATFORM_VERSION_CODENAME is REL. This VNDK version flag will be removed when the VNDK is deprecated",
        "value": {
          "Val": {
            "StringValue": "35"
          }
        },
        "workflow": 3,
        "containers": [
          "product",
          "system",
          "system_ext",
          "vendor"
        ]
      },
      "value": {
        "Val": {
          "StringValue": "35"
        }
      }
    },
    {
      "flag_declaration": {
        "name": "RELEASE_READ_FROM_NEW_STORAGE",
        "namespace": "android_UNKNOWN",
        "description": "Control if we should read from new storage.",
        "value": {
          "Val": {
            "BoolValue": false
          }
        },
        "workflow": 1,
        "containers": [
          "product",
          "system",
          "system_ext",
          "vendor"
        ]
      },
      "value": {
        "Val": {
          "BoolValue": false
        }
      }
    },
    {
      "flag_declaration": {
        "name": "RELEASE_SELINUX_DATA_DATA_IGNORE",
        "namespace": "android_UNKNOWN",
        "description": "Ignore /data/data relabelling in libselinux.",
        "value": {
          "Val": {
            "BoolValue": false
          }
        },
        "workflow": 1,
        "containers": [
          "product",
          "system",
          "system_ext",
          "vendor"
        ]
      },
      "value": {
        "Val": {
          "BoolValue": false
        }
      }
    },
    {
      "flag_declaration": {
        "name": "RELEASE_SM_OPEN_DECLARED_PASSTHROUGH_HAL",
        "namespace": "android_UNKNOWN",
        "description": "feature flag for a new API to open declared passthrough HAL",
        "value": {
          "Val": {
            "BoolValue": false
          }
        },
        "workflow": 1,
        "containers": [
          "product",
          "system",
          "system_ext",
          "vendor"
        ]
      },
      "value": {
        "Val": {
          "BoolValue": false
        }
      }
    },
    {
      "flag_declaration": {
        "name": "RELEASE_UNLOCKED_STORAGE_API",
        "namespace": "android_UNKNOWN",
        "description": "flag to enable the unlocked-only storage API's SEPolicy rules",
        "value": {
          "Val": {
            "BoolValue": false
          }
        },
        "workflow": 1,
        "containers": [
          "product",
          "system",
          "system_ext",
          "vendor"
        ]
      },
      "value": {
        "Val": {
          "BoolValue": false
        }
      }
    },
    {
      "flag_declaration": {
        "name": "RELEASE_USE_RESOURCE_PROCESSOR_BY_DEFAULT",
        "namespace": "android_UNKNOWN",
        "description": "feature flag for enabling use_resource_processor: true by default",
        "value": {
          "Val": {
            "BoolValue": false
          }
        },
        "workflow": 1,
        "containers": [
          "product",
          "system",
          "system_ext",
          "vendor"
        ]
      },
      "value": {
        "Val": {
          "BoolValue": false
        }
      }
    },
    {
      "flag_declaration": {
        "name": "RELEASE_USE_WEBVIEW_BOOTSTRAP_MODULE",
        "namespace": "android_UNKNOWN",
        "description": "b/318717084 - enable the WebViewBootstrap mainline module",
        "value": {
          "Val": {
            "BoolValue": false
          }
        },
        "workflow": 1,
        "containers": [
          "product",
          "system",
          "system_ext",
          "vendor"
        ]
      },
      "value": {
        "Val": {
          "BoolValue": false
        }
      }
    },
    {
      "flag_declaration": {
        "name": "RELEASE_WRITE_APPCOMPAT_OVERRIDE_SYSTEM_PROPERTIES",
        "namespace": "android_UNKNOWN",
        "description": "flag to enable the writing of appcompat override system properties. Not expected to go beyond trunk",
        "value": {
          "Val": {
            "BoolValue": false
          }
        },
        "workflow": 1,
        "containers": [
          "product",
          "system",
          "system_ext",
          "vendor"
        ]
      },
      "value": {
        "Val": {
          "BoolValue": false
        }
      }
    }
  ]
}