{
    "DataLicense": "LicenseRef-Unisoc-General-1.0",
    "DataCopyright": "2022 Unisoc (Shanghai) Technologies Co., Ltd.",
    "name": "Pipeline_Ultrawide_Capture",
    "stream": "capture_stream",
    "nodes": [
        {
            "type": "DummyNode",
            "vendor": "SPRD",
            "id": "SourceNode2"
        },
        {
            "type": "DummyNode",
            "vendor": "SPRD",
            "id": "SinkNode"
        },
        {
            "type": "DeWarpingNode",
            "vendor": "SPRD",
            "id": "cap_DeWarping"
        },
        {
            "type": "MultiFrameRouterNode",
            "vendor": "SPRD",
            "id": "cap_MF_router"
        },
        {
            "type": "MFNR5Node",
            "vendor": "SPRD",
            "id": "cap_MFNR5"
        },
        {
            "type": "YNRCNRNode",
            "vendor": "SPRD",
            "id": "cap_YNRCNR"
        },
        {
            "type": "DeWarpPortraitNode",
            "vendor": "SPRD",
            "id": "cap_DeWarpPortrait"
        },
        {
            "type": "FaceBeautyNode",
            "vendor": "SPRD",
            "id": "cap_FaceBeauty"
        },
        {
            "type": "WaterMarkNode",
            "vendor": "SPRD",
            "id": "cap_WaterMark"
        },
        {
            "type": "JpegNode",
            "vendor": "SPRD",
            "id": "cap_Jpeg"
        }
    ],
    "rootNodes": ["SourceNode2"],
    "linkages": [
        {
            "from": {
                "name": "SourceNode2",
                "port": "result_out"
            },
            "to": {
                "name": "cap_DeWarping",
                "port": "in0"
            }
        },
        {
            "from": {
                "name": "cap_DeWarping",
                "port": "out0"
            },
            "to": {
                "name": "cap_MF_router",
                "port": "cin0"
            }
        },
        {
            "from": {
                "name": "cap_MF_router",
                "port": "flash"
            },
            "to": {
                "name": "cap_YNRCNR",
                "port": "in0"
            }
        },
        {
            "from": {
                "name": "cap_MF_router",
                "port": "single"
            },
            "to": {
                "name": "cap_YNRCNR",
                "port": "in0"
            }
        },
        {
            "from": {
                "name": "cap_MF_router",
                "port": "mfnr"
            },
            "to": {
                "name": "cap_MFNR5",
                "port": "in0"
            }
        },
        {
            "from": {
                "name": "cap_MFNR5",
                "port": "out0"
            },
            "to": {
                "name": "cap_YNRCNR",
                "port": "in0"
            }
        },
        {
            "from": {
                "name": "cap_YNRCNR",
                "port": "out0"
            },
            "to": {
                "name": "cap_DeWarpPortrait",
                "port": "in0"
            }
        },
        {
            "from": {
                "name": "cap_DeWarpPortrait",
                "port": "out0"
            },
            "to": {
                "name": "cap_FaceBeauty",
                "port": "in0"
            }
        },
        {
            "from": {
                "name": "cap_FaceBeauty",
                "port": "out0"
            },
            "to": {
                "name": "cap_WaterMark",
                "port": "in0"
            }
        },
        {
            "from": {
                "name": "cap_WaterMark",
                "port": "out0"
            },
            "to": {
                "name": "cap_Jpeg",
                "port": "in0"
            }
        },
        {
            "from": {
                "name": "cap_Jpeg",
                "port": "out0"
            },
            "to": {
                "name": "SinkNode",
                "port": "in0"
            }
        }
    ]
}