{
    "DataLicense": "LicenseRef-Unisoc-General-1.0",
    "DataCopyright": "2022-2023 Unisoc (Shanghai) Technologies Co., Ltd.",
    "name": "Pipeline_Front_Auto_Capture",
    "stream": "capture_stream",
    "nodes": [
        {
            "type": "DummyNode",
            "vendor": "SPRD",
            "id": "SourceNode1"
        },
        {
            "type": "DummyNode",
            "vendor": "SPRD",
            "id": "SinkNode"
        },
        {
            "type": "MultiFrameRouterNode",
            "vendor": "SPRD",
            "id": "cap_MF_router"
        },
        {
            "type": "HDRRouterNode",
            "vendor": "SPRD",
            "id": "cap_HDR_router"
        },
        {
            "type": "MFNR_4Node",
            "vendor": "SPRD",
            "id": "cap_MFNR4"
        },
        {
            "type": "ArcHDRNode",
            "vendor": "SPRD",
            "id": "cap_ArcHDR"
        },
        {
            "type": "YNRCNRNode",
            "vendor": "SPRD",
            "id": "cap_YNRCNR"
        },
        {
            "type": "DPFNode",
            "vendor": "SPRD",
            "id": "cap_DPF"
        },
        {
            "type": "FaceBeautyNode",
            "vendor": "SPRD",
            "id": "cap_FaceBeauty"
        },
        {
            "type": "PortraitRepairNode",
            "vendor": "SPRD",
            "id": "cap_PortraitRepair"
        },
        {
            "type": "WaterMarkNode",
            "vendor": "SPRD",
            "id": "cap_WaterMark"
        },
        {
            "type": "MfsrNode",
            "vendor": "SPRD",
            "id": "cap_MFSR"
        },
		{
            "type": "PCCNode",
            "vendor": "SPRD",
            "id": "cap_PCC"
        },
        {
            "type": "FilterCapNode",
            "vendor": "SPRD",
            "id": "cap_Filter"
        },
        {
            "type": "JpegNode",
            "vendor": "SPRD",
            "id": "cap_Jpeg"
        }
    ],
    "rootNodes": ["SourceNode1"],
    "linkages": [
        {
            "from": {
                "name": "SourceNode1",
                "port": "result_out"
            },
            "to": {
                "name": "cap_MF_router",
                "port": "cin0"
            }
        },
        {
            "from": {
                "name": "cap_MF_router",
                "port": "flash"
            },
            "to": {
                "name": "cap_YNRCNR",
                "port": "in0"
            }
        },
        {
            "from": {
                "name": "cap_MF_router",
                "port": "single"
            },
            "to": {
                "name": "cap_YNRCNR",
                "port": "in0"
            }
        },
        {
            "from": {
                "name": "cap_MF_router",
                "port": "flashmfnr"
            },
            "to": {
                "name": "cap_MFNR4",
                "port": "in0"
            }
        },
        {
            "from": {
                "name": "cap_MFNR4",
                "port": "out0"
            },
            "to": {
                "name": "cap_YNRCNR",
                "port": "in0"
            }
        },
        {
            "from": {
                "name": "cap_MF_router",
                "port": "archdr"
            },
            "to": {
                "name": "cap_ArcHDR",
                "port": "in0"
            }
        },
        {
            "from": {
                "name": "cap_ArcHDR",
                "port": "out0"
            },
            "to": {
                "name": "cap_YNRCNR",
                "port": "in0"
            }
        },
        {
            "from": {
                "name": "cap_MF_router",
                "port": "mfnr"
            },
            "to": {
                "name": "cap_MFNR4",
                "port": "in0"
            }
        },
        {
            "from": {
                "name": "cap_MFNR4",
                "port": "out0"
            },
            "to": {
                "name": "cap_YNRCNR",
                "port": "in0"
            }
        },
        {
            "from": {
                "name": "cap_MF_router",
                "port": "mfsr"
            },
            "to": {
                "name": "cap_PCC",
                "port": "in0"
            }
        },
        {
            "from": {
                "name": "cap_YNRCNR",
                "port": "out0"
            },
            "to": {
                "name": "cap_PCC",
                "port": "in0"
            }
        },
        {
            "from": {
                "name": "cap_PCC",
                "port": "out0"
            },
            "to": {
                "name": "cap_DPF",
                "port": "in0"
            }
        },
        {
            "from": {
                "name": "cap_DPF",
                "port": "out0"
            },
            "to": {
                "name": "cap_FaceBeauty",
                "port": "in0"
            }
        },
        {
            "from": {
                "name": "cap_FaceBeauty",
                "port": "out0"
            },
            "to": {
                "name": "cap_PortraitRepair",
                "port": "in0"
            }
        },
        {
            "from": {
                "name": "cap_PortraitRepair",
                "port": "out0"
            },
            "to": {
                "name": "cap_Filter",
                "port": "in0"
            }
        },
        {
            "from": {
                "name": "cap_Filter",
                "port": "out0"
            },
            "to": {
                "name": "cap_WaterMark",
                "port": "in0"
            }
        },
        {
            "from": {
                "name": "cap_WaterMark",
                "port": "out0"
            },
            "to": {
                "name": "cap_Jpeg",
                "port": "in0"
            }
        },
        {
            "from": {
                "name": "cap_Jpeg",
                "port": "out0"
            },
            "to": {
                "name": "SinkNode",
                "port": "in0"
            }
        }
    ]
}
