{
    "version": "1.0",
    "name": "jet3.veparticle",
    "quota" : 850,
    "emitters": [
        { 
            "type": "BOX",
            "name": "boxEmitter",
            "keepLocal": false,
            "isEnabled": true,
            "color": [1.0, 1.0, 1.0, 1.0],
            "position": [80, 100, 0],
            "angle": {
                "type": "FIXED",
                "value": 66
            },
            "velocity": {
                "type": "RANDOM",
                "max": 0,
                "min": 0
            },
            "emissionRate": {
                "type": "FIXED",
                "value": 20
            },
            "totalTimeToLive": {
                "type": "RANDOM",
                "max": 5,
                "min": 5
            },
            "width": {
                "type": "RANDOM",
                "max": 2,
                "min": 2
            },
            "height": {
                "type": "RANDOM",
                "max": 2,
                "min": 2
            },
            "boxWidth": 5,
            "boxHeight": 5,
            "boxDepth": 5
        }
    ],
    "affectors": [
        {
            "type": "COLOR",
            "name": "colorAffector",
            "colors": [
                [1, 1, 1, 1, 1.0]

            ]
        },
        {
            "type": "TEXTURE_ANIMATION",
            "name": "textureAnimationAffector",
            "animationType": "loop",
            "animationTimeStep": 0.0,
            "textureCoordsStart": 0,
            "textureCoordsEnd": 35
        }
    ]
}
