#,version,,,,,,,,,,,,,,,,,,,,,,,,,,,,,,,,,,,,,,,,,,,,,,,,,,
2019,1,8,1,,,,,,,,,,,,,,,,,,,,,,,,,,,,,,,,,,,,,,,,,,,,,,,,
#,row_col_num,,,,,,,,,,,,,,,,,,,,,,,,,,,,,,,,,,,,,,,,,,,,,,,,,,
36,18,,,,,,,,,,,,,,,,,,,,,,,,,,,,,,,,,,,,,,,,,,,,,,,,,,
#,noise,,,,,,,,,,,,,,,,,,,,,,,,,,,,,,,,,,,,,,,,,,,,,,,,,,
-150,150,,,,,,,,,,,,,,,,,,,,,,,,,,,,,,,,,,,,,,,,,,,,,,,,,,
#,raw_max,,,,,,,,,,,,,,,,,,,,,,,,,,,,,,,,,,,,,,,,,,,,,,,,,,
2682,2682,2700,2680,2689,2714,2708,2706,2702,2529,2688,2695,2711,2693,2663,2708,2723,2750,,,,,,,,,,,,,,,,,,,,,,,,,,,,,,,,,,
2731,2778,2739,2723,2735,2762,2757,2757,2754,2662,2730,2735,2749,2731,2701,2743,2744,2763,,,,,,,,,,,,,,,,,,,,,,,,,,,,,,,,,,
2698,2782,2745,2726,2739,2765,2760,2761,2758,2675,2730,2735,2750,2731,2702,2745,2749,2734,,,,,,,,,,,,,,,,,,,,,,,,,,,,,,,,,,
2704,2739,2735,2718,2731,2758,2753,2754,2752,2674,2709,2715,2732,2713,2684,2731,2735,2715,,,,,,,,,,,,,,,,,,,,,,,,,,,,,,,,,,
2708,2741,2728,2713,2724,2749,2744,2744,2740,2669,2727,2731,2747,2728,2700,2745,2748,2715,,,,,,,,,,,,,,,,,,,,,,,,,,,,,,,,,,
2697,2735,2731,2715,2728,2756,2750,2752,2749,2669,2723,2728,2743,2724,2696,2741,2745,2701,,,,,,,,,,,,,,,,,,,,,,,,,,,,,,,,,,
2697,2732,2740,2728,2734,2758,2758,2756,2756,2676,2736,2745,2757,2730,2718,2750,2757,2714,,,,,,,,,,,,,,,,,,,,,,,,,,,,,,,,,,
2698,2736,2736,2722,2727,2752,2752,2749,2749,2675,2715,2726,2740,2714,2702,2736,2743,2710,,,,,,,,,,,,,,,,,,,,,,,,,,,,,,,,,,
2709,2743,2732,2718,2723,2744,2744,2741,2739,2675,2734,2743,2756,2730,2718,2750,2756,2714,,,,,,,,,,,,,,,,,,,,,,,,,,,,,,,,,,
2702,2736,2735,2722,2727,2750,2750,2748,2747,2676,2730,2739,2752,2726,2714,2747,2753,2702,,,,,,,,,,,,,,,,,,,,,,,,,,,,,,,,,,
2701,2731,2741,2728,2734,2756,2756,2752,2752,2685,2732,2741,2756,2731,2719,2750,2757,2709,,,,,,,,,,,,,,,,,,,,,,,,,,,,,,,,,,
2704,2731,2736,2723,2727,2750,2750,2748,2747,2682,2715,2726,2740,2715,2704,2737,2744,2704,,,,,,,,,,,,,,,,,,,,,,,,,,,,,,,,,,
2708,2736,2735,2710,2722,2737,2735,2724,2730,2684,2737,2744,2752,2726,2714,2747,2754,2709,,,,,,,,,,,,,,,,,,,,,,,,,,,,,,,,,,
2701,2735,2737,2715,2727,2744,2741,2732,2740,2684,2734,2741,2748,2722,2709,2743,2752,2696,,,,,,,,,,,,,,,,,,,,,,,,,,,,,,,,,,
2698,2731,2744,2721,2734,2750,2747,2739,2745,2695,2739,2745,2753,2727,2714,2747,2756,2709,,,,,,,,,,,,,,,,,,,,,,,,,,,,,,,,,,
2700,2734,2739,2717,2728,2745,2741,2734,2740,2684,2721,2730,2737,2713,2701,2735,2744,2704,,,,,,,,,,,,,,,,,,,,,,,,,,,,,,,,,,
2706,2739,2735,2711,2723,2737,2735,2724,2728,2700,2739,2745,2753,2727,2715,2749,2756,2711,,,,,,,,,,,,,,,,,,,,,,,,,,,,,,,,,,
2701,2735,2741,2718,2730,2747,2744,2735,2726,2701,2736,2743,2750,2724,2713,2745,2753,2700,,,,,,,,,,,,,,,,,,,,,,,,,,,,,,,,,,
2700,2732,2747,2734,2744,2767,2760,2761,2735,2711,2728,2739,2744,2717,2719,2757,2753,2711,,,,,,,,,,,,,,,,,,,,,,,,,,,,,,,,,,
2701,2737,2743,2730,2740,2763,2756,2756,2727,2706,2710,2722,2728,2702,2706,2747,2743,2706,,,,,,,,,,,,,,,,,,,,,,,,,,,,,,,,,,
2706,2750,2739,2726,2735,2757,2749,2747,2721,2728,2728,2739,2744,2718,2721,2763,2756,2711,,,,,,,,,,,,,,,,,,,,,,,,,,,,,,,,,,
2702,2747,2745,2731,2743,2765,2757,2757,2723,2726,2726,2736,2743,2717,2719,2758,2753,2700,,,,,,,,,,,,,,,,,,,,,,,,,,,,,,,,,,
2701,2744,2750,2737,2748,2770,2762,2762,2722,2730,2730,2740,2747,2721,2724,2766,2757,2713,,,,,,,,,,,,,,,,,,,,,,,,,,,,,,,,,,
2704,2749,2747,2734,2744,2766,2758,2757,2715,2711,2714,2724,2732,2708,2711,2750,2747,2709,,,,,,,,,,,,,,,,,,,,,,,,,,,,,,,,,,
2723,2767,2752,2747,2758,2776,2767,2757,2723,2749,2754,2762,2765,2744,2741,2778,2771,2726,,,,,,,,,,,,,,,,,,,,,,,,,,,,,,,,,,
2715,2763,2757,2753,2766,2784,2776,2767,2718,2745,2752,2760,2762,2741,2739,2770,2767,2714,,,,,,,,,,,,,,,,,,,,,,,,,,,,,,,,,,
2718,2763,2763,2760,2771,2791,2782,2773,2717,2749,2756,2762,2766,2747,2743,2774,2771,2726,,,,,,,,,,,,,,,,,,,,,,,,,,,,,,,,,,
2721,2769,2760,2756,2767,2787,2778,2769,2708,2731,2739,2748,2752,2734,2730,2762,2760,2719,,,,,,,,,,,,,,,,,,,,,,,,,,,,,,,,,,
2727,2774,2756,2750,2763,2780,2770,2760,2717,2750,2756,2763,2767,2749,2745,2776,2771,2717,,,,,,,,,,,,,,,,,,,,,,,,,,,,,,,,,,
2721,2769,2761,2760,2774,2792,2784,2775,2711,2750,2754,2762,2766,2748,2743,2773,2769,2705,,,,,,,,,,,,,,,,,,,,,,,,,,,,,,,,,,
2719,2765,2769,2761,2782,2795,2779,2780,2723,2760,2765,2773,2773,2752,2748,2779,2770,2715,,,,,,,,,,,,,,,,,,,,,,,,,,,,,,,,,,
2723,2773,2766,2758,2780,2793,2778,2780,2719,2748,2754,2762,2762,2741,2737,2771,2762,2717,,,,,,,,,,,,,,,,,,,,,,,,,,,,,,,,,,
2734,2770,2758,2752,2774,2786,2769,2770,2734,2769,2775,2782,2780,2760,2754,2789,2775,2722,,,,,,,,,,,,,,,,,,,,,,,,,,,,,,,,,,
2728,2767,2767,2762,2783,2796,2782,2784,2723,2769,2774,2780,2780,2761,2754,2787,2775,2708,,,,,,,,,,,,,,,,,,,,,,,,,,,,,,,,,,
2770,2763,2775,2769,2789,2801,2787,2789,2722,2771,2778,2784,2784,2765,2761,2795,2779,2783,,,,,,,,,,,,,,,,,,,,,,,,,,,,,,,,,,
2796,2763,2769,2763,2783,2795,2778,2780,2615,2752,2758,2766,2767,2749,2745,2776,2763,2800,,,,,,,,,,,,,,,,,,,,,,,,,,,,,,,,,,
#,raw_min,,,,,,,,,,,,,,,,,,,,,,,,,,,,,,,,,,,,,,,,,,,,,,,,,,
1429,1429,1438,1428,1433,1446,1443,1442,1440,1347,1432,1436,1445,1435,1419,1443,1451,1466,,,,,,,,,,,,,,,,,,,,,,,,,,,,,,,,,,
1455,1480,1459,1451,1457,1472,1469,1469,1468,1418,1454,1457,1465,1455,1439,1461,1462,1473,,,,,,,,,,,,,,,,,,,,,,,,,,,,,,,,,,
1438,1482,1463,1452,1459,1473,1471,1471,1470,1425,1454,1457,1466,1455,1440,1463,1465,1457,,,,,,,,,,,,,,,,,,,,,,,,,,,,,,,,,,
1440,1459,1457,1448,1455,1470,1467,1468,1466,1424,1443,1447,1456,1445,1430,1455,1457,1447,,,,,,,,,,,,,,,,,,,,,,,,,,,,,,,,,,
1443,1461,1454,1445,1452,1465,1462,1462,1460,1422,1453,1455,1464,1454,1438,1463,1464,1447,,,,,,,,,,,,,,,,,,,,,,,,,,,,,,,,,,
1437,1457,1455,1447,1454,1468,1466,1466,1465,1422,1451,1454,1461,1452,1436,1461,1463,1439,,,,,,,,,,,,,,,,,,,,,,,,,,,,,,,,,,
1437,1456,1460,1454,1457,1470,1470,1468,1468,1426,1458,1463,1469,1454,1448,1466,1469,1446,,,,,,,,,,,,,,,,,,,,,,,,,,,,,,,,,,
1438,1458,1458,1450,1453,1466,1466,1465,1465,1425,1447,1452,1460,1446,1440,1458,1461,1444,,,,,,,,,,,,,,,,,,,,,,,,,,,,,,,,,,
1443,1461,1456,1448,1451,1462,1462,1461,1459,1425,1457,1461,1468,1454,1448,1466,1468,1446,,,,,,,,,,,,,,,,,,,,,,,,,,,,,,,,,,
1440,1458,1457,1450,1453,1466,1466,1464,1464,1426,1454,1459,1466,1452,1446,1464,1467,1440,,,,,,,,,,,,,,,,,,,,,,,,,,,,,,,,,,
1439,1455,1461,1454,1457,1468,1468,1466,1466,1431,1456,1461,1468,1455,1449,1466,1469,1443,,,,,,,,,,,,,,,,,,,,,,,,,,,,,,,,,,
1440,1455,1458,1451,1453,1466,1466,1464,1464,1429,1447,1452,1460,1447,1440,1459,1462,1440,,,,,,,,,,,,,,,,,,,,,,,,,,,,,,,,,,
1443,1458,1457,1444,1450,1459,1457,1452,1454,1430,1459,1462,1466,1452,1446,1464,1468,1443,,,,,,,,,,,,,,,,,,,,,,,,,,,,,,,,,,
1439,1457,1459,1447,1453,1462,1461,1456,1460,1430,1457,1461,1464,1450,1443,1461,1466,1436,,,,,,,,,,,,,,,,,,,,,,,,,,,,,,,,,,
1438,1455,1462,1450,1457,1466,1464,1459,1463,1436,1459,1463,1467,1453,1446,1464,1468,1443,,,,,,,,,,,,,,,,,,,,,,,,,,,,,,,,,,
1438,1457,1459,1447,1454,1463,1461,1457,1460,1430,1450,1454,1459,1445,1439,1457,1462,1440,,,,,,,,,,,,,,,,,,,,,,,,,,,,,,,,,,
1442,1459,1457,1445,1451,1459,1457,1452,1454,1438,1459,1463,1467,1453,1447,1465,1468,1445,,,,,,,,,,,,,,,,,,,,,,,,,,,,,,,,,,
1439,1457,1461,1448,1454,1464,1462,1457,1452,1439,1458,1461,1466,1452,1445,1463,1467,1438,,,,,,,,,,,,,,,,,,,,,,,,,,,,,,,,,,
1438,1456,1464,1457,1462,1475,1471,1471,1457,1445,1454,1459,1462,1447,1449,1469,1467,1445,,,,,,,,,,,,,,,,,,,,,,,,,,,,,,,,,,
1439,1459,1461,1454,1460,1473,1468,1468,1453,1442,1444,1450,1454,1440,1442,1464,1461,1442,,,,,,,,,,,,,,,,,,,,,,,,,,,,,,,,,,
1442,1466,1459,1452,1457,1469,1465,1464,1450,1454,1454,1459,1462,1448,1450,1473,1468,1445,,,,,,,,,,,,,,,,,,,,,,,,,,,,,,,,,,
1440,1464,1463,1455,1461,1473,1469,1469,1451,1452,1452,1458,1461,1447,1449,1470,1467,1438,,,,,,,,,,,,,,,,,,,,,,,,,,,,,,,,,,
1439,1462,1466,1459,1464,1476,1472,1472,1450,1454,1454,1460,1464,1450,1452,1474,1469,1445,,,,,,,,,,,,,,,,,,,,,,,,,,,,,,,,,,
1440,1465,1464,1457,1462,1474,1470,1469,1447,1445,1446,1452,1456,1443,1445,1466,1464,1443,,,,,,,,,,,,,,,,,,,,,,,,,,,,,,,,,,
1451,1475,1466,1464,1470,1480,1475,1469,1451,1465,1468,1472,1473,1462,1461,1480,1477,1452,,,,,,,,,,,,,,,,,,,,,,,,,,,,,,,,,,
1447,1473,1469,1467,1474,1484,1480,1475,1448,1463,1466,1471,1472,1461,1459,1476,1475,1446,,,,,,,,,,,,,,,,,,,,,,,,,,,,,,,,,,
1448,1473,1473,1471,1477,1487,1482,1478,1447,1465,1468,1472,1474,1464,1461,1478,1477,1452,,,,,,,,,,,,,,,,,,,,,,,,,,,,,,,,,,
1450,1475,1471,1468,1475,1485,1480,1475,1443,1455,1459,1464,1466,1457,1454,1472,1471,1449,,,,,,,,,,,,,,,,,,,,,,,,,,,,,,,,,,
1453,1478,1468,1466,1473,1482,1476,1471,1447,1466,1468,1473,1475,1465,1463,1480,1477,1447,,,,,,,,,,,,,,,,,,,,,,,,,,,,,,,,,,
1450,1475,1471,1471,1478,1488,1484,1479,1445,1466,1468,1472,1474,1464,1461,1478,1475,1441,,,,,,,,,,,,,,,,,,,,,,,,,,,,,,,,,,
1449,1473,1475,1471,1482,1489,1481,1482,1451,1471,1473,1478,1478,1466,1464,1481,1476,1447,,,,,,,,,,,,,,,,,,,,,,,,,,,,,,,,,,
1451,1478,1474,1470,1482,1489,1480,1482,1449,1464,1468,1472,1472,1461,1459,1477,1472,1447,,,,,,,,,,,,,,,,,,,,,,,,,,,,,,,,,,
1457,1476,1470,1466,1478,1485,1475,1476,1457,1475,1479,1482,1482,1471,1468,1487,1479,1450,,,,,,,,,,,,,,,,,,,,,,,,,,,,,,,,,,
1454,1475,1475,1472,1483,1490,1482,1484,1451,1475,1478,1482,1482,1471,1468,1485,1479,1443,,,,,,,,,,,,,,,,,,,,,,,,,,,,,,,,,,
1476,1473,1479,1475,1487,1493,1485,1487,1450,1477,1480,1484,1484,1473,1471,1489,1481,1483,,,,,,,,,,,,,,,,,,,,,,,,,,,,,,,,,,
1490,1473,1475,1473,1483,1489,1480,1482,1393,1466,1470,1474,1475,1465,1463,1480,1473,1492,,,,,,,,,,,,,,,,,,,,,,,,,,,,,,,,,,
#,raw_row_delta_max,,,,,,,,,,,,,,,,,,,,,,,,,,,,,,,,,,,,,,,,,,,,,,,,,,
500,500,500,500,500,500,500,500,500,500,500,500,500,500,500,500,500,500,,,,,,,,,,,,,,,,,,,,,,,,,,,,,,,,,,
500,500,500,500,500,500,500,500,500,500,500,500,500,500,500,500,500,500,,,,,,,,,,,,,,,,,,,,,,,,,,,,,,,,,,
500,500,500,500,500,500,500,500,500,500,500,500,500,500,500,500,500,500,,,,,,,,,,,,,,,,,,,,,,,,,,,,,,,,,,
500,500,500,500,500,500,500,500,500,500,500,500,500,500,500,500,500,500,,,,,,,,,,,,,,,,,,,,,,,,,,,,,,,,,,
500,500,500,500,500,500,500,500,500,500,500,500,500,500,500,500,500,500,,,,,,,,,,,,,,,,,,,,,,,,,,,,,,,,,,
500,500,500,500,500,500,500,500,500,500,500,500,500,500,500,500,500,500,,,,,,,,,,,,,,,,,,,,,,,,,,,,,,,,,,
500,500,500,500,500,500,500,500,500,500,500,500,500,500,500,500,500,500,,,,,,,,,,,,,,,,,,,,,,,,,,,,,,,,,,
500,500,500,500,500,500,500,500,500,500,500,500,500,500,500,500,500,500,,,,,,,,,,,,,,,,,,,,,,,,,,,,,,,,,,
500,500,500,500,500,500,500,500,500,500,500,500,500,500,500,500,500,500,,,,,,,,,,,,,,,,,,,,,,,,,,,,,,,,,,
500,500,500,500,500,500,500,500,500,500,500,500,500,500,500,500,500,500,,,,,,,,,,,,,,,,,,,,,,,,,,,,,,,,,,
500,500,500,500,500,500,500,500,500,500,500,500,500,500,500,500,500,500,,,,,,,,,,,,,,,,,,,,,,,,,,,,,,,,,,
500,500,500,500,500,500,500,500,500,500,500,500,500,500,500,500,500,500,,,,,,,,,,,,,,,,,,,,,,,,,,,,,,,,,,
500,500,500,500,500,500,500,500,500,500,500,500,500,500,500,500,500,500,,,,,,,,,,,,,,,,,,,,,,,,,,,,,,,,,,
500,500,500,500,500,500,500,500,500,500,500,500,500,500,500,500,500,500,,,,,,,,,,,,,,,,,,,,,,,,,,,,,,,,,,
500,500,500,500,500,500,500,500,500,500,500,500,500,500,500,500,500,500,,,,,,,,,,,,,,,,,,,,,,,,,,,,,,,,,,
500,500,500,500,500,500,500,500,500,500,500,500,500,500,500,500,500,500,,,,,,,,,,,,,,,,,,,,,,,,,,,,,,,,,,
500,500,500,500,500,500,500,500,500,500,500,500,500,500,500,500,500,500,,,,,,,,,,,,,,,,,,,,,,,,,,,,,,,,,,
500,500,500,500,500,500,500,500,500,500,500,500,500,500,500,500,500,500,,,,,,,,,,,,,,,,,,,,,,,,,,,,,,,,,,
500,500,500,500,500,500,500,500,500,500,500,500,500,500,500,500,500,500,,,,,,,,,,,,,,,,,,,,,,,,,,,,,,,,,,
500,500,500,500,500,500,500,500,500,500,500,500,500,500,500,500,500,500,,,,,,,,,,,,,,,,,,,,,,,,,,,,,,,,,,
500,500,500,500,500,500,500,500,500,500,500,500,500,500,500,500,500,500,,,,,,,,,,,,,,,,,,,,,,,,,,,,,,,,,,
500,500,500,500,500,500,500,500,500,500,500,500,500,500,500,500,500,500,,,,,,,,,,,,,,,,,,,,,,,,,,,,,,,,,,
500,500,500,500,500,500,500,500,500,500,500,500,500,500,500,500,500,500,,,,,,,,,,,,,,,,,,,,,,,,,,,,,,,,,,
500,500,500,500,500,500,500,500,500,500,500,500,500,500,500,500,500,500,,,,,,,,,,,,,,,,,,,,,,,,,,,,,,,,,,
500,500,500,500,500,500,500,500,500,500,500,500,500,500,500,500,500,500,,,,,,,,,,,,,,,,,,,,,,,,,,,,,,,,,,
500,500,500,500,500,500,500,500,500,500,500,500,500,500,500,500,500,500,,,,,,,,,,,,,,,,,,,,,,,,,,,,,,,,,,
500,500,500,500,500,500,500,500,500,500,500,500,500,500,500,500,500,500,,,,,,,,,,,,,,,,,,,,,,,,,,,,,,,,,,
500,500,500,500,500,500,500,500,500,500,500,500,500,500,500,500,500,500,,,,,,,,,,,,,,,,,,,,,,,,,,,,,,,,,,
500,500,500,500,500,500,500,500,500,500,500,500,500,500,500,500,500,500,,,,,,,,,,,,,,,,,,,,,,,,,,,,,,,,,,
500,500,500,500,500,500,500,500,500,500,500,500,500,500,500,500,500,500,,,,,,,,,,,,,,,,,,,,,,,,,,,,,,,,,,
500,500,500,500,500,500,500,500,500,500,500,500,500,500,500,500,500,500,,,,,,,,,,,,,,,,,,,,,,,,,,,,,,,,,,
500,500,500,500,500,500,500,500,500,500,500,500,500,500,500,500,500,500,,,,,,,,,,,,,,,,,,,,,,,,,,,,,,,,,,
500,500,500,500,500,500,500,500,500,500,500,500,500,500,500,500,500,500,,,,,,,,,,,,,,,,,,,,,,,,,,,,,,,,,,
500,500,500,500,500,500,500,500,500,500,500,500,500,500,500,500,500,500,,,,,,,,,,,,,,,,,,,,,,,,,,,,,,,,,,
500,500,500,500,500,500,500,500,500,500,500,500,500,500,500,500,500,500,,,,,,,,,,,,,,,,,,,,,,,,,,,,,,,,,,
500,500,500,500,500,500,500,500,500,500,500,500,500,500,500,500,500,500,,,,,,,,,,,,,,,,,,,,,,,,,,,,,,,,,,
#,raw_row_delta_min,,,,,,,,,,,,,,,,,,,,,,,,,,,,,,,,,,,,,,,,,,,,,,,,,,
-500,-500,-500,-500,-500,-500,-500,-500,-500,-500,-500,-500,-500,-500,-500,-500,-500,-500,,,,,,,,,,,,,,,,,,,,,,,,,,,,,,,,,,
-500,-500,-500,-500,-500,-500,-500,-500,-500,-500,-500,-500,-500,-500,-500,-500,-500,-500,,,,,,,,,,,,,,,,,,,,,,,,,,,,,,,,,,
-500,-500,-500,-500,-500,-500,-500,-500,-500,-500,-500,-500,-500,-500,-500,-500,-500,-500,,,,,,,,,,,,,,,,,,,,,,,,,,,,,,,,,,
-500,-500,-500,-500,-500,-500,-500,-500,-500,-500,-500,-500,-500,-500,-500,-500,-500,-500,,,,,,,,,,,,,,,,,,,,,,,,,,,,,,,,,,
-500,-500,-500,-500,-500,-500,-500,-500,-500,-500,-500,-500,-500,-500,-500,-500,-500,-500,,,,,,,,,,,,,,,,,,,,,,,,,,,,,,,,,,
-500,-500,-500,-500,-500,-500,-500,-500,-500,-500,-500,-500,-500,-500,-500,-500,-500,-500,,,,,,,,,,,,,,,,,,,,,,,,,,,,,,,,,,
-500,-500,-500,-500,-500,-500,-500,-500,-500,-500,-500,-500,-500,-500,-500,-500,-500,-500,,,,,,,,,,,,,,,,,,,,,,,,,,,,,,,,,,
-500,-500,-500,-500,-500,-500,-500,-500,-500,-500,-500,-500,-500,-500,-500,-500,-500,-500,,,,,,,,,,,,,,,,,,,,,,,,,,,,,,,,,,
-500,-500,-500,-500,-500,-500,-500,-500,-500,-500,-500,-500,-500,-500,-500,-500,-500,-500,,,,,,,,,,,,,,,,,,,,,,,,,,,,,,,,,,
-500,-500,-500,-500,-500,-500,-500,-500,-500,-500,-500,-500,-500,-500,-500,-500,-500,-500,,,,,,,,,,,,,,,,,,,,,,,,,,,,,,,,,,
-500,-500,-500,-500,-500,-500,-500,-500,-500,-500,-500,-500,-500,-500,-500,-500,-500,-500,,,,,,,,,,,,,,,,,,,,,,,,,,,,,,,,,,
-500,-500,-500,-500,-500,-500,-500,-500,-500,-500,-500,-500,-500,-500,-500,-500,-500,-500,,,,,,,,,,,,,,,,,,,,,,,,,,,,,,,,,,
-500,-500,-500,-500,-500,-500,-500,-500,-500,-500,-500,-500,-500,-500,-500,-500,-500,-500,,,,,,,,,,,,,,,,,,,,,,,,,,,,,,,,,,
-500,-500,-500,-500,-500,-500,-500,-500,-500,-500,-500,-500,-500,-500,-500,-500,-500,-500,,,,,,,,,,,,,,,,,,,,,,,,,,,,,,,,,,
-500,-500,-500,-500,-500,-500,-500,-500,-500,-500,-500,-500,-500,-500,-500,-500,-500,-500,,,,,,,,,,,,,,,,,,,,,,,,,,,,,,,,,,
-500,-500,-500,-500,-500,-500,-500,-500,-500,-500,-500,-500,-500,-500,-500,-500,-500,-500,,,,,,,,,,,,,,,,,,,,,,,,,,,,,,,,,,
-500,-500,-500,-500,-500,-500,-500,-500,-500,-500,-500,-500,-500,-500,-500,-500,-500,-500,,,,,,,,,,,,,,,,,,,,,,,,,,,,,,,,,,
-500,-500,-500,-500,-500,-500,-500,-500,-500,-500,-500,-500,-500,-500,-500,-500,-500,-500,,,,,,,,,,,,,,,,,,,,,,,,,,,,,,,,,,
-500,-500,-500,-500,-500,-500,-500,-500,-500,-500,-500,-500,-500,-500,-500,-500,-500,-500,,,,,,,,,,,,,,,,,,,,,,,,,,,,,,,,,,
-500,-500,-500,-500,-500,-500,-500,-500,-500,-500,-500,-500,-500,-500,-500,-500,-500,-500,,,,,,,,,,,,,,,,,,,,,,,,,,,,,,,,,,
-500,-500,-500,-500,-500,-500,-500,-500,-500,-500,-500,-500,-500,-500,-500,-500,-500,-500,,,,,,,,,,,,,,,,,,,,,,,,,,,,,,,,,,
-500,-500,-500,-500,-500,-500,-500,-500,-500,-500,-500,-500,-500,-500,-500,-500,-500,-500,,,,,,,,,,,,,,,,,,,,,,,,,,,,,,,,,,
-500,-500,-500,-500,-500,-500,-500,-500,-500,-500,-500,-500,-500,-500,-500,-500,-500,-500,,,,,,,,,,,,,,,,,,,,,,,,,,,,,,,,,,
-500,-500,-500,-500,-500,-500,-500,-500,-500,-500,-500,-500,-500,-500,-500,-500,-500,-500,,,,,,,,,,,,,,,,,,,,,,,,,,,,,,,,,,
-500,-500,-500,-500,-500,-500,-500,-500,-500,-500,-500,-500,-500,-500,-500,-500,-500,-500,,,,,,,,,,,,,,,,,,,,,,,,,,,,,,,,,,
-500,-500,-500,-500,-500,-500,-500,-500,-500,-500,-500,-500,-500,-500,-500,-500,-500,-500,,,,,,,,,,,,,,,,,,,,,,,,,,,,,,,,,,
-500,-500,-500,-500,-500,-500,-500,-500,-500,-500,-500,-500,-500,-500,-500,-500,-500,-500,,,,,,,,,,,,,,,,,,,,,,,,,,,,,,,,,,
-500,-500,-500,-500,-500,-500,-500,-500,-500,-500,-500,-500,-500,-500,-500,-500,-500,-500,,,,,,,,,,,,,,,,,,,,,,,,,,,,,,,,,,
-500,-500,-500,-500,-500,-500,-500,-500,-500,-500,-500,-500,-500,-500,-500,-500,-500,-500,,,,,,,,,,,,,,,,,,,,,,,,,,,,,,,,,,
-500,-500,-500,-500,-500,-500,-500,-500,-500,-500,-500,-500,-500,-500,-500,-500,-500,-500,,,,,,,,,,,,,,,,,,,,,,,,,,,,,,,,,,
-500,-500,-500,-500,-500,-500,-500,-500,-500,-500,-500,-500,-500,-500,-500,-500,-500,-500,,,,,,,,,,,,,,,,,,,,,,,,,,,,,,,,,,
-500,-500,-500,-500,-500,-500,-500,-500,-500,-500,-500,-500,-500,-500,-500,-500,-500,-500,,,,,,,,,,,,,,,,,,,,,,,,,,,,,,,,,,
-500,-500,-500,-500,-500,-500,-500,-500,-500,-500,-500,-500,-500,-500,-500,-500,-500,-500,,,,,,,,,,,,,,,,,,,,,,,,,,,,,,,,,,
-500,-500,-500,-500,-500,-500,-500,-500,-500,-500,-500,-500,-500,-500,-500,-500,-500,-500,,,,,,,,,,,,,,,,,,,,,,,,,,,,,,,,,,
-500,-500,-500,-500,-500,-500,-500,-500,-500,-500,-500,-500,-500,-500,-500,-500,-500,-500,,,,,,,,,,,,,,,,,,,,,,,,,,,,,,,,,,
-500,-500,-500,-500,-500,-500,-500,-500,-500,-500,-500,-500,-500,-500,-500,-500,-500,-500,,,,,,,,,,,,,,,,,,,,,,,,,,,,,,,,,,
#,raw_col_delta_max,,,,,,,,,,,,,,,,,,,,,,,,,,,,,,,,,,,,,,,,,,,,,,,,,,
500,500,500,500,500,500,500,500,500,500,500,500,500,500,500,500,500,500,,,,,,,,,,,,,,,,,,,,,,,,,,,,,,,,,,
500,500,500,500,500,500,500,500,500,500,500,500,500,500,500,500,500,500,,,,,,,,,,,,,,,,,,,,,,,,,,,,,,,,,,
500,500,500,500,500,500,500,500,500,500,500,500,500,500,500,500,500,500,,,,,,,,,,,,,,,,,,,,,,,,,,,,,,,,,,
500,500,500,500,500,500,500,500,500,500,500,500,500,500,500,500,500,500,,,,,,,,,,,,,,,,,,,,,,,,,,,,,,,,,,
500,500,500,500,500,500,500,500,500,500,500,500,500,500,500,500,500,500,,,,,,,,,,,,,,,,,,,,,,,,,,,,,,,,,,
500,500,500,500,500,500,500,500,500,500,500,500,500,500,500,500,500,500,,,,,,,,,,,,,,,,,,,,,,,,,,,,,,,,,,
500,500,500,500,500,500,500,500,500,500,500,500,500,500,500,500,500,500,,,,,,,,,,,,,,,,,,,,,,,,,,,,,,,,,,
500,500,500,500,500,500,500,500,500,500,500,500,500,500,500,500,500,500,,,,,,,,,,,,,,,,,,,,,,,,,,,,,,,,,,
500,500,500,500,500,500,500,500,500,500,500,500,500,500,500,500,500,500,,,,,,,,,,,,,,,,,,,,,,,,,,,,,,,,,,
500,500,500,500,500,500,500,500,500,500,500,500,500,500,500,500,500,500,,,,,,,,,,,,,,,,,,,,,,,,,,,,,,,,,,
500,500,500,500,500,500,500,500,500,500,500,500,500,500,500,500,500,500,,,,,,,,,,,,,,,,,,,,,,,,,,,,,,,,,,
500,500,500,500,500,500,500,500,500,500,500,500,500,500,500,500,500,500,,,,,,,,,,,,,,,,,,,,,,,,,,,,,,,,,,
500,500,500,500,500,500,500,500,500,500,500,500,500,500,500,500,500,500,,,,,,,,,,,,,,,,,,,,,,,,,,,,,,,,,,
500,500,500,500,500,500,500,500,500,500,500,500,500,500,500,500,500,500,,,,,,,,,,,,,,,,,,,,,,,,,,,,,,,,,,
500,500,500,500,500,500,500,500,500,500,500,500,500,500,500,500,500,500,,,,,,,,,,,,,,,,,,,,,,,,,,,,,,,,,,
500,500,500,500,500,500,500,500,500,500,500,500,500,500,500,500,500,500,,,,,,,,,,,,,,,,,,,,,,,,,,,,,,,,,,
500,500,500,500,500,500,500,500,500,500,500,500,500,500,500,500,500,500,,,,,,,,,,,,,,,,,,,,,,,,,,,,,,,,,,
500,500,500,500,500,500,500,500,500,500,500,500,500,500,500,500,500,500,,,,,,,,,,,,,,,,,,,,,,,,,,,,,,,,,,
500,500,500,500,500,500,500,500,500,500,500,500,500,500,500,500,500,500,,,,,,,,,,,,,,,,,,,,,,,,,,,,,,,,,,
500,500,500,500,500,500,500,500,500,500,500,500,500,500,500,500,500,500,,,,,,,,,,,,,,,,,,,,,,,,,,,,,,,,,,
500,500,500,500,500,500,500,500,500,500,500,500,500,500,500,500,500,500,,,,,,,,,,,,,,,,,,,,,,,,,,,,,,,,,,
500,500,500,500,500,500,500,500,500,500,500,500,500,500,500,500,500,500,,,,,,,,,,,,,,,,,,,,,,,,,,,,,,,,,,
500,500,500,500,500,500,500,500,500,500,500,500,500,500,500,500,500,500,,,,,,,,,,,,,,,,,,,,,,,,,,,,,,,,,,
500,500,500,500,500,500,500,500,500,500,500,500,500,500,500,500,500,500,,,,,,,,,,,,,,,,,,,,,,,,,,,,,,,,,,
500,500,500,500,500,500,500,500,500,500,500,500,500,500,500,500,500,500,,,,,,,,,,,,,,,,,,,,,,,,,,,,,,,,,,
500,500,500,500,500,500,500,500,500,500,500,500,500,500,500,500,500,500,,,,,,,,,,,,,,,,,,,,,,,,,,,,,,,,,,
500,500,500,500,500,500,500,500,500,500,500,500,500,500,500,500,500,500,,,,,,,,,,,,,,,,,,,,,,,,,,,,,,,,,,
500,500,500,500,500,500,500,500,500,500,500,500,500,500,500,500,500,500,,,,,,,,,,,,,,,,,,,,,,,,,,,,,,,,,,
500,500,500,500,500,500,500,500,500,500,500,500,500,500,500,500,500,500,,,,,,,,,,,,,,,,,,,,,,,,,,,,,,,,,,
500,500,500,500,500,500,500,500,500,500,500,500,500,500,500,500,500,500,,,,,,,,,,,,,,,,,,,,,,,,,,,,,,,,,,
500,500,500,500,500,500,500,500,500,500,500,500,500,500,500,500,500,500,,,,,,,,,,,,,,,,,,,,,,,,,,,,,,,,,,
500,500,500,500,500,500,500,500,500,500,500,500,500,500,500,500,500,500,,,,,,,,,,,,,,,,,,,,,,,,,,,,,,,,,,
500,500,500,500,500,500,500,500,500,500,500,500,500,500,500,500,500,500,,,,,,,,,,,,,,,,,,,,,,,,,,,,,,,,,,
500,500,500,500,500,500,500,500,500,500,500,500,500,500,500,500,500,500,,,,,,,,,,,,,,,,,,,,,,,,,,,,,,,,,,
500,500,500,500,500,500,500,500,500,500,500,500,500,500,500,500,500,500,,,,,,,,,,,,,,,,,,,,,,,,,,,,,,,,,,
500,500,500,500,500,500,500,500,500,500,500,500,500,500,500,500,500,500,,,,,,,,,,,,,,,,,,,,,,,,,,,,,,,,,,
#,raw_col_delta_min,,,,,,,,,,,,,,,,,,,,,,,,,,,,,,,,,,,,,,,,,,,,,,,,,,
-500,-500,-500,-500,-500,-500,-500,-500,-500,-500,-500,-500,-500,-500,-500,-500,-500,-500,,,,,,,,,,,,,,,,,,,,,,,,,,,,,,,,,,
-500,-500,-500,-500,-500,-500,-500,-500,-500,-500,-500,-500,-500,-500,-500,-500,-500,-500,,,,,,,,,,,,,,,,,,,,,,,,,,,,,,,,,,
-500,-500,-500,-500,-500,-500,-500,-500,-500,-500,-500,-500,-500,-500,-500,-500,-500,-500,,,,,,,,,,,,,,,,,,,,,,,,,,,,,,,,,,
-500,-500,-500,-500,-500,-500,-500,-500,-500,-500,-500,-500,-500,-500,-500,-500,-500,-500,,,,,,,,,,,,,,,,,,,,,,,,,,,,,,,,,,
-500,-500,-500,-500,-500,-500,-500,-500,-500,-500,-500,-500,-500,-500,-500,-500,-500,-500,,,,,,,,,,,,,,,,,,,,,,,,,,,,,,,,,,
-500,-500,-500,-500,-500,-500,-500,-500,-500,-500,-500,-500,-500,-500,-500,-500,-500,-500,,,,,,,,,,,,,,,,,,,,,,,,,,,,,,,,,,
-500,-500,-500,-500,-500,-500,-500,-500,-500,-500,-500,-500,-500,-500,-500,-500,-500,-500,,,,,,,,,,,,,,,,,,,,,,,,,,,,,,,,,,
-500,-500,-500,-500,-500,-500,-500,-500,-500,-500,-500,-500,-500,-500,-500,-500,-500,-500,,,,,,,,,,,,,,,,,,,,,,,,,,,,,,,,,,
-500,-500,-500,-500,-500,-500,-500,-500,-500,-500,-500,-500,-500,-500,-500,-500,-500,-500,,,,,,,,,,,,,,,,,,,,,,,,,,,,,,,,,,
-500,-500,-500,-500,-500,-500,-500,-500,-500,-500,-500,-500,-500,-500,-500,-500,-500,-500,,,,,,,,,,,,,,,,,,,,,,,,,,,,,,,,,,
-500,-500,-500,-500,-500,-500,-500,-500,-500,-500,-500,-500,-500,-500,-500,-500,-500,-500,,,,,,,,,,,,,,,,,,,,,,,,,,,,,,,,,,
-500,-500,-500,-500,-500,-500,-500,-500,-500,-500,-500,-500,-500,-500,-500,-500,-500,-500,,,,,,,,,,,,,,,,,,,,,,,,,,,,,,,,,,
-500,-500,-500,-500,-500,-500,-500,-500,-500,-500,-500,-500,-500,-500,-500,-500,-500,-500,,,,,,,,,,,,,,,,,,,,,,,,,,,,,,,,,,
-500,-500,-500,-500,-500,-500,-500,-500,-500,-500,-500,-500,-500,-500,-500,-500,-500,-500,,,,,,,,,,,,,,,,,,,,,,,,,,,,,,,,,,
-500,-500,-500,-500,-500,-500,-500,-500,-500,-500,-500,-500,-500,-500,-500,-500,-500,-500,,,,,,,,,,,,,,,,,,,,,,,,,,,,,,,,,,
-500,-500,-500,-500,-500,-500,-500,-500,-500,-500,-500,-500,-500,-500,-500,-500,-500,-500,,,,,,,,,,,,,,,,,,,,,,,,,,,,,,,,,,
-500,-500,-500,-500,-500,-500,-500,-500,-500,-500,-500,-500,-500,-500,-500,-500,-500,-500,,,,,,,,,,,,,,,,,,,,,,,,,,,,,,,,,,
-500,-500,-500,-500,-500,-500,-500,-500,-500,-500,-500,-500,-500,-500,-500,-500,-500,-500,,,,,,,,,,,,,,,,,,,,,,,,,,,,,,,,,,
-500,-500,-500,-500,-500,-500,-500,-500,-500,-500,-500,-500,-500,-500,-500,-500,-500,-500,,,,,,,,,,,,,,,,,,,,,,,,,,,,,,,,,,
-500,-500,-500,-500,-500,-500,-500,-500,-500,-500,-500,-500,-500,-500,-500,-500,-500,-500,,,,,,,,,,,,,,,,,,,,,,,,,,,,,,,,,,
-500,-500,-500,-500,-500,-500,-500,-500,-500,-500,-500,-500,-500,-500,-500,-500,-500,-500,,,,,,,,,,,,,,,,,,,,,,,,,,,,,,,,,,
-500,-500,-500,-500,-500,-500,-500,-500,-500,-500,-500,-500,-500,-500,-500,-500,-500,-500,,,,,,,,,,,,,,,,,,,,,,,,,,,,,,,,,,
-500,-500,-500,-500,-500,-500,-500,-500,-500,-500,-500,-500,-500,-500,-500,-500,-500,-500,,,,,,,,,,,,,,,,,,,,,,,,,,,,,,,,,,
-500,-500,-500,-500,-500,-500,-500,-500,-500,-500,-500,-500,-500,-500,-500,-500,-500,-500,,,,,,,,,,,,,,,,,,,,,,,,,,,,,,,,,,
-500,-500,-500,-500,-500,-500,-500,-500,-500,-500,-500,-500,-500,-500,-500,-500,-500,-500,,,,,,,,,,,,,,,,,,,,,,,,,,,,,,,,,,
-500,-500,-500,-500,-500,-500,-500,-500,-500,-500,-500,-500,-500,-500,-500,-500,-500,-500,,,,,,,,,,,,,,,,,,,,,,,,,,,,,,,,,,
-500,-500,-500,-500,-500,-500,-500,-500,-500,-500,-500,-500,-500,-500,-500,-500,-500,-500,,,,,,,,,,,,,,,,,,,,,,,,,,,,,,,,,,
-500,-500,-500,-500,-500,-500,-500,-500,-500,-500,-500,-500,-500,-500,-500,-500,-500,-500,,,,,,,,,,,,,,,,,,,,,,,,,,,,,,,,,,
-500,-500,-500,-500,-500,-500,-500,-500,-500,-500,-500,-500,-500,-500,-500,-500,-500,-500,,,,,,,,,,,,,,,,,,,,,,,,,,,,,,,,,,
-500,-500,-500,-500,-500,-500,-500,-500,-500,-500,-500,-500,-500,-500,-500,-500,-500,-500,,,,,,,,,,,,,,,,,,,,,,,,,,,,,,,,,,
-500,-500,-500,-500,-500,-500,-500,-500,-500,-500,-500,-500,-500,-500,-500,-500,-500,-500,,,,,,,,,,,,,,,,,,,,,,,,,,,,,,,,,,
-500,-500,-500,-500,-500,-500,-500,-500,-500,-500,-500,-500,-500,-500,-500,-500,-500,-500,,,,,,,,,,,,,,,,,,,,,,,,,,,,,,,,,,
-500,-500,-500,-500,-500,-500,-500,-500,-500,-500,-500,-500,-500,-500,-500,-500,-500,-500,,,,,,,,,,,,,,,,,,,,,,,,,,,,,,,,,,
-500,-500,-500,-500,-500,-500,-500,-500,-500,-500,-500,-500,-500,-500,-500,-500,-500,-500,,,,,,,,,,,,,,,,,,,,,,,,,,,,,,,,,,
-500,-500,-500,-500,-500,-500,-500,-500,-500,-500,-500,-500,-500,-500,-500,-500,-500,-500,,,,,,,,,,,,,,,,,,,,,,,,,,,,,,,,,,
-500,-500,-500,-500,-500,-500,-500,-500,-500,-500,-500,-500,-500,-500,-500,-500,-500,-500,,,,,,,,,,,,,,,,,,,,,,,,,,,,,,,,,,