{
	"color": [
		{
			"name": "fa_background_color",
			"value": "#F1F3F5"
		},
		{
			"name": "fa_clock_digit_color",
			"value": "#E5000000"
		},
		{
			"name": "fa_clock_digit_color_night",
			"value": "#99FFFFFF"
		}
	]
}