{
    "effect": {
        "Link": [
            {
                "type": "3DScene",
                "zorder": 900,
                "path": "E12_3D_Scene_03/"
            },
            {
                "type":"Matting",
                "zorder":901,
                "path":"Matting_mao/"
            },
            {
                "type":"Filter",
                "zorder":5003,
                "path":"Filter_byTool/"
            },
			{
                "type" : "2DSticker",
                "zorder" : 10091,
                "path" : "2DSticker_mao\/"
            }
        ]
    }, 
    "name": "E12_MagicSky_xmm", 
    "version": "2.5.1"
}
