{
    "version": "1.0.0",
    "segmentStatus":[
        {"namespace":"segStatus", "matchKey":"tid=\\d+ (.*)", "desc":""},
        {"namespace":"segWaitOther", "matchKey":"waiting to lock.*held by thread (\\d+)", "desc":" waiting on lock held by "},
        {"namespace":"segWaitSelf", "matchKey":"- waiting on <(.*)>", "desc":" waiting on itself"},
        {"namespace":"segIpcTrans", "matchKey":"os\\.(IpcProxy)\\.transact", "desc":" ipc transact:"},
        {"namespace":"segIpcFull", "matchKey":"os\\.Ipc\\.(blockUntilThreadAvailable)", "desc":" ipc full:"}
    ],
    "Rule1":{
        "DirOrFile":"/data/log/faultlog/",
        "Subcatalog":".*?\\-.*?\\-[0-9]{5}\\-[0-9]{14}",
        "featureId":"63_AppFreeze_00",
        "segmentType":"TwoLayers",
        "startSeg":["BasicParam.v_process", "main"],
        "segStack":["^\\s+at\\s+|^\\s+-\\s\\w", "^\\s+at\\s+|^\\s+-\\s\\w"],
        "rules":[
            {"namespace":"BasicParam", "matchKey":"PROCESS_NAME", "v_process":"PROCESS_NAME = (.*)"},
            {"namespace":"BasicParam", "matchKey":"PID = ", "v_pid":"PID = (.*)"},
            {"namespace":"BasicParam", "matchKey":"UID = ", "v_uid":"UID = (.*)"}
        ],
        "segmentRule":[
            {"namespace":"LayerOneCmd", "matchKey":"----- pid ", "num":2, "v_id":"^----- pid (\\d+) at", "v_name":"^Cmd line: (.*)"},
            {"namespace":"LayerTwoCmd", "matchKey":" prio=@&@ tid=", "num":3, "v_id":"tid=(\\d+) ", "v_name":"^\"(.*)\" ", "v_sysTid":"sysTid=(\\d+) "}
        ]
    },
    "Rule2":{
        "DirOrFile":"/data/log/faultlog/faultlogger/",
        "Subcatalog":"cppcrash-.*-\\d+-\\d+",
        "featureId":"07_CPP_CRASH_00",
        "rules":[
            {"namespace":"BasicParam", "matchKey":"Module name:", "v_process":"Module name:(.*)"},
            {"namespace":"MainCallTrace", "matchKey":"Thread name:@|@Tid:", "v_trace":"@T@#\\d+ pc [0-9a-zA-Z]+ (.*)"}
        ]
    },
    "Rule3":{
        "DirOrFile":"/data/log/faultlog/faultlogger/",
        "Subcatalog":"jscrash-.*-\\d+-\\d+",
        "featureId":"07_JS_ERROR_00",
        "rules":[
            {"namespace":"BasicParam", "matchKey":"Module name:", "v_process":"Module name:(.*)"},
            {"namespace":"MainCallTrace", "matchKey":"at ",  "v_trace":"@T@at (.*)"}
        ]
    },
    "Rule4":{
        "DirOrFile":"/data/log/faultlog/faultlogger/",
        "Subcatalog":"appfreeze-.*-\\d+-\\d+",
        "featureId":"63_APP_FREEZE_01",
        "rules":[
            {"namespace":"BasicParam", "matchKey":"Module name:", "v_process":"Module name:(.*)"},
            {"namespace":"BasicParam", "matchKey":"PID = ", "v_pid":"PID = (.*)"},
            {"namespace":"MainCallTrace", "matchKey":"@R@(Tid:){1}@{BasicParam.v_pid}@", "v_trace":"@T@#\\d+ pc [0-9a-zA-Z]+ (.*)"}
        ]
    },
    "Rule5":{
        "DirOrFile":"/data/log/faultlog/faultlogger/",
        "Subcatalog":"sysfreeze-.*-\\d+-\\d+",
        "featureId":"63_SYS_FREEZE_01",
        "rules":[
            {"namespace":"BasicParam", "matchKey":"Module name:", "v_process":"Module name:(.*)"},
            {"namespace":"BasicParam", "matchKey":"PID = ", "v_pid":"PID = (.*)"},
            {"namespace":"MainCallTrace", "matchKey":"@R@(Tid:){1}@{BasicParam.v_pid}@", "v_trace":"@T@#\\d+ pc [0-9a-zA-Z]+ (.*)"}
        ]
    },
    "Rule6":{
        "DirOrFile":"/data/hisi_logs/",
        "Subcatalog":"\\d{14}-\\d{8}/ap_log/dmesg-ramoops-0",
        "featureId":"04_PANIC_01",
        "segmentType":"OneLayer",
        "startSeg":["NocTrace.v_cpu"],
        "segStack":["[0-9a-zA-Z_.]+\\+0x[0-9a-f]+/0x[0-9a-f]+(.*)", "el1_irq+0"],
        "rules":[
            {"namespace":"BasicParam", "matchKey":"Unhandled fault:@|@Unable to handle kernel@|@kernel BUG at@|@BUG: failure at@|@Bad mode in@|@DPM device timeout@|@invoked oom-killer@|@Synchronous External Abort:@|@,init]potentially unexpected fatal signal@|@Internal error:@|@NoC Error Probe:@|@mali gpu: Unhandled Page@|@CFI failure@|@Kernel panic - not syncing:", "v_cause":"pid:\\d+,cpu\\d+,.*\\]([A-Za-z].*)", "v_pname":",cpu[0-9],(.*?)[,:\\]]", "v_noc":"(NoC Error)"},
            {"namespace":"BasicParam", "depend":"BasicParam.v_pname", "matchKey":"PC is at ", "v_f1":"PC is at ([^\\+ ]+.*)"},
            {"namespace":"NocTrace", "depend":"BasicParam.v_noc", "matchKey":"err_code=", "v_errcode":"\\[(err_code=\\d+)\\]"},
            {"namespace":"NocTrace", "depend":"BasicParam.v_noc", "matchKey":"init_flow=", "v_master":"\\[init_flow=\\d+\\]: (.*)"},
            {"namespace":"NocTrace", "depend":"BasicParam.v_noc", "matchKey":"target_flow=", "v_slave":"\\[target_flow=\\d+\\]: (.*)"},
            {"namespace":"NocTrace", "depend":"BasicParam.v_noc", "matchKey":"adjusted ADDR", "v_address":"adjusted.* = (.*)"},
            {"namespace":"NocTrace", "depend":"BasicParam.v_noc", "matchKey":"USER_SIGNAL =", "v_user_signal":"USER_SIGNAL = 0x[0-9a-z]+ (.*)", "v_cpu":"\\(MID: AP_CPU(\\d+)"},
            {"namespace":"NocTrace", "depend":"BasicParam.v_noc", "matchKey":"sec_val =", "v_security":"(sec_val = 0x[0-9a-f]+)"},
            {"namespace":"MainCallTrace", "depend":"BasicParam", "matchKey":"Call trace:", "v_trace":"@T@[0-9a-zA-Z_.]+\\+0x[0-9a-f]+/0x[0-9a-f]+(.*)"}
        ],
        "segmentRule":[
            {"namespace":"LayerOneCmd", "matchKey":"]:CPU@&@: stopping", "num":1, "v_id":"\\]:CPU(\\d+): stopping", "v_name":"\\]:(CPU\\d+): stopping"}
        ]
    },
    "Rule7":{
        "DirOrFile":"/data/bbox_logs/",
        "Subcatalog":"\\d{14}-\\d{8}/ap_log/dmesg-ramoops-0",
        "featureId":"04_HWWATCHDOG_00",
        "rules":[
            {"namespace":"BasicParam", "matchKey":"sysrq: Trigger a crash", "v_fiq":"(.*)"},
            {"namespace":"BasicParam", "depend":"BasicParam.v_fiq","matchKey":"PC is at ", "v_f1":"PC is at ([^\\+ ]+.*)", "v_pname":"cpu[0-9],(.*?)[,:\\]]"},
            {"namespace":"MainCallTrace", "depend":"BasicParam.v_fiq", "matchKey":"Call trace:", "v_trace":"@T@[0-9a-zA-Z_]+\\+0x[0-9a-f]+/0x[0-9a-f]+(.*)"}
        ]
    }
}
