{
	"centerX" : 0.5,
	"centerY" : 0.5,
	"angle" : 0,
	"scale" : 1,
	"width" : 156,
	"height" : 110,
	"contents" : [{
			"type" : "image",
			"resource" : {
				"type" : "static",
				"path" : "res/bg.png"
			},
			"centerX" : 0.5,
			"centerY" : 0.5,
			"width" : 134,
			"height" : 94,
			"angle" : 0,
			"zorder" : 1
		},
		{
			"type" : "image",
			"resource" : {
				"type" : "static",
				"path" : "res/postmark.png"
			},
			"centerX" : 0.75,
			"centerY" : 0.75,
			"width" : 52,
			"height" : 54,
			"angle" : 0,
			"zorder" : 1
		},
		{
            "type": "text",
            "centerX": 0.43,
            "centerY": 0.45,
            "width": 50,
            "height": 20,
            "angle": 0,
            "color": "#fff5efd4",
            "isVertical": 0,
			"alignment": 0,
			"editable":true,
            "text": "{LOCATION}",
            "zorder": 2
        },
		{
            "type": "text",
            "centerX": 0.43,
            "centerY": 0.60,
            "width": 50,
            "height": 10,
            "angle": 0,
            "color": "#fff5efd4",
            "isVertical": 0,
			"alignment": 0,
			"editable":false,
            "text": "{yyyy-MM-dd}",
            "zorder": 2
        }
	]
}
