unified_raw_limit,,,,,,,,,,,,,,,,,,,,,
9999,500,990,,,,,,,,,,,,,,,,,,,
noise_data_limit,,,,,,,,,,,,,,,,,,,,,
75,,,,,,,,,,,,,,,,,,,,,
shortciurt_threshold,,,,,,,,,,,,,,,,,,,,,
30,150,150,150,100,100,16,,,,,,,,,,,,,,,
specail_raw_max,,,,,,,,,,,,,,,,,,,,,
5482,5231,5235,5255,5168,5115,5127,5029,5012,4966,4914,4836,4823,4754,4800,4767,4773,4733,4817,4651,4642,4479
5541,5266,5268,5297,5207,5153,5164,5067,5040,4990,4940,4860,4845,4780,4834,4803,4811,4769,4864,4681,4674,4512
5521,5240,5240,5252,5161,5105,5114,5011,4995,4946,4891,4816,4800,4735,4781,4751,4759,4720,4806,4641,4635,4474
5465,5179,5175,5154,5062,5005,5012,4898,4904,4855,4800,4733,4716,4654,4686,4656,4663,4625,4693,4565,4563,4403
5430,5137,5123,5084,4990,4929,4933,4804,4820,4765,4707,4635,4617,4551,4573,4540,4544,4503,4556,4449,4442,4284
5467,5162,5150,5122,5023,4959,4962,4836,4843,4787,4729,4654,4635,4568,4591,4559,4563,4518,4578,4461,4455,4291
5439,5125,5111,5064,4969,4904,4904,4774,4790,4733,4673,4602,4583,4514,4535,4503,4507,4466,4513,4414,4407,4245
5395,5083,5071,5005,4908,4845,4843,4709,4732,4676,4616,4548,4530,4464,4479,4448,4452,4410,4451,4373,4365,4202
5400,5081,5062,4998,4902,4836,4834,4699,4722,4665,4604,4535,4517,4453,4465,4434,4438,4395,4434,4358,4351,4187
5389,5068,5047,4972,4876,4808,4806,4669,4694,4635,4576,4508,4488,4422,4436,4404,4412,4365,4397,4334,4326,4162
5354,5031,5007,4923,4825,4756,4752,4615,4642,4585,4526,4461,4442,4375,4387,4356,4360,4318,4342,4296,4290,4124
5343,5015,4992,4903,4806,4737,4730,4594,4621,4563,4501,4438,4417,4352,4366,4332,4336,4296,4319,4274,4267,4102
5318,4992,4964,4867,4768,4698,4691,4553,4582,4524,4461,4401,4382,4316,4323,4296,4297,4257,4273,4241,4235,4070
5300,4972,4945,4843,4743,4673,4665,4527,4553,4495,4433,4375,4355,4288,4297,4267,4271,4230,4244,4217,4212,4045
5291,4962,4933,4828,4728,4656,4648,4511,4535,4475,4413,4356,4336,4271,4279,4248,4253,4213,4223,4202,4197,4031
5258,4930,4902,4793,4691,4620,4609,4469,4499,4436,4374,4318,4299,4234,4241,4212,4217,4175,4182,4169,4165,3997
5242,4919,4885,4772,4672,4598,4587,4446,4473,4416,4352,4297,4277,4212,4219,4189,4193,4154,4158,4150,4145,3979
5231,4901,4869,4755,4650,4579,4565,4425,4451,4392,4330,4277,4256,4191,4197,4169,4173,4134,4135,4130,4126,3958
5192,4863,4836,4711,4612,4538,4526,4386,4410,4352,4290,4239,4218,4153,4158,4130,4135,4096,4096,4096,4091,3923
5129,4787,4754,4629,4527,4456,4446,4303,4327,4266,4206,4162,4140,4076,4083,4053,4056,4018,4011,4019,4014,3849
4277,4206,4262,4218,4197,4195,4249,4180,4265,4269,4273,4280,4317,4309,4377,4407,4473,4496,4553,4644,4746,5096
4277,4208,4262,4215,4193,4191,4245,4175,4260,4264,4266,4274,4310,4301,4368,4397,4464,4487,4546,4633,4728,5003
4267,4199,4252,4206,4184,4183,4238,4167,4252,4257,4260,4269,4305,4297,4364,4392,4460,4483,4540,4629,4724,4982
4235,4165,4218,4171,4150,4149,4202,4135,4221,4225,4228,4238,4277,4269,4334,4364,4430,4453,4509,4599,4694,4933
4223,4154,4208,4161,4140,4139,4192,4124,4212,4215,4219,4231,4267,4261,4327,4358,4425,4448,4505,4599,4690,4919
4197,4130,4182,4137,4117,4117,4170,4102,4188,4193,4199,4212,4249,4241,4309,4340,4410,4433,4490,4578,4674,4891
4192,4126,4178,4134,4114,4113,4169,4102,4189,4195,4200,4214,4252,4245,4313,4345,4413,4438,4495,4587,4680,4891
4157,4091,4144,4100,4079,4079,4134,4069,4156,4162,4167,4183,4221,4215,4282,4314,4383,4410,4464,4553,4648,4855
4140,4075,4127,4084,4065,4063,4118,4054,4141,4149,4156,4173,4210,4205,4271,4306,4373,4399,4455,4544,4641,4842
4127,4063,4117,4074,4054,4054,4108,4048,4132,4140,4147,4166,4204,4199,4267,4297,4366,4392,4451,4539,4634,4829
4122,4059,4111,4067,4049,4048,4102,4039,4127,4135,4141,4161,4199,4195,4260,4293,4362,4387,4444,4534,4630,4824
4082,4019,4071,4028,4009,4007,4062,4000,4087,4095,4101,4124,4160,4154,4221,4253,4322,4348,4405,4494,4589,4780
4093,4030,4082,4039,4018,4018,4071,4007,4097,4105,4113,4134,4173,4166,4232,4266,4335,4361,4416,4509,4604,4791
4091,4027,4080,4036,4017,4015,4069,4006,4093,4102,4109,4131,4173,4165,4231,4265,4335,4361,4418,4508,4604,4789
4074,4011,4063,4020,4001,3998,4053,3993,4078,4087,4095,4117,4156,4149,4217,4252,4322,4349,4405,4495,4590,4773
4059,4000,4050,4006,3988,3985,4039,3976,4063,4074,4080,4102,4141,4136,4204,4239,4308,4335,4391,4482,4577,4758
4048,3985,4036,3993,3974,3972,4026,3963,4052,4058,4067,4091,4128,4124,4191,4225,4295,4322,4379,4470,4564,4745
4050,3988,4043,3997,3979,3976,4030,3967,4054,4063,4072,4097,4137,4132,4199,4232,4304,4331,4388,4481,4574,4754
4040,3979,4031,3988,3968,3966,4020,3958,4044,4054,4063,4089,4128,4123,4189,4225,4293,4322,4379,4470,4564,4742
3914,3859,3911,3872,3853,3851,3902,3842,3927,3937,3945,3976,4014,4010,4076,4110,4178,4208,4262,4353,4446,4631
specail_raw_min,,,,,,,,,,,,,,,,,,,,,
2951,2816,2818,2830,2783,2754,2760,2708,2699,2674,2646,2604,2597,2559,2585,2566,2570,2548,2594,2504,2499,2412
2984,2835,2837,2852,2804,2774,2781,2728,2713,2687,2660,2617,2608,2573,2603,2586,2590,2568,2619,2520,2517,2429
2972,2821,2821,2828,2779,2748,2753,2698,2690,2663,2634,2593,2585,2550,2574,2558,2562,2541,2587,2499,2496,2409
2942,2788,2786,2775,2725,2695,2699,2637,2641,2614,2585,2548,2539,2506,2523,2507,2510,2490,2527,2458,2457,2370
2923,2766,2758,2737,2687,2654,2656,2587,2595,2566,2534,2496,2486,2450,2462,2445,2447,2424,2453,2396,2391,2307
2944,2779,2773,2758,2704,2670,2671,2604,2608,2578,2546,2506,2496,2459,2472,2454,2457,2433,2465,2402,2398,2310
2928,2760,2752,2727,2676,2641,2641,2571,2579,2548,2516,2478,2468,2431,2442,2424,2426,2405,2430,2377,2373,2286
2905,2737,2730,2695,2643,2608,2608,2536,2548,2517,2485,2449,2439,2403,2412,2395,2397,2375,2396,2354,2350,2263
2907,2736,2725,2691,2639,2604,2603,2530,2543,2512,2479,2442,2432,2398,2404,2387,2389,2366,2387,2347,2342,2254
2902,2729,2718,2677,2625,2589,2587,2514,2527,2496,2464,2427,2417,2381,2389,2371,2375,2350,2368,2333,2329,2241
2883,2709,2696,2650,2598,2561,2559,2485,2499,2468,2437,2402,2391,2356,2362,2345,2347,2325,2338,2313,2310,2221
2877,2700,2688,2640,2587,2550,2547,2473,2488,2457,2424,2389,2378,2343,2351,2333,2335,2313,2326,2301,2298,2209
2863,2688,2673,2620,2567,2529,2526,2452,2467,2436,2402,2370,2359,2324,2328,2313,2314,2292,2300,2284,2280,2191
2853,2677,2662,2608,2554,2516,2512,2438,2452,2420,2387,2356,2345,2309,2314,2298,2300,2277,2285,2270,2268,2178
2849,2671,2656,2599,2545,2507,2503,2429,2442,2410,2376,2345,2335,2300,2304,2287,2290,2268,2274,2263,2260,2170
2831,2655,2639,2580,2526,2487,2482,2406,2422,2389,2355,2325,2314,2279,2284,2268,2270,2248,2251,2244,2242,2152
2823,2648,2630,2569,2515,2475,2470,2394,2408,2377,2343,2314,2303,2268,2272,2256,2258,2237,2239,2235,2232,2142
2816,2639,2622,2560,2503,2466,2458,2382,2396,2365,2331,2303,2291,2256,2260,2244,2247,2226,2226,2223,2221,2131
2795,2618,2604,2536,2483,2443,2437,2361,2375,2343,2310,2282,2271,2236,2239,2223,2226,2205,2205,2205,2202,2112
2762,2578,2559,2492,2438,2399,2394,2317,2330,2297,2265,2241,2229,2195,2198,2182,2184,2163,2160,2164,2161,2072
2303,2265,2295,2271,2260,2258,2288,2251,2296,2298,2300,2305,2324,2320,2356,2373,2408,2421,2452,2501,2555,2744
2303,2265,2295,2270,2258,2256,2286,2248,2293,2296,2297,2301,2321,2316,2352,2368,2403,2416,2447,2494,2545,2694
2298,2261,2289,2265,2253,2252,2282,2244,2289,2292,2293,2298,2318,2314,2349,2365,2401,2414,2445,2492,2543,2683
2280,2242,2271,2246,2235,2234,2263,2226,2272,2275,2277,2282,2303,2298,2333,2349,2385,2398,2428,2476,2527,2656
2274,2237,2265,2240,2229,2228,2257,2221,2268,2270,2272,2278,2298,2294,2330,2347,2382,2395,2426,2476,2525,2648
2260,2223,2251,2228,2216,2216,2245,2209,2255,2258,2261,2268,2288,2284,2320,2337,2375,2387,2417,2465,2517,2634
2257,2221,2249,2226,2215,2214,2244,2209,2256,2258,2261,2269,2289,2286,2322,2340,2376,2389,2420,2470,2520,2634
2238,2202,2231,2207,2196,2196,2226,2191,2237,2241,2244,2252,2272,2270,2305,2323,2360,2375,2403,2452,2503,2614
2229,2194,2222,2199,2188,2188,2217,2183,2230,2234,2237,2247,2267,2264,2300,2319,2354,2368,2398,2447,2499,2607
2222,2188,2216,2193,2183,2183,2212,2179,2225,2229,2233,2243,2263,2261,2298,2314,2351,2365,2396,2444,2495,2600
2219,2186,2214,2190,2180,2179,2209,2174,2222,2226,2230,2240,2261,2258,2293,2312,2349,2362,2393,2441,2493,2597
2198,2164,2192,2169,2158,2158,2187,2153,2200,2205,2208,2221,2240,2237,2272,2290,2327,2341,2372,2419,2471,2573
2204,2170,2198,2174,2163,2163,2192,2158,2206,2210,2214,2226,2247,2243,2279,2297,2334,2348,2377,2428,2479,2580
2202,2168,2197,2173,2163,2162,2191,2157,2204,2209,2212,2224,2247,2242,2278,2296,2334,2348,2379,2427,2479,2578
2193,2160,2188,2165,2154,2153,2182,2150,2195,2200,2205,2216,2237,2234,2270,2289,2327,2342,2372,2420,2471,2570
2186,2153,2181,2157,2147,2146,2174,2141,2188,2193,2197,2209,2230,2227,2263,2282,2319,2334,2364,2413,2464,2562
2179,2146,2173,2150,2139,2139,2167,2134,2181,2185,2190,2202,2223,2221,2256,2275,2312,2327,2358,2407,2457,2555
2181,2147,2177,2152,2142,2141,2170,2136,2183,2188,2193,2206,2228,2225,2261,2279,2317,2332,2363,2412,2463,2559
2175,2142,2170,2147,2137,2135,2165,2131,2177,2183,2188,2202,2223,2220,2256,2275,2312,2327,2358,2407,2457,2553
2107,2078,2106,2085,2074,2074,2101,2069,2114,2120,2124,2141,2161,2159,2195,2213,2249,2265,2295,2344,2394,2494
special_raw_delta,,,,,,,,,,,,,,,,,,,,,
300,300,300,300,300,300,300,300,300,300,300,300,300,300,300,300,300,300,300,300,300,300
300,300,300,300,300,300,300,300,300,300,300,300,300,300,300,300,300,300,300,300,300,300
300,300,300,300,300,300,300,300,300,300,300,300,300,300,300,300,300,300,300,300,300,300
300,300,300,300,300,300,300,300,300,300,300,300,300,300,300,300,300,300,300,300,300,300
300,300,300,300,300,300,300,300,300,300,300,300,300,300,300,300,300,300,300,300,300,300
300,300,300,300,300,300,300,300,300,300,300,300,300,300,300,300,300,300,300,300,300,300
300,300,300,300,300,300,300,300,300,300,300,300,300,300,300,300,300,300,300,300,300,300
300,300,300,300,300,300,300,300,300,300,300,300,300,300,300,300,300,300,300,300,300,300
300,300,300,300,300,300,300,300,300,300,300,300,300,300,300,300,300,300,300,300,300,300
300,300,300,300,300,300,300,300,300,300,300,300,300,300,300,300,300,300,300,300,300,300
300,300,300,300,300,300,300,300,300,300,300,300,300,300,300,300,300,300,300,300,300,300
300,300,300,300,300,300,300,300,300,300,300,300,300,300,300,300,300,300,300,300,300,300
300,300,300,300,300,300,300,300,300,300,300,300,300,300,300,300,300,300,300,300,300,300
300,300,300,300,300,300,300,300,300,300,300,300,300,300,300,300,300,300,300,300,300,300
300,300,300,300,300,300,300,300,300,300,300,300,300,300,300,300,300,300,300,300,300,300
300,300,300,300,300,300,300,300,300,300,300,300,300,300,300,300,300,300,300,300,300,300
300,300,300,300,300,300,300,300,300,300,300,300,300,300,300,300,300,300,300,300,300,300
300,300,300,300,300,300,300,300,300,300,300,300,300,300,300,300,300,300,300,300,300,300
300,300,300,300,300,300,300,300,300,300,300,300,300,300,300,300,300,300,300,300,300,300
410,370,350,350,350,350,350,350,350,350,350,350,350,350,350,350,350,360,380,400,430,570
450,390,360,350,350,350,350,350,350,350,350,350,350,350,350,350,350,350,360,380,400,490
300,300,300,300,300,300,300,300,300,300,300,300,300,300,300,300,300,300,300,300,300,300
300,300,300,300,300,300,300,300,300,300,300,300,300,300,300,300,300,300,300,300,300,300
300,300,300,300,300,300,300,300,300,300,300,300,300,300,300,300,300,300,300,300,300,300
300,300,300,300,300,300,300,300,300,300,300,300,300,300,300,300,300,300,300,300,300,300
300,300,300,300,300,300,300,300,300,300,300,300,300,300,300,300,300,300,300,300,300,300
300,300,300,300,300,300,300,300,300,300,300,300,300,300,300,300,300,300,300,300,300,300
300,300,300,300,300,300,300,300,300,300,300,300,300,300,300,300,300,300,300,300,300,300
300,300,300,300,300,300,300,300,300,300,300,300,300,300,300,300,300,300,300,300,300,300
300,300,300,300,300,300,300,300,300,300,300,300,300,300,300,300,300,300,300,300,300,300
300,300,300,300,300,300,300,300,300,300,300,300,300,300,300,300,300,300,300,300,300,300
300,300,300,300,300,300,300,300,300,300,300,300,300,300,300,300,300,300,300,300,300,300
300,300,300,300,300,300,300,300,300,300,300,300,300,300,300,300,300,300,300,300,300,300
300,300,300,300,300,300,300,300,300,300,300,300,300,300,300,300,300,300,300,300,300,300
300,300,300,300,300,300,300,300,300,300,300,300,300,300,300,300,300,300,300,300,300,300
300,300,300,300,300,300,300,300,300,300,300,300,300,300,300,300,300,300,300,300,300,300
300,300,300,300,300,300,300,300,300,300,300,300,300,300,300,300,300,300,300,300,300,300
300,300,300,300,300,300,300,300,300,300,300,300,300,300,300,300,300,300,300,300,300,300
300,300,300,300,300,300,300,300,300,300,300,300,300,300,300,300,300,300,300,300,300,300
300,300,300,300,300,300,300,300,300,300,300,300,300,300,300,300,300,300,300,300,300,300
