unified_raw_limit,,,,,,,,,,,,,,,,,,,,,
9999,500,990,,,,,,,,,,,,,,,,,,,
noise_data_limit,,,,,,,,,,,,,,,,,,,,,
70,,,,,,,,,,,,,,,,,,,,,
shortciurt_threshold,,,,,,,,,,,,,,,,,,,,,
30,150,150,150,100,100,16,,,,,,,,,,,,,,,
specail_raw_max,,,,,,,,,,,,,,,,,,,,,
5330,5060,5040,5054,4963,4908,4911,4821,4808,4765,4719,4631,4624,4568,4594,4570,4579,4552,4612,4483,4477,4391
5392,5097,5075,5098,5008,4953,4954,4863,4842,4798,4752,4661,4650,4592,4624,4602,4609,4581,4650,4507,4504,4422
5379,5073,5046,5055,4964,4908,4907,4813,4798,4752,4706,4618,4607,4551,4577,4556,4563,4534,4596,4470,4470,4391
5317,5010,4981,4955,4864,4808,4804,4702,4702,4657,4609,4533,4518,4464,4479,4459,4465,4438,4485,4392,4395,4316
5278,4967,4929,4885,4793,4732,4725,4611,4617,4568,4514,4433,4418,4361,4369,4347,4351,4321,4352,4279,4278,4201
5302,4981,4946,4912,4815,4751,4745,4630,4633,4582,4529,4442,4426,4369,4378,4355,4358,4329,4364,4282,4282,4200
5278,4955,4919,4872,4778,4715,4706,4590,4592,4542,4488,4404,4388,4331,4338,4314,4318,4292,4318,4249,4248,4167
5227,4910,4877,4811,4717,4654,4643,4526,4533,4482,4429,4349,4332,4277,4282,4260,4262,4235,4257,4205,4204,4123
5220,4898,4860,4794,4698,4633,4622,4503,4511,4459,4404,4323,4308,4254,4254,4232,4235,4208,4226,4180,4179,4097
5211,4889,4849,4776,4680,4613,4602,4481,4487,4435,4381,4303,4286,4228,4232,4209,4215,4186,4200,4161,4160,4078
5162,4834,4794,4712,4616,4550,4537,4416,4423,4371,4319,4243,4227,4170,4173,4150,4154,4127,4135,4110,4109,4027
5171,4837,4794,4708,4612,4543,4530,4409,4414,4362,4306,4234,4215,4160,4163,4137,4141,4115,4123,4100,4098,4015
5127,4803,4759,4665,4568,4500,4485,4362,4369,4316,4261,4189,4173,4115,4117,4097,4097,4071,4071,4059,4059,3976
5099,4771,4726,4629,4530,4462,4446,4325,4330,4278,4222,4156,4136,4080,4080,4058,4062,4037,4036,4030,4028,3945
5098,4763,4717,4617,4518,4449,4433,4313,4317,4264,4208,4140,4122,4067,4067,4045,4050,4024,4022,4017,4017,3932
5051,4724,4678,4574,4475,4407,4390,4267,4275,4219,4165,4098,4080,4024,4024,4004,4007,3981,3979,3976,3976,3892
5059,4730,4680,4572,4473,4403,4386,4261,4266,4217,4157,4093,4075,4020,4019,3998,4002,3976,3972,3974,3974,3889
5019,4680,4633,4527,4423,4356,4335,4212,4215,4163,4106,4044,4026,3971,3970,3949,3953,3929,3923,3928,3928,3844
4997,4664,4621,4505,4408,4334,4314,4192,4196,4143,4085,4026,4007,3953,3952,3931,3935,3910,3905,3910,3910,3825
4923,4577,4527,4413,4313,4243,4226,4101,4105,4052,3996,3941,3923,3868,3866,3845,3848,3824,3816,3825,3824,3741
4075,4011,4049,4018,3994,3996,4041,3992,4056,4066,4072,4070,4109,4110,4169,4206,4271,4309,4365,4453,4542,4986
4075,4011,4048,4015,3993,3993,4039,3988,4053,4061,4069,4066,4104,4105,4162,4200,4265,4303,4360,4444,4527,4876
4054,3991,4027,3996,3974,3974,4020,3968,4033,4044,4050,4050,4088,4089,4147,4184,4251,4288,4343,4429,4514,4850
4036,3971,4006,3975,3954,3954,4000,3950,4014,4023,4031,4032,4072,4071,4130,4167,4234,4271,4327,4413,4498,4806
4023,3957,3993,3961,3940,3940,3987,3936,4001,4011,4019,4020,4058,4061,4119,4158,4225,4262,4317,4407,4488,4785
3994,3929,3965,3933,3911,3911,3957,3909,3974,3984,3992,3994,4033,4036,4095,4134,4202,4238,4293,4379,4465,4750
3993,3928,3963,3932,3911,3911,3957,3907,3974,3985,3992,3997,4036,4039,4097,4137,4204,4243,4299,4387,4470,4742
3966,3902,3936,3905,3885,3885,3931,3883,3949,3961,3968,3975,4015,4018,4076,4115,4180,4225,4279,4365,4452,4715
3952,3889,3924,3893,3874,3875,3920,3872,3939,3950,3959,3968,4007,4011,4070,4109,4173,4215,4274,4361,4447,4704
3928,3866,3901,3871,3851,3853,3898,3853,3918,3929,3940,3949,3989,3993,4053,4088,4156,4197,4257,4343,4429,4673
3916,3855,3890,3861,3841,3842,3888,3841,3909,3920,3931,3941,3980,3988,4044,4082,4150,4192,4248,4336,4422,4664
3889,3829,3864,3835,3815,3816,3862,3816,3883,3896,3906,3920,3958,3963,4022,4062,4130,4170,4227,4313,4399,4638
3892,3832,3867,3837,3818,3819,3864,3818,3887,3898,3911,3922,3962,3967,4026,4066,4135,4175,4231,4319,4405,4634
3880,3820,3855,3827,3806,3807,3854,3809,3875,3888,3898,3911,3954,3958,4017,4057,4124,4165,4223,4310,4395,4622
3866,3807,3842,3812,3793,3794,3841,3797,3862,3874,3885,3900,3941,3945,4005,4045,4114,4153,4212,4299,4384,4612
3875,3819,3853,3823,3803,3805,3850,3803,3871,3887,3896,3910,3952,3957,4015,4056,4124,4165,4222,4310,4395,4616
3849,3790,3827,3797,3777,3779,3824,3777,3848,3858,3870,3885,3926,3931,3989,4031,4098,4139,4196,4284,4369,4591
3835,3777,3815,3785,3767,3767,3812,3767,3835,3848,3861,3877,3919,3924,3984,4026,4095,4136,4196,4284,4369,4594
3818,3763,3799,3771,3751,3753,3801,3754,3822,3836,3848,3866,3907,3914,3974,4015,4084,4126,4186,4274,4357,4573
3712,3669,3708,3681,3662,3664,3708,3666,3732,3746,3758,3783,3825,3832,3892,3933,4002,4044,4101,4188,4270,4491
specail_raw_min,,,,,,,,,,,,,,,,,,,,,
2870,2725,2713,2721,2672,2643,2644,2596,2589,2566,2541,2494,2489,2459,2473,2461,2466,2451,2483,2414,2410,2364
2903,2744,2732,2745,2697,2667,2667,2618,2607,2583,2559,2510,2503,2473,2489,2478,2482,2466,2503,2426,2425,2381
2896,2732,2717,2722,2673,2643,2642,2592,2583,2559,2534,2487,2480,2450,2464,2453,2457,2441,2475,2407,2407,2364
2863,2697,2682,2668,2619,2589,2587,2531,2531,2508,2482,2440,2433,2403,2412,2401,2404,2389,2415,2365,2366,2324
2842,2674,2654,2630,2580,2548,2544,2482,2486,2459,2431,2387,2379,2348,2352,2340,2342,2326,2343,2304,2303,2262
2855,2682,2663,2645,2592,2558,2555,2493,2494,2467,2438,2391,2383,2352,2357,2345,2347,2331,2349,2305,2305,2261
2842,2668,2648,2623,2573,2538,2534,2471,2473,2445,2417,2371,2363,2332,2335,2323,2325,2311,2325,2288,2287,2244
2814,2643,2626,2590,2540,2506,2500,2437,2440,2413,2384,2342,2333,2303,2305,2293,2295,2280,2292,2264,2263,2220
2811,2637,2617,2581,2529,2494,2489,2424,2429,2401,2371,2328,2319,2291,2291,2279,2280,2265,2275,2251,2250,2206
2806,2632,2611,2571,2520,2484,2478,2412,2416,2388,2359,2317,2307,2277,2279,2266,2270,2254,2261,2240,2240,2195
2779,2603,2581,2537,2485,2450,2443,2377,2382,2354,2326,2284,2276,2245,2247,2235,2237,2222,2226,2213,2212,2168
2784,2604,2581,2535,2483,2446,2439,2374,2377,2349,2319,2279,2270,2240,2242,2228,2230,2216,2220,2207,2207,2162
2760,2586,2562,2512,2459,2423,2415,2349,2352,2324,2294,2256,2247,2216,2216,2206,2206,2192,2192,2186,2186,2141
2746,2569,2545,2492,2439,2403,2394,2328,2331,2303,2273,2237,2227,2197,2197,2185,2187,2174,2173,2170,2169,2124
2745,2564,2540,2486,2433,2396,2387,2322,2324,2296,2265,2229,2219,2190,2190,2178,2181,2167,2165,2163,2163,2117
2720,2543,2519,2463,2410,2373,2363,2298,2302,2272,2242,2207,2197,2167,2167,2156,2158,2144,2142,2141,2141,2095
2724,2547,2520,2461,2408,2370,2361,2294,2297,2270,2238,2204,2194,2165,2164,2153,2155,2141,2139,2139,2139,2094
2702,2520,2494,2438,2382,2345,2334,2268,2270,2242,2211,2177,2167,2138,2137,2126,2128,2116,2112,2115,2115,2069
2690,2511,2488,2426,2373,2333,2323,2257,2259,2230,2200,2167,2158,2128,2128,2116,2118,2105,2102,2105,2105,2060
2650,2464,2438,2376,2322,2284,2275,2208,2210,2181,2151,2122,2112,2083,2081,2070,2072,2059,2055,2060,2059,2014
2194,2160,2180,2163,2151,2151,2176,2149,2184,2189,2193,2191,2212,2213,2244,2265,2300,2320,2350,2398,2445,2685
2194,2160,2179,2162,2150,2150,2174,2147,2182,2186,2191,2189,2209,2210,2241,2261,2296,2317,2347,2393,2438,2625
2183,2149,2168,2151,2139,2139,2165,2137,2172,2177,2181,2181,2201,2202,2233,2253,2289,2309,2338,2384,2431,2611
2173,2138,2157,2140,2129,2129,2153,2127,2161,2166,2170,2171,2193,2192,2223,2244,2279,2300,2330,2376,2422,2587
2166,2130,2150,2132,2121,2121,2146,2119,2154,2160,2164,2165,2185,2186,2218,2239,2275,2295,2324,2373,2417,2576
2151,2116,2135,2118,2106,2106,2130,2104,2139,2145,2149,2151,2172,2173,2205,2226,2263,2282,2312,2358,2404,2557
2150,2115,2134,2117,2106,2106,2130,2104,2139,2146,2149,2152,2173,2174,2206,2228,2263,2284,2314,2362,2407,2553
2135,2101,2119,2102,2092,2092,2116,2090,2126,2132,2137,2140,2162,2163,2195,2216,2251,2275,2304,2350,2397,2538
2128,2094,2113,2096,2086,2086,2111,2085,2121,2127,2132,2137,2158,2160,2191,2212,2247,2270,2301,2348,2394,2533
2115,2081,2100,2084,2074,2074,2099,2074,2109,2116,2121,2126,2148,2150,2182,2201,2237,2260,2292,2338,2384,2516
2109,2076,2095,2079,2068,2069,2093,2068,2104,2111,2116,2122,2143,2147,2177,2198,2235,2257,2287,2335,2381,2511
2094,2062,2081,2065,2054,2055,2079,2055,2090,2097,2103,2111,2131,2134,2165,2187,2223,2245,2276,2322,2368,2497
2095,2063,2082,2066,2055,2056,2081,2055,2093,2099,2106,2111,2133,2136,2167,2189,2226,2248,2278,2326,2372,2495
2089,2057,2076,2060,2049,2050,2075,2051,2086,2093,2099,2106,2129,2131,2163,2184,2221,2242,2274,2321,2366,2489
2081,2050,2069,2053,2042,2043,2068,2044,2079,2086,2092,2100,2122,2124,2156,2178,2215,2236,2268,2314,2361,2483
2086,2056,2074,2058,2048,2048,2073,2048,2084,2093,2097,2105,2128,2130,2162,2184,2221,2242,2273,2321,2366,2485
2072,2041,2060,2044,2034,2034,2059,2034,2072,2077,2083,2092,2114,2116,2148,2170,2207,2228,2259,2307,2352,2472
2065,2034,2054,2038,2028,2028,2053,2028,2065,2072,2079,2088,2110,2113,2145,2167,2205,2227,2259,2307,2352,2473
2055,2026,2046,2030,2020,2020,2046,2021,2058,2065,2072,2081,2104,2107,2139,2162,2199,2221,2254,2301,2346,2462
1999,1976,1997,1982,1971,1973,1997,1973,2009,2017,2023,2036,2060,2063,2095,2118,2155,2177,2208,2255,2299,2418
special_raw_delta,,,,,,,,,,,,,,,,,,,,,
350,350,300,300,300,300,300,300,300,300,300,300,300,300,300,300,300,300,300,300,300,300
350,350,300,300,300,300,300,300,300,300,300,300,300,300,300,300,300,300,300,300,300,300
350,350,300,300,300,300,300,300,300,300,300,300,300,300,300,300,300,300,300,300,300,300
350,350,300,300,300,300,300,300,300,300,300,300,300,300,300,300,300,300,300,300,300,300
350,350,300,300,300,300,300,300,300,300,300,300,300,300,300,300,300,300,300,300,300,300
350,350,300,300,300,300,300,300,300,300,300,300,300,300,300,300,300,300,300,300,300,300
350,350,300,300,300,300,300,300,300,300,300,300,300,300,300,300,300,300,300,300,300,300
350,350,300,300,300,300,300,300,300,300,300,300,300,300,300,300,300,300,300,300,300,300
350,350,300,300,300,300,300,300,300,300,300,300,300,300,300,300,300,300,300,300,300,300
350,350,300,300,300,300,300,300,300,300,300,300,300,300,300,300,300,300,300,300,300,300
350,350,300,300,300,300,300,300,300,300,300,300,300,300,300,300,300,300,300,300,300,300
350,350,300,300,300,300,300,300,300,300,300,300,300,300,300,300,300,300,300,300,300,300
350,350,300,300,300,300,300,300,300,300,300,300,300,300,300,300,300,300,300,300,300,300
350,350,300,300,300,300,300,300,300,300,300,300,300,300,300,300,300,300,300,300,300,300
350,350,300,300,300,300,300,300,300,300,300,300,300,300,300,300,300,300,300,300,300,300
350,350,300,300,300,300,300,300,300,300,300,300,300,300,300,300,300,300,300,300,300,300
350,350,300,300,300,300,300,300,300,300,300,300,300,300,300,300,300,300,300,300,300,300
350,350,300,300,300,300,300,300,300,300,300,300,300,300,300,300,300,300,300,300,300,300
350,350,300,300,300,300,300,300,300,300,300,300,300,300,300,300,300,300,300,300,300,300
420,370,350,350,350,350,350,350,350,350,350,350,350,350,350,350,360,370,390,410,430,746
466,390,360,350,350,350,350,350,350,350,350,350,350,350,350,350,350,360,370,390,400,560
300,300,300,300,300,300,300,300,300,300,300,300,300,300,300,300,300,300,300,300,350,350
300,300,300,300,300,300,300,300,300,300,300,300,300,300,300,300,300,300,300,300,350,350
300,300,300,300,300,300,300,300,300,300,300,300,300,300,300,300,300,300,300,300,350,350
300,300,300,300,300,300,300,300,300,300,300,300,300,300,300,300,300,300,300,300,350,350
300,300,300,300,300,300,300,300,300,300,300,300,300,300,300,300,300,300,300,300,350,350
300,300,300,300,300,300,300,300,300,300,300,300,300,300,300,300,300,300,300,300,350,350
300,300,300,300,300,300,300,300,300,300,300,300,300,300,300,300,300,300,300,300,350,350
300,300,300,300,300,300,300,300,300,300,300,300,300,300,300,300,300,300,300,300,350,350
300,300,300,300,300,300,300,300,300,300,300,300,300,300,300,300,300,300,300,300,350,350
300,300,300,300,300,300,300,300,300,300,300,300,300,300,300,300,300,300,300,300,350,350
300,300,300,300,300,300,300,300,300,300,300,300,300,300,300,300,300,300,300,300,350,350
300,300,300,300,300,300,300,300,300,300,300,300,300,300,300,300,300,300,300,300,350,350
300,300,300,300,300,300,300,300,300,300,300,300,300,300,300,300,300,300,300,300,350,350
300,300,300,300,300,300,300,300,300,300,300,300,300,300,300,300,300,300,300,300,350,350
300,300,300,300,300,300,300,300,300,300,300,300,300,300,300,300,300,300,300,300,350,350
300,300,300,300,300,300,300,300,300,300,300,300,300,300,300,300,300,300,300,300,350,350
300,300,300,300,300,300,300,300,300,300,300,300,300,300,300,300,300,300,300,300,350,350
300,300,300,300,300,300,300,300,300,300,300,300,300,300,300,300,300,300,300,300,350,350
300,300,300,300,300,300,300,300,300,300,300,300,300,300,300,300,300,300,300,300,350,350
