[
  {
    "color": [
      0.79748666286468506,
      0.79748302698135376,
      0.79748302698135376
    ],
    "ignore_ext_mv": false,
    "intensity_diff": 0,
    "intensity_spec": 0,
    "ltc_two_sided": true,
    "name": "key",
    "onnoff": true,
    "rel_rot": [
      -0.75105732679367065,
      -0.63800597190856934,
      0
    ],
    "rel_scale": [
      1,
      1
    ],
    "rel_trans": [
      -2.6119999885559082,
      4.094214916229248,
      3.522831916809082
    ],
    "shadow_cast": true,
    "type": "AREA"
  },
  {
    "color": [
      1,
      0.99999547004699707,
      0.99999547004699707
    ],
    "ignore_ext_mv": true,
    "intensity_diff": 30,
    "intensity_spec": 50,
    "ltc_two_sided": true,
    "name": "fill",
    "onnoff": false,
    "rel_rot": [
      -0.66703957319259644,
      -1.8112802505493164,
      5
    ],
    "rel_scale": [
      2,
      2
    ],
    "rel_trans": [
      -4.5782361030578613,
      3.7119362354278564,
      -1.122719407081604
    ],
    "shadow_cast": false,
    "type": "AREA"
  },
  {
    "color": [
      1,
      1,
      1
    ],
    "ignore_ext_mv": false,
    "intensity_diff": 30,
    "intensity_spec": 0,
    "ltc_two_sided": true,
    "name": "back",
    "onnoff": false,
    "rel_rot": [
      -0.33537566661834717,
      -1.0651962757110596,
      0
    ],
    "rel_scale": [
      1,
      1
    ],
    "rel_trans": [
      -4.95684814453125,
      1.974743127822876,
      2.7440927028656006
    ],
    "shadow_cast": false,
    "type": "POINT"
  }
]
