0 0 0 0 
0 0 0 0 
0 0 0 0 
0 0 0 0 
0 0 0 0 
0 0 0 0 
0 0 0 0 
0 0 0 0 
0 0 0 0 
0 0 0 0 
0.00213639531284571 7.25924837752245e-06 1.16127796445653e-06 -2.20445826926152e-07 
0.00256112730130553 7.70356382417958e-06 1.28742976812646e-06 -2.4640439733048e-07 
0.00291190296411514 7.40375435270835e-06 1.29198178910883e-06 -2.23983349201262e-07 
0.00325354840606451 7.47800322642433e-06 1.36801520511654e-06 -2.09751377155953e-07 
0.00355804152786732 7.50876779420651e-06 1.4610519656344e-06 -1.88298002967713e-07 
0.00382618722505867 7.42510019335896e-06 1.52785844420578e-06 -1.56706988718724e-07 
0.00404989812523127 7.45440775062889e-06 1.60833110385283e-06 -1.24166390946812e-07 
0.00421778159216046 7.30967985873576e-06 1.6880027260413e-06 -9.87764821047676e-08 
0.00431388337165117 7.06471018929733e-06 1.74737454017304e-06 -7.73016424204798e-08 
0.0043261107057333 6.7070886871079e-06 1.7338302313874e-06 -6.63879689000169e-08 
0.00425642542541027 6.45436966806301e-06 1.72414081589523e-06 -6.0202054896763e-08 
0.00412960210815072 6.484171080956e-06 1.71612896338047e-06 -5.37835092018213e-08 
0.00398242752999067 6.67158246869803e-06 1.72843556356383e-06 -4.69582417395031e-08 
0.00384933757595718 7.01184399076737e-06 1.72955401467334e-06 -4.62434002201917e-08 
0.00377718475647271 7.52293453842867e-06 1.76214712155343e-06 -4.35584190938698e-08 
0.00379384029656649 8.14929717307677e-06 1.83924521479639e-06 -3.66074495161683e-08 
0.00391143606975675 8.73221779329469e-06 1.93885466615029e-06 -4.33837072932874e-08 
0.00413048313930631 9.29808811633848e-06 2.02480077859946e-06 -4.69193182084382e-08 
0.00441867858171463 9.64999253483256e-06 2.14584702007414e-06 -4.75996593252148e-08 
0.004747508559376 9.81728044280317e-06 2.25111648433085e-06 -4.96416134865285e-08 
0.00507434783503413 9.8241735031479e-06 2.35466700360121e-06 -5.48270371325543e-08 
0.00535057997331023 9.44800831348402e-06 2.42303849518066e-06 -6.36723953562068e-08 
0.00555012281984091 8.95610901352484e-06 2.49091340265295e-06 -6.74007054612957e-08 
0.00566514674574137 8.57093255035579e-06 2.51328719969024e-06 -7.16124262112317e-08 
0.00568265747278929 8.21309458842734e-06 2.52495578934031e-06 -7.62941496645908e-08 
0.00564256124198437 7.95911455497844e-06 2.51396591011144e-06 -9.23289320553522e-08 
0.00562157947570086 8.04992123448756e-06 2.5098820515268e-06 -9.86206956099522e-08 
0.00569620030000806 8.41812379803741e-06 2.54697647505964e-06 -1.15229546793216e-07 
0.00594748370349407 9.18115802051034e-06 2.66418987848738e-06 -1.23696707987619e-07 
0.00647906726226211 1.0512859262235e-05 2.86015256278915e-06 -1.30912908957725e-07 
0.00741196237504482 1.25724682220607e-05 3.21881816489622e-06 -1.40503018997151e-07 
0.00887873955070972 1.57169397425605e-05 3.73879356629914e-06 -1.69931027471648e-07 
0.0110660269856453 2.02108349185437e-05 4.42062355432427e-06 -1.92834576751011e-07 
0.014208328910172 2.59895441558911e-05 5.30466968484689e-06 -2.07201082957909e-07 
0.0185778308659792 3.31903393089306e-05 6.27273720965604e-06 -1.71402021464928e-07 
0.0243935789912939 4.15790309489239e-05 7.28531585991732e-06 -1.0405284456283e-07 
0.0317305997014046 5.07695149281062e-05 8.01362875790801e-06 -2.67169362189179e-08 
0.0404577851295471 5.83929468120914e-05 8.70591884449823e-06 -3.67428718561769e-08 
0.0504259094595909 6.64607432554476e-05 8.74230681802146e-06 4.12282084027993e-08 
0.0610499419271946 7.23075063433498e-05 8.26938776299357e-06 2.31901310598914e-07 
0.0719106569886208 7.62342460802756e-05 7.58636042519356e-06 3.98793162048605e-07 
0.0825574770569801 7.53836648073047e-05 6.29817577646463e-06 4.52687658025752e-07 
0.0925391688942909 7.50910985516384e-05 5.21497304362128e-06 5.22286313753284e-07 
0.101624399423599 7.30148749426007e-05 3.79067978428793e-06 6.92367223109613e-07 
0.109645396471024 6.82158497511409e-05 3.3611261187616e-06 6.34603907201381e-07 
0.116509653627872 6.54718896839768e-05 2.3961247279658e-06 5.411020538304e-07 
0.122363321483135 6.05658460699487e-05 1.56396185957419e-06 4.45994004394379e-07 
0.127259850502014 5.54637008463033e-05 3.14494116082642e-07 7.04827243680484e-07 
0.131463080644608 4.95150525239296e-05 -5.72336944060226e-07 6.20361390701873e-07 
0.135087162256241 4.583116970025e-05 -1.95732968677476e-06 3.15511812232216e-07 
0.138277634978294 3.83737315132748e-05 -3.17003218697209e-06 2.13507419744019e-07 
0.14086939394474 3.51682174368761e-05 -3.06925039694761e-06 2.32303577263338e-07 
0.143228515982628 3.16797522827983e-05 -2.61191325989785e-06 -4.80009532566328e-07 
0.145101368427277 2.59260414168239e-05 -2.63546598944231e-06 -4.68907217054948e-07 
0.146472066640854 2.44429938902613e-05 -3.45141211255395e-06 -4.22812263423111e-07 
0.147490546107292 2.1485557226697e-05 -3.40894007422321e-06 -8.52268954076862e-07 
0.148285686969757 2.0278926967876e-05 -3.80344499717467e-06 -1.28459430470684e-06 
0.148831769824028 1.61979587574024e-05 -4.15074555348838e-06 -7.71195914239797e-07 
0.149130687117577 1.49626039274153e-05 -3.09917709273577e-06 -9.45960209719487e-07 
0.149656400084496 1.12070601971936e-05 -2.3943839551066e-06 -1.12333327706438e-06 
0.150022178888321 1.20368476927979e-05 -2.56611360782699e-06 -1.02729597983853e-06 
0.150392666459084 7.77088098402601e-06 -1.3987622651257e-06 -6.6201045001435e-07 
0.150728568434715 8.0965755842044e-06 -1.31353442611726e-06 -3.23076648101051e-07 
0.150995224714279 8.72702730703168e-06 -2.55509689850442e-06 -7.75756518578419e-07 
0.150742441415787 8.28433530841721e-06 -2.13864700526756e-06 -5.81472363592184e-07 
0.150572210550308 5.69642270420445e-06 -1.79576215941779e-06 -6.41639246623527e-07 
0.150412648916245 6.99379597790539e-06 -2.91349419967446e-06 -9.97698975879757e-07 
0.149877905845642 1.70292946677364e-06 -4.51153709946084e-06 -1.27195903587562e-06 
0.149321749806404 -1.62920764523733e-06 -5.24948700331151e-06 -6.52100368370157e-07 
0.148967310786247 -7.67857727623777e-06 -6.64150820739451e-06 -2.58439996514426e-07 
0.14829121530056 -1.20440363389207e-05 -6.13722568232333e-06 1.44202829233109e-07 
0.147140741348267 -1.61492898769211e-05 -5.47130821360042e-06 6.33036563613132e-07 
0.146170020103455 -1.72578493220499e-05 -4.40127905676491e-06 4.47986792551092e-07 
0.14473569393158 -1.95375741895987e-05 -2.69764268523431e-06 4.72501483272936e-07 
0.143241450190544 -1.87187069968786e-05 -1.70060309301334e-06 2.35038584150971e-07 
0.141464114189148 -2.08055771508953e-05 -2.17931415136263e-06 1.29114454239243e-07 
0.139612376689911 -2.10449597943807e-05 -3.17243711833726e-06 -9.7376648966474e-08 
0.13756999373436 -2.29953457164811e-05 -2.45717228608555e-06 3.07561336398976e-08 
0.135427445173264 -2.42268197325757e-05 -2.23273491428699e-06 3.29951689082009e-07 
0.132822573184967 -2.56646544585237e-05 -1.19272840493068e-06 8.17275235931447e-07 
0.130358576774597 -2.52243426075438e-05 7.63658817959367e-07 1.14668898731907e-06 
0.127614244818687 -2.6634867026587e-05 1.48769584029651e-06 1.88574210824299e-06 
0.12448213994503 -2.6618950869306e-05 2.20115339288895e-06 1.4038936342331e-06 
0.121592722833157 -3.09193710563704e-05 1.41202940540097e-06 1.41602288294962e-06 
0.118414506316185 -3.43834362865891e-05 2.54268456956197e-06 6.9516119083346e-07 
0.115135461091995 -3.836426185444e-05 1.91628532775212e-06 7.44849387501745e-07 
0.111929930746555 -4.24211539211683e-05 2.88156707028975e-06 5.53244774437189e-07 
0.108732551336288 -4.34675603173673e-05 2.77554090644117e-06 1.01796615581407e-06 
0.105361171066761 -4.30922591476701e-05 4.46221429228899e-06 7.58865667194186e-07 
0.102297633886337 -4.31234439020045e-05 3.94980452256277e-06 9.74248109741893e-07 
0.0990722477436066 -4.46520316472743e-05 3.99894906877307e-06 6.10576591952849e-07 
0.0958089828491211 -4.4560780224856e-05 3.71782743968652e-06 1.16972600494591e-07 
0.0925943031907082 -4.50403240392916e-05 3.56085979547061e-06 3.39696732964967e-08 
0.0890373885631561 -4.61889831058215e-05 3.77450578525895e-06 -1.7255105433378e-07 
0.0852901339530945 -4.8493871872779e-05 4.00836779590463e-06 -4.09856340866099e-07 
0.0812448859214783 -4.76594577776268e-05 4.84128031530418e-06 -3.08372506196974e-07 
0.0768184512853622 -4.8962338041747e-05 4.8033325583674e-06 -1.97069780938364e-07 
0.0720640793442726 -5.15352476213593e-05 5.48941306988127e-06 -1.04662071009898e-07 
0.0672526657581329 -5.06636606587563e-05 5.30119268660201e-06 -1.20238425438401e-07 
0.0623582117259502 -4.99696798215155e-05 4.89421063321061e-06 8.63617444224474e-08 
0.0574709624052048 -5.02114780829288e-05 4.76476725452812e-06 -8.95447200832677e-08 
0.0527524277567863 -4.92955223307945e-05 5.10585095980787e-06 -1.593435712266e-07 
0.0482477508485317 -4.58679205621593e-05 4.74022681373754e-06 -3.09315993263226e-07 
0.0440477579832077 -4.4470580178313e-05 4.39586801803671e-06 -4.19273163743128e-07 
0.0400736182928085 -4.08489831897896e-05 4.52236145065399e-06 -5.97212022057647e-07 
0.0364718995988369 -3.7435023841681e-05 3.80606365979475e-06 -5.75536262203968e-07 
0.0333186276257038 -3.36351440637372e-05 3.89712477044668e-06 -6.37592506791407e-07 
0.0304680820554495 -3.09708811983e-05 4.05586570195737e-06 -6.05853415436286e-07 
0.0278837736696005 -2.68293970293598e-05 4.12315557696274e-06 -5.81181325287616e-07 
0.0255729407072067 -2.35448478633771e-05 4.04789398089633e-06 -5.24871666129911e-07 
0.0235447213053703 -1.99890946532832e-05 4.27773966293898e-06 -4.71718720973513e-07 
0.0217120330780745 -1.64313114510151e-05 4.48334685643204e-06 -4.81390145523619e-07 
0.0200961381196976 -1.36449389174231e-05 4.37935614172602e-06 -5.12834162691433e-07 
0.0186155810952187 -1.10266601041076e-05 4.32853767051711e-06 -5.45252419215103e-07 
0.01730434037745 -9.32424063648796e-06 4.28264547736035e-06 -5.17831210800068e-07 
0.0161198079586029 -7.65928234613966e-06 4.12697318097344e-06 -5.17068883709726e-07 
0.0150472866371274 -7.02288480169955e-06 3.80528240384592e-06 -4.7518128099e-07 
0.0140208881348372 -5.6067756304401e-06 3.74113733414561e-06 -4.79171546885482e-07 
0.0130722559988499 -5.21549964105361e-06 3.52493793798203e-06 -4.65174878172547e-07 
0.0121458070352674 -4.45429168394185e-06 3.4089614473487e-06 -4.60485182429693e-07 
0.0112502155825496 -4.0640866245667e-06 3.37795472660218e-06 -4.88702539769292e-07 
0.0103726284578443 -3.48897060575837e-06 3.20102594741911e-06 -5.07689264850342e-07 
0.0095472289249301 -3.11907115246868e-06 3.07193772641767e-06 -5.50034542357025e-07 
0.00873972941190004 -2.84204907075036e-06 3.08104063151404e-06 -5.30288275513158e-07 
0.00796868745237589 -2.79639721156855e-06 2.97831661555392e-06 -5.50714844393951e-07 
0.00721515249460936 -2.35617699217983e-06 2.86093609247473e-06 -5.28652606135438e-07 
0.00649657798931003 -2.37082076637307e-06 2.83139956991363e-06 -5.31384216628794e-07 
0.00580683164298534 -2.47688308263605e-06 2.67643554252572e-06 -4.97901112339605e-07 
0.00515601458027959 -2.65739799942821e-06 2.53008465733728e-06 -4.80749463349639e-07 
0.00455655157566071 -2.63876449935196e-06 2.40173949350719e-06 -4.63434219000192e-07 
0.00399825256317854 -2.81499683296715e-06 2.25598432734841e-06 -4.59663738183735e-07 
0.0034759184345603 -2.5527915568091e-06 2.08319875127927e-06 -4.16463848296189e-07 
0.00293820188380778 -2.37515860135318e-06 2.02990941033931e-06 -3.83936452408307e-07 
0.00242474256083369 -1.74943954789342e-06 1.91077970157494e-06 -3.6690758520308e-07 
0.00194004632066935 -1.04225011909875e-06 1.71195779330446e-06 -3.15799098871139e-07 
0.00151208799798042 -1.36277719775535e-07 1.48783044551237e-06 -2.49996901402483e-07 
0.0011592369992286 7.30083229427692e-07 1.26481711504312e-06 -2.01025542878597e-07 
0.00090734800323844 1.17885895178915e-06 9.69356733548921e-07 -1.49509219227184e-07 
0.000728740938939154 1.50674293308839e-06 7.23406287761463e-07 -9.46725862149833e-08 
0.000603562511969358 1.55756731601286e-06 5.84989550134196e-07 -7.46642783155949e-08 
0.000506770273204893 1.58617319812038e-06 4.91847913508536e-07 -6.22438136588244e-08 
0.000427483901148662 1.47563628161151e-06 4.00822131041423e-07 -4.26008739395911e-08 
0.000368791748769581 1.7184888747579e-06 3.62384213303812e-07 -3.52740698872367e-08 
0.000318655249429867 1.80126198756625e-06 3.45016871960979e-07 -3.10234611333726e-08 
0.000275916972896084 1.81300640633708e-06 2.83017726587786e-07 -2.42644730974462e-08 
0.000235304760280997 1.52344296111551e-06 2.24748092136906e-07 -2.23471552374122e-08 
0.000205561402253807 1.42211445108842e-06 2.05019674126561e-07 -1.15272031919744e-08 
0.000182953604962677 1.46217530527792e-06 1.78725272803604e-07 -5.83231862805178e-09 
0.000168642043718137 1.60033221163758e-06 1.52662082086863e-07 9.61266552468309e-11 
0.000152069391333498 1.65008043495618e-06 1.62832279215763e-07 8.75952554935111e-09 
0.000145235593663529 2.091974238283e-06 1.99634371256252e-07 6.64343291489899e-09 
0.000130162734421901 2.21060759031388e-06 2.11551196116488e-07 -1.42179379380991e-09 
0.000118432988529094 2.22496396418137e-06 2.09215912150285e-07 -1.01856887368967e-08 
9.60023462539539e-05 1.73037722106528e-06 1.72179227320157e-07 -7.02880686986873e-09 
8.866933058016e-05 1.72573527379427e-06 1.68483325069246e-07 -6.1290457153973e-09 
7.22869372111745e-05 1.25314340948535e-06 1.36934886540985e-07 6.96103930053482e-09 
6.67901185806841e-05 1.12153225018119e-06 1.29065725218425e-07 -5.17623555129632e-10 
5.6120832596207e-05 9.3729380523655e-07 1.16003434413869e-07 6.82990286549057e-09 
5.79173247388098e-05 1.18595835374435e-06 1.48514956777035e-07 6.93782231664386e-09 
5.89208357268944e-05 1.42295311889029e-06 1.56866320821791e-07 -5.945780312544e-09 
6.33189192740247e-05 1.67846803833527e-06 1.85478612024781e-07 1.89984898923967e-08 
0 0 0 0 
0 0 0 0 
0 0 0 0 
0 0 0 0 
0 0 0 0 
0 0 0 0 
0 0 0 0 
0 0 0 0 
0 0 0 0 
0 0 0 0 
0 0 0 0 
0 0 0 0 
0 0 0 0 
0 0 0 0 
99.9574813842773 0.0358586497604847 0.00427490565925837 0.000625389686319977 
