0 0 0 0 
0 0 0 0 
0 0 0 0 
0 0 0 0 
0 0 0 0 
0 0 0 0 
0 0 0 0 
0 0 0 0 
0 0 0 0 
0 0 0 0 
0.00217814277857542 7.786062269588e-06 1.50262496845244e-06 -2.89071323322787e-07 
0.00260703940875828 8.20642162580043e-06 1.68313999893144e-06 -3.7523454921029e-07 
0.00296241277828813 7.92803257354535e-06 1.71663259607158e-06 -3.02339515201311e-07 
0.00330948061309755 7.95466439740267e-06 1.81017458089627e-06 -3.00189384461191e-07 
0.00362293282523751 7.89705245551886e-06 1.861303530859e-06 -2.75516612191495e-07 
0.00389571581035852 7.73817737353966e-06 1.91473827726441e-06 -2.3028684381643e-07 
0.00411912146955729 7.59596605348634e-06 1.94859467228525e-06 -1.80277140771068e-07 
0.0042820549570024 7.26535972717102e-06 1.99158807845379e-06 -1.34972793830457e-07 
0.00437342142686248 6.92785761202686e-06 2.01672719413182e-06 -9.81740768679629e-08 
0.00437486497685313 6.45267618892831e-06 1.98512657334504e-06 -7.01343694231582e-08 
0.00429826742038131 6.12678877587314e-06 1.93513483282004e-06 -5.15437079684489e-08 
0.0041688596829772 6.13498741586227e-06 1.91332560461888e-06 -4.03062259124454e-08 
0.00401933956891298 6.29434134680196e-06 1.89627689906047e-06 -3.07028500401429e-08 
0.00388407660648227 6.55979056318756e-06 1.86810530067305e-06 -2.61996717654256e-08 
0.00381025881506503 7.05434240444447e-06 1.90075672890089e-06 -2.36133157471841e-08 
0.00382487941533327 7.6180308496987e-06 1.97921576727822e-06 -1.62281388327301e-08 
0.00394164072349668 8.17591990198707e-06 2.08364053833066e-06 -2.18467270940437e-08 
0.00416057929396629 8.70455551194027e-06 2.17769115806732e-06 -2.29304806254049e-08 
0.00444681895896792 8.99990573088871e-06 2.30653131438885e-06 -2.31909691450483e-08 
0.00477651320397854 9.17435590963578e-06 2.40728945755109e-06 -2.29524417250104e-08 
0.00510407472029328 9.17805573408259e-06 2.50793073064415e-06 -2.92843811422472e-08 
0.00538041861727834 8.82628592080437e-06 2.58172644862498e-06 -3.91991612502807e-08 
0.00558076845481992 8.36371327750385e-06 2.66182064478926e-06 -4.38687735027088e-08 
0.00569972768425941 8.0458412412554e-06 2.68851727014408e-06 -4.81351030146016e-08 
0.00572072342038155 7.67279743740801e-06 2.70528903456579e-06 -5.15489695374072e-08 
0.00568467285484076 7.48876527723041e-06 2.7166545351065e-06 -6.53372964620758e-08 
0.00566663732752204 7.55732844481827e-06 2.72951092483709e-06 -6.81503991017962e-08 
0.00574310310184956 7.94727657194017e-06 2.77301228379656e-06 -8.38134823766268e-08 
0.00599249685183167 8.73423141456442e-06 2.90110961032042e-06 -9.47605869328072e-08 
0.00652229459956288 1.00883535196772e-05 3.1276495064958e-06 -1.11306754035922e-07 
0.00745377596467733 1.21484781629988e-05 3.51998482983618e-06 -1.25917509308238e-07 
0.00892075058072805 1.53213313751621e-05 4.09758058594889e-06 -1.59299332835872e-07 
0.0111099239438772 1.98157922568498e-05 4.86411727251834e-06 -1.90587755355409e-07 
0.0142542589455843 2.56316998274997e-05 5.89127284911228e-06 -2.08995700745618e-07 
0.0186227355152369 3.2772593840491e-05 6.96213737683138e-06 -1.75994415485548e-07 
0.0244331583380699 4.10259781347122e-05 8.0983691077563e-06 -1.14104857118491e-07 
0.0317610464990139 5.0187449232908e-05 8.87996975507122e-06 -4.12453680098679e-08 
0.0404758714139462 5.74337864236441e-05 9.67472897173138e-06 -7.01084985621492e-08 
0.0504290126264095 6.50729416520335e-05 9.65131948760245e-06 3.68504199377284e-10 
0.0610387586057186 7.06306600477546e-05 9.15528107725549e-06 1.80977608010835e-07 
0.071883387863636 7.41421972634271e-05 8.33345438877586e-06 3.38974388114366e-07 
0.0825231969356537 7.29480598238297e-05 6.93994661560282e-06 3.65185570672111e-07 
0.0924945399165154 7.24590645404533e-05 5.61805518373149e-06 4.65152140805003e-07 
0.101569399237633 7.01221215422265e-05 4.017893843411e-06 6.15398391801136e-07 
0.109583057463169 6.53533570584841e-05 3.34113929056912e-06 6.09838480158942e-07 
0.116444565355778 6.2503109802492e-05 2.26316433327156e-06 5.14462612954958e-07 
0.122291371226311 5.75115336687304e-05 1.2741156751872e-06 4.87752970457223e-07 
0.127198308706284 5.27865813637618e-05 -1.72899508044111e-08 7.1706540438754e-07 
0.131408795714378 4.6970286348369e-05 -9.72867837845115e-07 6.53468362088461e-07 
0.135040730237961 4.34992471127771e-05 -2.26872543862555e-06 3.28278190409037e-07 
0.138245195150375 3.62745195161551e-05 -3.54520943801617e-06 2.17937753177466e-07 
0.140855431556702 3.34880605805665e-05 -3.38283234668779e-06 1.94627872929232e-07 
0.143221169710159 2.99972343782429e-05 -2.85600458482804e-06 -4.49115901801633e-07 
0.145115807652473 2.49797412834596e-05 -2.83317308458209e-06 -4.75959495815914e-07 
0.146502241492271 2.33836562983925e-05 -3.68778978554474e-06 -4.5531487558037e-07 
0.14753594994545 2.09950958378613e-05 -3.54224243892531e-06 -8.77460763604176e-07 
0.148326188325882 1.95579032151727e-05 -3.86877854907652e-06 -1.32018328713457e-06 
0.148867532610893 1.57273007062031e-05 -4.22163111579721e-06 -8.72758278092078e-07 
0.149153277277946 1.45156609505648e-05 -3.08581934405083e-06 -1.00041302175669e-06 
0.14966282248497 1.0788293366204e-05 -2.49972367782902e-06 -1.12066948076972e-06 
0.150006309151649 1.18157786346273e-05 -2.60519323092012e-06 -1.04586001725693e-06 
0.150374382734299 7.62401350584696e-06 -1.53063149355148e-06 -5.88578359383973e-07 
0.150701895356178 7.65486947784666e-06 -1.62621915933414e-06 -2.75836555374553e-07 
0.150965124368668 7.58732039685128e-06 -2.85160058410838e-06 -6.88012050886755e-07 
0.150711745023727 7.18882347428007e-06 -2.28141857405717e-06 -5.28824216416979e-07 
0.150542467832565 4.34031699114712e-06 -1.99697910829855e-06 -5.1507373655113e-07 
0.150380402803421 5.87845033805934e-06 -2.99992962027318e-06 -9.07956462015136e-07 
0.149848535656929 1.19403591725131e-06 -4.59515877082595e-06 -1.12895588699757e-06 
0.149286225438118 -1.29042120988743e-06 -5.42677889825427e-06 -5.68061636840866e-07 
0.14892902970314 -6.97586438036524e-06 -6.90325623509125e-06 -2.19369567844296e-07 
0.148253485560417 -1.09771526695113e-05 -6.48852028461988e-06 1.54667333163161e-07 
0.147094458341599 -1.46385309562902e-05 -5.9305498325557e-06 6.6475979565439e-07 
0.146115973591805 -1.57683589350199e-05 -4.86430417367956e-06 5.13607517405035e-07 
0.144678890705109 -1.81275245267898e-05 -3.15499846692546e-06 5.69273652217817e-07 
0.143184214830399 -1.74363758560503e-05 -2.0394445527927e-06 3.04464947475935e-07 
0.141414329409599 -1.93531668628566e-05 -2.28168642024684e-06 1.486908587367e-07 
0.139561727643013 -1.98765810637269e-05 -3.31916930917941e-06 -1.46964040936837e-07 
0.137535125017166 -2.17345459532226e-05 -2.36845971812727e-06 -5.83962638245339e-08 
0.135397762060165 -2.31285685003968e-05 -2.0983629838156e-06 1.7306575728071e-07 
0.132808715105057 -2.39155215240316e-05 -1.04646085219429e-06 6.87197143633966e-07 
0.130349844694138 -2.37581698456779e-05 7.16952115453751e-07 1.07871403542958e-06 
0.127619951963425 -2.53265789069701e-05 1.40823033234483e-06 1.793544015527e-06 
0.124494433403015 -2.54816150118131e-05 2.22237508751277e-06 1.36971743813774e-06 
0.121625870466232 -2.92958211502992e-05 1.30665273445629e-06 1.37513063691586e-06 
0.118457578122616 -3.30263901560102e-05 2.5369936338393e-06 7.1684934255245e-07 
0.115192733705044 -3.69528206647374e-05 2.03558897737821e-06 7.33283968656906e-07 
0.111995369195938 -4.08577652706299e-05 3.14692215397372e-06 5.35971821591374e-07 
0.108807757496834 -4.16014154325239e-05 2.94908886644407e-06 9.53710923567996e-07 
0.105442337691784 -4.11414875998162e-05 4.85989676235477e-06 7.40950724775757e-07 
0.102371528744698 -4.13076450058725e-05 4.11907421948854e-06 9.71857048170932e-07 
0.0991366654634476 -4.26982369390316e-05 4.08845971833216e-06 6.16400029684883e-07 
0.0958660021424294 -4.26471597165801e-05 3.82724556402536e-06 1.69828837215391e-07 
0.0926427319645882 -4.31673252023757e-05 3.75320178136462e-06 8.04964006562159e-09 
0.0890704467892647 -4.46060766989831e-05 3.9236306292878e-06 -1.75083357589756e-07 
0.085337370634079 -4.66325327579398e-05 4.54551991424523e-06 -4.6880583681741e-07 
0.0812790170311928 -4.59163493360393e-05 5.38281847184408e-06 -3.5040432067035e-07 
0.0768587663769722 -4.68209364044014e-05 5.40274868399138e-06 -2.55328785669917e-07 
0.0721020996570587 -4.94628329761326e-05 6.02566615270916e-06 -1.00999386631884e-07 
0.0672962516546249 -4.87863762828056e-05 5.92787228015368e-06 -1.39844345881102e-07 
0.0623993724584579 -4.81653623864986e-05 5.29948192706797e-06 7.43513552947661e-08 
0.0575277060270309 -4.85069831483997e-05 5.18292108608875e-06 -1.05750167733731e-07 
0.0528142713010311 -4.76127097499557e-05 5.49230480828555e-06 -1.78658169147639e-07 
0.048311572521925 -4.43345270468853e-05 5.0710114010144e-06 -3.21065556363465e-07 
0.0441177040338516 -4.28033526986837e-05 4.70832446808345e-06 -4.43417491169384e-07 
0.040140874683857 -3.95374954678118e-05 4.84721840621205e-06 -5.98130895923532e-07 
0.0365432053804398 -3.62361315637827e-05 4.1618127397669e-06 -5.908204343541e-07 
0.0333964414894581 -3.27490197378211e-05 4.26894121119403e-06 -6.43191185645264e-07 
0.0305500198155642 -3.02074768114835e-05 4.4425182750274e-06 -6.00381667936745e-07 
0.0279655531048775 -2.64528534899e-05 4.46873400505865e-06 -5.53452707663382e-07 
0.0256565846502781 -2.34619310504058e-05 4.33764807894477e-06 -4.92835397380986e-07 
0.023632675409317 -2.01627717615338e-05 4.57405167253455e-06 -4.37089539673252e-07 
0.0218010228127241 -1.69445556821302e-05 4.73595355288126e-06 -4.31542900969362e-07 
0.0201905649155378 -1.44327677844558e-05 4.6107811613183e-06 -4.61102615645359e-07 
0.0187145583331585 -1.1941185221076e-05 4.49138087788015e-06 -4.78681329241226e-07 
0.0174052249640226 -1.02596231954521e-05 4.42089003627189e-06 -4.53323053761778e-07 
0.0162217523902655 -8.79345680004917e-06 4.20446986026946e-06 -4.42456894234056e-07 
0.015154929831624 -8.19841534394072e-06 3.86529654861079e-06 -4.02794427145636e-07 
0.0141326887533069 -6.95093331160024e-06 3.76289699488552e-06 -3.90924157045447e-07 
0.0131902312859893 -6.55548592476407e-06 3.53248606188572e-06 -3.67992811334261e-07 
0.0122676426544785 -5.83899964112788e-06 3.37965707331023e-06 -3.49091465068341e-07 
0.0113777043297887 -5.32892090632231e-06 3.36864604832954e-06 -3.64450841061625e-07 
0.0105037270113826 -4.74696071250946e-06 3.16610612571822e-06 -3.74665404478947e-07 
0.00968393124639988 -4.28819066655706e-06 3.0375194910448e-06 -4.04107339591064e-07 
0.00888198986649513 -3.99144119000994e-06 3.04355603475415e-06 -3.76561530401887e-07 
0.00811468716710806 -3.82316466129851e-06 2.96062466986768e-06 -3.94625544686278e-07 
0.0073625105433166 -3.30324132846727e-06 2.82240966953395e-06 -3.74992879415004e-07 
0.00664571486413479 -3.17926833304227e-06 2.79843152384274e-06 -3.73594076563677e-07 
0.00595842208713293 -3.16150749313238e-06 2.62072512668965e-06 -3.51403031118025e-07 
0.00530554633587599 -3.23950916936155e-06 2.48556352744345e-06 -3.45325162243171e-07 
0.00470340996980667 -3.18892421091732e-06 2.35862853514845e-06 -3.3904154861375e-07 
0.00414132326841354 -3.32443642037106e-06 2.1797181943839e-06 -3.35084479274883e-07 
0.00361680169589818 -3.04870559375559e-06 1.96434280042013e-06 -2.93502267822987e-07 
0.00307427416555583 -2.84668112726649e-06 1.89343677448051e-06 -2.6139025521843e-07 
0.00255336053669453 -2.15407726500416e-06 1.74440253886132e-06 -2.50530092671397e-07 
0.00206312187947333 -1.42648036671744e-06 1.54206372826593e-06 -2.15709420103849e-07 
0.00162624660879374 -5.08859557157848e-07 1.33829598780721e-06 -1.72238500795174e-07 
0.00126179272774607 3.65028682836055e-07 1.16448939024849e-06 -1.44515055922056e-07 
0.00099520361982286 8.98850828434661e-07 9.14990835099161e-07 -1.16332039112876e-07 
0.000804754730779678 1.25236283565755e-06 7.03158264059311e-07 -6.78271234733074e-08 
0.000666637031827122 1.42343208153761e-06 5.8146355286226e-07 -4.57144579968372e-08 
0.000559042557142675 1.5421597936438e-06 5.11538303271664e-07 -3.64624987980733e-08 
0.000467857549665496 1.57904014486121e-06 4.13227269291383e-07 -2.30925767397139e-08 
0.000401081633754075 1.88659851119155e-06 3.555328191851e-07 -1.39770541807138e-08 
0.000344021071214229 1.96307155420072e-06 3.21713571338478e-07 -1.14084901525757e-08 
0.000298267346806824 2.03032323042862e-06 2.61351914332408e-07 -1.22398740032281e-08 
0.000255159189691767 1.81594771220261e-06 1.88470082207459e-07 -3.64585428513919e-09 
0.000223536640987732 1.70231896845507e-06 1.59158659585046e-07 -1.78509873549615e-09 
0.000200377573492005 1.7466981034886e-06 1.37332136773693e-07 -3.41993944275032e-09 
0.000184088610694744 1.95680468095816e-06 1.20755942134565e-07 1.59928764675854e-10 
0.000167019970831461 1.91465937859903e-06 1.15478648865519e-07 1.61947752985725e-08 
0.000157433023559861 2.31833109864965e-06 1.71301863360895e-07 1.01850359257583e-08 
0.000140829404699616 2.40824078900914e-06 1.90876832562026e-07 1.54094639270852e-08 
0.000127185790915973 2.39748328567657e-06 1.99605139528103e-07 2.25586482827111e-08 
0.000105389568489045 1.84974896910717e-06 1.6342472974884e-07 2.32206271988389e-08 
9.70902256085537e-05 1.89570107522741e-06 1.79829527269249e-07 1.9097669223811e-08 
8.19433771539479e-05 1.39961650802434e-06 1.24019379654783e-07 2.74460596472181e-08 
7.70670885685831e-05 1.28509088881401e-06 1.2165709506462e-07 1.92637834572906e-08 
6.65565166855231e-05 1.11218253096013e-06 1.09960424765632e-07 1.69921481329993e-08 
6.86316125211306e-05 1.38529821924749e-06 1.33578950567426e-07 1.0895626623153e-08 
6.92869871272705e-05 1.62964181527059e-06 1.49195713561312e-07 -2.36916375406793e-09 
7.47092126403004e-05 1.89933666661091e-06 1.31214733301022e-07 -1.71549635608059e-10 
0 0 0 0 
0 0 0 0 
0 0 0 0 
0 0 0 0 
0 0 0 0 
0 0 0 0 
0 0 0 0 
0 0 0 0 
0 0 0 0 
0 0 0 0 
0 0 0 0 
0 0 0 0 
0 0 0 0 
0 0 0 0 
99.9583587646484 0.0345927812159061 0.0045908004976809 0.000594444805756211 
