0 0 0 0 
0 0 0 0 
0 0 0 0 
0 0 0 0 
0 0 0 0 
0 0 0 0 
0 0 0 0 
0 0 0 0 
0 0 0 0 
0 0 0 0 
0.000511767982970923 3.44694585374672e-11 2.48334252467286e-11 1.68327608796037e-11 
0.000693082518409938 -2.21991982130021e-07 -1.04966780156701e-07 -6.74061269023696e-08 
0.00107327697332948 2.31925909588426e-07 9.50437950564265e-09 -9.6241095093319e-09 
0.00170076685026288 -1.160418037216e-07 1.59120673970392e-07 9.90138460110757e-08 
0.00289365323260427 4.15029894895724e-08 -1.45647561566875e-07 -5.08491737605254e-08 
0.00437263306230307 7.85659270974293e-09 -9.78718901478715e-08 7.67960699477044e-08 
0.00591022754088044 2.65857558190419e-09 -8.84119799593464e-08 1.51801401671037e-07 
0.00731497723609209 -5.25210763768769e-10 4.99426633382427e-08 -1.26628563634767e-07 
0.00837719906121492 4.05131733716146e-10 -2.41487843055666e-08 8.20379852939368e-08 
0.00879065971821547 2.00997496424549e-10 8.34517965841997e-09 -3.81159566131828e-08 
0.00878540147095919 -2.34633905187021e-12 3.09372505391536e-09 -1.73632521693889e-08 
0.00855912175029516 -3.3160110768371e-10 -1.06526520937678e-09 5.68171021342323e-09 
0.00822562072426081 -2.01362496121682e-10 2.11582626419293e-10 1.76043990496311e-09 
0.00785801932215691 4.75615588579892e-11 -3.33692573573074e-10 6.41881436891367e-10 
0.00749084260314703 1.5270630593367e-10 4.24203755455821e-10 -1.67902719505619e-10 
0.0071177645586431 -2.84711920706116e-10 1.15138044931573e-10 -3.22398718832773e-10 
0.0068319495767355 3.47266902733789e-11 1.62987248697455e-10 -6.76447620140408e-10 
0.00656801229342818 3.07919106878884e-10 -9.99677077229144e-12 2.94357108132637e-11 
0.00629109377041459 -5.54638453220679e-11 2.82008916219212e-10 -5.69124303240187e-10 
0.00601810729131103 2.45393871889377e-10 -5.20018438032732e-11 -2.63561367175313e-10 
0.00575323775410652 3.43862188723065e-10 9.76792396967241e-11 -1.68656599103256e-11 
0.00546302925795317 1.92805202359203e-10 7.3200008554597e-11 -6.36751623650511e-11 
0.00515344738960266 -2.68020272642389e-10 1.09235412382169e-10 -1.90725157889204e-10 
0.00489290338009596 -5.78731724001913e-12 -3.74318742668578e-10 1.97348332120484e-10 
0.00463123945519328 -1.35986319427239e-10 2.6330512770123e-10 -2.26139440506756e-10 
0.00437591318041086 -1.45246994986969e-10 -9.58696941277815e-11 -1.17570134183786e-10 
0.00414666626602411 -3.46827067065902e-10 7.68019467467518e-11 -8.18590889517523e-11 
0.00397950038313866 -1.13765150078216e-10 1.61850914615069e-11 1.43496312055014e-10 
0.00385731994174421 -2.21955418454323e-12 -1.56194737699344e-10 -2.81987766470593e-10 
0.00381471612490714 -2.91216384340487e-10 2.15406303905041e-11 2.18595749140738e-11 
0.00384043529629707 1.96968510945972e-10 1.33305866345523e-10 2.87934658754763e-11 
0.00393232982605696 6.7046958263095e-11 -8.60874143238793e-13 -1.42198836039498e-10 
0.00406301487237215 -3.21041318529502e-11 2.25000212905613e-10 -8.35589028524986e-11 
0.00422868737950921 -6.03637140272895e-11 8.57210830096378e-11 1.34366059945101e-11 
0.00444717146456242 4.68860339442045e-10 1.48821566181567e-10 -6.62339696977376e-11 
0.00472592562437057 2.56138110721338e-10 -2.36383940199758e-10 -9.38774544212428e-11 
0.00503716105595231 -4.63263498742816e-12 2.70203165397831e-10 8.43539404993265e-11 
0.00537190353497863 -1.43021358645079e-10 1.69409972161638e-11 -3.91903245966496e-11 
0.00571729755029082 -7.25572171789146e-11 4.78357492506021e-11 5.73845554407981e-11 
0.00602001929655671 -2.13433534734797e-10 -2.78427194494446e-11 -4.47229024647111e-11 
0.00631779432296753 -5.25737058054698e-11 -4.2723344306772e-10 7.26562733588398e-12 
0.0065665366128087 1.74126921215212e-10 -1.48484169404384e-10 4.19620033165202e-10 
0.00678399484604597 -9.55077961162232e-11 2.54163440294164e-10 -1.6772914654406e-11 
0.00698194606229663 2.35810648785417e-10 3.88753751412452e-10 5.36022337627173e-11 
0.00721444096416235 1.91663865334313e-10 -2.14199172288154e-10 7.31634544615112e-11 
0.00742727005854249 -9.78929298733888e-11 -7.97572632937893e-11 -2.73561534536171e-10 
0.0076818116940558 -2.01484107176242e-10 -4.32785501880417e-10 -4.17492290738508e-10 
0.00794621091336012 -5.67898450487547e-10 -5.0779047633398e-10 -1.24471100093615e-10 
0.00825650151818991 9.62779189705998e-10 -3.59972357477645e-10 2.8251873063212e-10 
0.0085704205557704 1.08896933137537e-10 -1.20957022176071e-10 -1.93195751063691e-10 
0.00893265474587679 -5.22053233975583e-10 1.73200828679221e-11 2.30883728802311e-10 
0.00935406796634197 -1.58768109770335e-10 -1.37897748775373e-10 -7.52879647514249e-10 
0.00990545190870762 -8.1978188126719e-11 1.30456867530881e-10 -2.62330240863307e-10 
0.0105055095627904 1.6385197365576e-10 -1.53969462179937e-10 -1.1342911054868e-09 
0.0112443771213293 1.36868450600902e-11 1.6360555271655e-11 -3.25042992521674e-10 
0.0121528767049313 -6.42052175314767e-11 -1.55955248715145e-10 -3.59396706839377e-10 
0.0131490007042885 -7.99408733653806e-11 -5.4187826448171e-10 4.02941513488742e-10 
0.0142389144748449 4.93167340298584e-10 -1.45064016354723e-10 5.16933607030978e-10 
0.0153973754495382 6.74313868631593e-11 -7.97930388429791e-10 -9.36961619402155e-10 
0.0165416393429041 6.75876243860785e-10 2.04180103380303e-10 -2.37876746078669e-10 
0.0175667963922024 -7.39237671076864e-10 4.59892512960636e-10 -8.70644112360708e-10 
0.0185020435601473 -1.66073510499132e-09 4.40146114000228e-10 6.86600609700605e-10 
0.0192180294543505 -2.01206690197964e-10 -1.06541636624158e-10 3.40827505107555e-10 
0.0196369141340256 -1.78957670904367e-09 -1.77018219527092e-10 4.53064696870342e-10 
0.0196526739746332 9.46071554430716e-10 8.56154591666325e-10 4.29089291875684e-10 
0.0192721225321293 2.73668171457686e-10 -3.26905003067424e-10 -4.26644719553337e-10 
0.0185328051447868 2.93196245060301e-10 -1.2312463271158e-09 4.11966294411314e-10 
0.017391124740243 -2.04155664595973e-10 -5.65067048707846e-10 8.97490692874925e-10 
0.0161446295678616 -5.5258142506176e-10 4.53352938523111e-10 -1.92339269511344e-11 
0.0149039132520556 2.35600400300129e-10 3.23287056847033e-11 -8.05650546276127e-10 
0.0136679420247674 1.06216327400155e-10 -9.79749170681998e-10 -4.40327080353242e-10 
0.0125653026625514 4.59449478462659e-10 1.4444902218802e-10 -3.17453396903034e-10 
0.0117516107857227 -1.00132069302816e-09 -2.70879652042311e-10 6.40501762738666e-10 
0.0111037436872721 7.97976962285674e-11 -3.59956398021666e-10 1.01370821459223e-10 
0.0106156878173351 -7.22951420950579e-11 3.30274939341901e-11 4.86848727998535e-10 
0.0103895710781217 -5.18226073165096e-10 5.52854567681393e-11 2.30367211417892e-10 
0.0102808689698577 4.29595812048711e-12 1.18445295238523e-10 -6.04075567345319e-10 
0.0102129736915231 7.36601751816224e-11 -3.71893654760314e-10 -7.35266361684417e-11 
0.0101916352286935 7.92118870496239e-11 -3.59753091032367e-12 -2.80783507555782e-10 
0.0102704204618931 -1.16735482391661e-10 6.03396832499214e-10 -5.98099236803762e-10 
0.010455303825438 -1.91209936772907e-10 3.11366099570165e-10 4.15417700239118e-11 
0.0107158394530416 2.52961929181339e-10 1.20844454234992e-11 -3.09709841106454e-10 
0.0112417144700885 -3.06440456343537e-10 1.10240627737568e-09 -3.50671380822121e-10 
0.0123199187219143 -1.7496687432228e-10 -1.88246113141943e-10 5.88068260753971e-10 
0.0144448382779956 -4.88138807153149e-10 9.42148165039569e-11 1.59287888434889e-10 
0.0186884962022305 -6.85533296795882e-12 8.49024045512792e-11 4.70710859179491e-10 
0.0266168434172869 -5.2922294324631e-12 -1.94917726403787e-09 9.35681643277064e-10 
0.0392442308366299 1.38305100705338e-11 -1.71207870103274e-09 1.11421549764401e-09 
0.0568001344799995 -2.35719022079195e-11 1.07810038674216e-09 -8.55494619589336e-10 
0.0794699788093567 -9.8972066098213e-11 2.58479970760561e-09 -5.0144342012004e-09 
0.105830416083336 4.83617634827738e-11 4.25733981401777e-09 -8.05237931889025e-10 
0.132058382034302 5.66128832701907e-11 -5.62765611888949e-09 9.56871915036572e-10 
0.155190601944923 4.71014671710179e-12 9.65165902755416e-09 -1.65024138798486e-09 
0.174782454967499 -1.0116909976432e-10 5.77053092809532e-11 -8.32096791469894e-09 
0.189515978097916 9.46016065483946e-11 1.56893864566854e-09 -3.92236731983076e-09 
0.19749054312706 9.13149555969994e-11 1.10086109117447e-08 -2.94154167690408e-09 
0.201645389199257 5.82997539133601e-12 9.01920937934619e-09 -4.77956829669779e-09 
0.203858509659767 2.79579448481115e-11 -3.39341599264742e-09 -3.36784267140899e-10 
0.20428204536438 -8.93246099309408e-11 2.27524576956739e-09 -7.70242003511612e-09 
0.201718688011169 -1.01245789529969e-11 1.89449167464772e-08 -9.66106483701878e-09 
0.198903933167458 3.07001379873384e-11 4.30533564355073e-09 8.92365115134908e-09 
0.196097075939178 -4.24738057225316e-13 -3.23652216138726e-09 1.28093864404377e-08 
0.193043529987335 -3.03074010332693e-11 -1.1646476671956e-08 1.20055307917255e-08 
0.189216166734695 -2.19550289060066e-11 -5.13295939086333e-09 4.18739976026927e-09 
0.185020551085472 -1.1834698776525e-11 -2.66659805348013e-09 2.50724241368516e-09 
0.181632772088051 1.30275221721377e-10 -2.90128454594196e-09 -7.79226350111628e-10 
0.177151024341583 9.24817733505279e-11 5.92015281242197e-09 -6.60300747412634e-09 
0.172549411654472 4.13950029809484e-11 -1.65324998135929e-08 4.15259426844727e-09 
0.168054580688477 -9.85933734654054e-11 -5.6135540660307e-09 3.21688120585861e-09 
0.16417607665062 -7.39879624234163e-11 1.19789744790211e-09 2.67050803692825e-09 
0.159266576170921 -8.79358097449767e-11 -2.24383867042377e-09 5.09144770788339e-09 
0.155457139015198 -4.11715772585808e-11 8.23672152705512e-09 7.12937353597454e-09 
0.151219919323921 2.42145348217093e-11 -4.08666256390688e-09 -6.86282008999228e-09 
0.145957514643669 6.33600505395293e-11 5.07289499296348e-09 -6.3651057757852e-09 
0.141246646642685 8.62320970185238e-11 -8.06281974519152e-09 1.02227271092659e-09 
0.136752903461456 9.43328171132407e-11 -9.45237998983828e-10 -6.96768420738181e-09 
0.131567895412445 7.64943575148891e-11 -2.77515432856035e-09 -5.90133186761932e-09 
0.125872939825058 -1.48324086346463e-11 4.82135220636337e-09 3.64386343321144e-09 
0.121105916798115 -5.12181630440978e-11 -4.38391412060923e-09 -1.58692015084227e-09 
0.116546988487244 -6.72320998873488e-11 2.24109286683927e-10 5.20841370033054e-09 
0.112058483064175 -8.15620282423879e-11 -7.8722495189254e-10 -3.84387588425739e-09 
0.107405997812748 -1.83372017570349e-11 5.51000023385484e-10 2.36763519900762e-09 
0.103678040206432 -3.26533911021443e-11 -6.08883432562379e-09 2.25047713797721e-09 
0.0989686474204063 -2.58247112583376e-11 -6.82435219445665e-10 -2.46239501011658e-10 
0.0945421531796455 -2.12734629911893e-11 1.52981771694982e-09 4.13991552150605e-09 
0.0899035036563873 -1.84606163688983e-11 -4.69201966168953e-09 -2.43856690396171e-09 
0.0858022123575211 2.8166891041792e-12 -2.61846677673816e-09 1.25932583805444e-10 
0.0820387527346611 -2.66185673503116e-11 2.67122612918058e-09 3.31067839809407e-10 
0.0795501470565796 -5.51800471981778e-11 1.48561629664812e-09 -8.7376317292609e-10 
0.0766694322228432 -1.65362279425096e-12 2.37702607597257e-10 -8.07678590675209e-10 
0.0741203725337982 -5.49111422998294e-11 -1.34245503602415e-09 -3.42727624058625e-10 
0.0711983814835548 -1.24039589710634e-11 2.31953151130782e-10 -9.12427300381324e-10 
0.0675937607884407 -3.08243075508585e-11 1.5114005880168e-10 3.51091222761113e-09 
0.0635127574205399 1.01407604535808e-11 2.33801733529049e-09 2.03817435151521e-10 
0.0596273690462112 -1.35089672781419e-11 -3.7524037210801e-09 -9.40560296314175e-10 
0.0560737363994122 1.11558684512403e-11 -3.58456309079713e-09 -1.06533171173595e-09 
0.0527042895555496 -1.16220666424027e-11 1.79682668743908e-09 -3.87048926242528e-09 
0.0495025664567947 -1.10493614258189e-11 -2.3066657472981e-09 -3.43269801472701e-10 
0.0463294461369514 2.81302048321663e-11 -1.98849950394653e-10 1.02702191195903e-09 
0.0425966046750546 2.60961785514269e-11 -2.93971957887607e-10 2.98093105755015e-10 
0.0382965542376041 6.80333789304655e-12 1.14305520604319e-09 -9.01857089008473e-10 
0.0337057560682297 -1.90144100464806e-11 -4.17518380979587e-10 1.55611068475281e-09 
0.0288955736905336 4.01272182148915e-12 -2.17003068292421e-10 -1.24752441710285e-09 
0.0240031201392412 -1.32638885985692e-12 -3.1159649860335e-10 -1.87752680069764e-09 
0.0195003133267164 -9.42143363324988e-12 -7.95737253866946e-10 5.05429531560964e-10 
0.0156184639781713 -1.35762645570026e-11 -1.62219140897868e-10 -4.94905061376727e-10 
0.0122539298608899 -8.2829054726119e-12 1.15238030229392e-09 -4.42708203429731e-10 
0.0094462763518095 -2.24018831262995e-12 -1.01149665032718e-10 -4.81102713223436e-10 
0.00719625828787684 1.74394276797329e-12 -3.66059155210152e-10 5.35305522131324e-10 
0.0054628630168736 1.00149027959517e-12 -1.03033422071963e-10 3.11939474251233e-10 
0.00407874025404453 -8.92893953219343e-13 1.8807476409588e-11 -1.32631752802759e-10 
0.00302249612286687 -2.17093176768657e-12 -1.55434790038989e-10 6.53264664585151e-11 
0.00219618156552315 -5.59289177470834e-13 1.31643709821994e-10 -1.0453501952945e-10 
0.00161230098456144 2.55697372997243e-14 -1.75823661185959e-10 1.00934705038469e-10 
0.00115162180736661 -8.74881903034641e-13 -8.95955601376563e-11 3.14279262336736e-11 
0.000840054941363633 2.76208864807836e-13 4.06978513389777e-11 -3.1755664070543e-11 
0.000609025068115443 -4.62881920293423e-13 1.31682225887331e-11 1.82676374027579e-11 
0.000451023370260373 1.36179236290279e-13 -2.70132527457889e-11 2.8264939000433e-11 
0.000302062573609874 1.80227117951848e-13 -5.54643397182586e-12 -8.72640588261975e-12 
0.000187259633094072 4.98600076156985e-14 -8.06535307290579e-12 -5.24713302321733e-12 
8.13172009657137e-05 1.81879088612807e-15 1.05940061410903e-12 -9.53695455940817e-13 
0 0 0 0 
0 0 0 0 
0 0 0 0 
0 0 0 0 
0 0 0 0 
0 0 0 0 
0 0 0 0 
0 0 0 0 
0 0 0 0 
0 0 0 0 
0 0 0 0 
0 0 0 0 
0 0 0 0 
0 0 0 0 
99.998779296875 3.46341657859739e-05 2.82569071714533e-05 2.67781233560527e-05 
