{
	"centerX" : 0.2,
	"centerY" : 0.15,
	"angle" : 0,
	"scale" : 1,
	"width" : 128,
	"height" : 95,
	"contents" : [
        {
			"type" : "image",
			"resource" : {
				"type" : "static",
				"path" : "res/food_liaoli.png"
			},
			"centerX" : 0.5,
			"centerY" : 0.5,
			"width" : 128,
			"height" : 95,
			"angle" : 0,
			"zorder" : 1
		}
	]
}
