0 0 0 0 
0 0 0 0 
0 0 0 0 
0 0 0 0 
0 0 0 0 
0 0 0 0 
0 0 0 0 
0 0 0 0 
0 0 0 0 
0 0 0 0 
-0.000305614696117118 -6.09803066708992e-07 -1.28608985505707e-06 -4.98144686389423e-07 
-0.000256639468716457 -7.36038259674388e-07 -1.29965928863385e-06 -4.90672732667008e-07 
-0.000186590405064635 -1.12303928290203e-06 -1.41990449264995e-06 -5.26344081208663e-07 
-4.31308490078663e-06 -1.53889254761452e-06 -1.6358286529794e-06 -6.07253014095477e-07 
0.000419297080952674 -1.99015244106704e-06 -1.88207206974766e-06 -6.99674899351521e-07 
0.00102530291769654 -2.21599066208e-06 -1.98758766600804e-06 -7.67687708957965e-07 
0.00168057158589363 -2.19416824620566e-06 -2.00150475393457e-06 -7.67284120684053e-07 
0.00229029636830091 -1.95474353859026e-06 -1.89959280305629e-06 -7.22065919944725e-07 
0.00273231789469719 -1.58377349634975e-06 -1.64279549608182e-06 -6.13932797932648e-07 
0.00286746700294316 -1.13430951387272e-06 -1.34124218220677e-06 -4.8591635959383e-07 
0.00275717931799591 -8.45067859245319e-07 -1.16867522592656e-06 -3.81369460455971e-07 
0.00255044130608439 -7.23577443295653e-07 -1.03706611298549e-06 -3.28534923710322e-07 
0.00233644270338118 -7.0071286017992e-07 -9.66575385064061e-07 -2.84743151723887e-07 
0.00216710660606623 -6.61039052829437e-07 -9.25851509236963e-07 -2.47806269726425e-07 
0.00207255105488002 -6.89457124281034e-07 -9.10496339656675e-07 -2.37547382653247e-07 
0.00206624576821923 -7.18630190021941e-07 -9.10951484911493e-07 -2.16715775991361e-07 
0.00214006705209613 -7.42775455364608e-07 -9.5698158020241e-07 -2.10303227277109e-07 
0.0022797582205385 -7.44994395063259e-07 -1.00848035344825e-06 -1.98971875420284e-07 
0.0024578869342804 -7.36183949356928e-07 -1.06233142105339e-06 -1.8194090500856e-07 
0.00264374492689967 -7.00682505794248e-07 -1.09163806882862e-06 -1.66284948477369e-07 
0.00280285766348243 -6.73199735956587e-07 -1.12137843188975e-06 -1.54017286035923e-07 
0.00290710851550102 -6.41573649318161e-07 -1.12168424948322e-06 -1.40156942052272e-07 
0.00293742725625634 -6.20180571786477e-07 -1.13294834136468e-06 -1.47213498280507e-07 
0.00288402149453759 -6.37540722436825e-07 -1.22187122997275e-06 -1.88720278515575e-07 
0.00275503494776785 -6.55966402973718e-07 -1.37972654101759e-06 -2.31823335639092e-07 
0.00263341027311981 -6.70909628297522e-07 -1.53038342887157e-06 -2.61607851825829e-07 
0.0025934586301446 -6.79428296734841e-07 -1.66105303378572e-06 -2.59945664993211e-07 
0.00268709333613515 -6.77620903388743e-07 -1.76775961335807e-06 -2.31694585295372e-07 
0.00297886738553643 -6.67115955366171e-07 -1.89469176348211e-06 -1.75030010041155e-07 
0.00355944409966469 -6.78454000535567e-07 -2.08030473913823e-06 -8.91081697318441e-08 
0.004497523419559 -7.77481034219818e-07 -2.37624135479564e-06 -2.58672443465002e-08 
0.00592541974037886 -1.00366946753638e-06 -2.87006741928053e-06 6.87973056301416e-08 
0.00806767772883177 -1.42336432418233e-06 -3.57009434992506e-06 1.28005396504705e-07 
0.0112014403566718 -1.97253029909916e-06 -4.35848733104649e-06 2.01070506022916e-07 
0.015541072934866 -2.93942707685346e-06 -5.18550177730503e-06 2.17273267821838e-07 
0.0212893020361662 -3.8077066619735e-06 -5.87784188610385e-06 2.96035068458878e-07 
0.0285116024315357 -5.10333256897866e-06 -6.29514761385508e-06 3.3141861877084e-07 
0.0369785837829113 -6.06664889346575e-06 -5.92934202359174e-06 4.52679358886598e-07 
0.0462904460728168 -7.03149862602004e-06 -5.28900818608236e-06 5.6157921335398e-07 
0.0560515932738781 -7.22223740012851e-06 -4.21597087552072e-06 4.39314419509174e-07 
0.0654883235692978 -7.31118416297249e-06 -2.68949452220113e-06 3.99429552544461e-07 
0.0741606429219246 -5.85899942961987e-06 -1.12621921743994e-06 5.76443540012406e-07 
0.0820628926157951 -5.26009671375505e-06 3.88467185530317e-07 5.60646356007055e-07 
0.0889448225498199 -4.26665519626113e-06 1.69716588516167e-06 5.38023471108318e-07 
0.0947608947753906 -4.43701401309227e-06 3.12761676468654e-06 7.85656084190123e-07 
0.0996820032596588 -4.30648287874646e-06 3.73681814380689e-06 4.66520731379205e-07 
0.10393813252449 -4.09147651225794e-06 5.07416552864015e-06 4.69903852717835e-07 
0.107537940144539 -3.9124724935391e-06 5.62962759431684e-06 5.6413449556203e-07 
0.110605478286743 -3.57915291715472e-06 6.3969123402785e-06 2.2647488151506e-07 
0.113273844122887 -2.6215477646474e-06 5.75063677388243e-06 8.51043608918189e-08 
0.115791134536266 -2.63279343926115e-06 5.91336811339715e-06 3.75990254042335e-07 
0.118136167526245 -3.72039380636124e-06 5.1180522859795e-06 2.40765629655471e-08 
0.120050631463528 -4.37631388194859e-06 4.65857510789647e-06 1.56369779347187e-07 
0.121834635734558 -4.26300130129675e-06 3.234494897697e-06 3.71245874930537e-07 
0.123287066817284 -4.8396236707049e-06 2.28811222768854e-06 3.06096239910403e-07 
0.124358408153057 -4.38078768638661e-06 9.24592029605265e-07 2.36794519992145e-07 
0.125039801001549 -3.69493182006408e-06 -2.95090245572283e-07 6.89992361913028e-07 
0.125397011637688 -2.67576751866727e-06 -2.03851641344954e-06 5.50203651528136e-07 
0.125563770532608 -2.88958813143836e-06 -2.55400186688348e-06 5.07332799770666e-07 
0.125769853591919 -1.99562487068761e-06 -3.27923135046149e-06 9.75047100837401e-07 
0.125965818762779 -6.46670230253221e-07 -3.5934685911343e-06 1.85125156804133e-06 
0.126359850168228 1.5408954823215e-07 -4.08849700761493e-06 1.90257458143606e-06 
0.126969739794731 1.66550375979568e-06 -2.56007160714944e-06 2.40370218307362e-06 
0.12740720808506 2.0957695596735e-06 -2.93600101031188e-06 3.19167588713754e-06 
0.127895087003708 3.14350450025813e-06 -1.74946319475566e-06 3.43435499416955e-06 
0.128355801105499 3.79098696612346e-06 -2.78353013527521e-07 2.11175802178332e-06 
0.128576070070267 5.34416403752402e-06 1.81301766133402e-06 2.02293153961364e-06 
0.128698080778122 5.87819704378489e-06 2.22713993025536e-06 1.1334435612298e-06 
0.12848000228405 7.38079233997269e-06 4.63752576251864e-06 3.87699685688858e-08 
0.128045827150345 5.66355402042973e-06 5.78703611608944e-06 -1.02855301520322e-06 
0.127119094133377 5.08371613250347e-06 4.41263091488509e-06 -4.91239632083307e-07 
0.126321062445641 2.8227805159986e-06 2.89270519715501e-06 -4.34917467373452e-07 
0.125286296010017 -2.68092748001436e-07 1.01029343113623e-06 -2.78284773003179e-08 
0.124790132045746 -3.10712653117662e-06 -1.28413410038775e-06 6.11414975537627e-07 
0.124304205179214 -4.0974582589115e-06 -1.74154160959006e-06 7.96121241819492e-07 
0.124227695167065 -5.68222822039388e-06 -2.01725333681679e-06 1.14152794594702e-06 
0.123759150505066 -5.59225327378954e-06 -3.57511135007371e-06 1.12837994947768e-06 
0.123504020273685 -4.22105904362979e-06 -2.90194998342486e-06 1.58356169777107e-06 
0.122797340154648 -2.67157065536594e-06 -2.15266049963247e-06 1.47139496675663e-06 
0.121812783181667 -1.37551103307487e-06 -3.80653114007146e-06 2.76834157375561e-06 
0.120859190821648 2.57897681876784e-07 -2.84387624560622e-06 2.52889412877266e-06 
0.119838424026966 4.4138286625639e-07 -1.86794454748451e-06 2.31077910939348e-06 
0.118642836809158 8.92794105311623e-07 -1.45136812079727e-06 1.45187209454889e-06 
0.117561101913452 1.21251929385835e-07 -9.06285947621654e-07 1.59037915636873e-06 
0.116553023457527 1.25139331430546e-06 1.36561288854864e-06 -1.52483664805914e-07 
0.115395151078701 6.2314938986674e-07 1.86420027148415e-06 -8.48212039272767e-07 
0.114376001060009 9.12272867026331e-07 2.78180482382595e-06 -1.28479666727799e-06 
0.113694079220295 1.19980632007355e-06 3.75625995729933e-06 -1.90987611858873e-06 
0.113038420677185 1.58987802478805e-06 3.70372549696185e-06 -2.42497549152176e-06 
0.112571038305759 2.17467390939419e-06 2.65043217950733e-06 -2.31227591029892e-06 
0.112109415233135 3.78181903215591e-06 2.20977494791441e-06 -2.04625644073531e-06 
0.11185660213232 4.91061200591503e-06 2.98588975056191e-06 -1.29389172798255e-06 
0.111387237906456 4.50913967142696e-06 1.87926229955337e-06 -7.81517996983894e-07 
0.110737003386021 5.79005381950992e-06 1.94250060303602e-06 -7.03469538620993e-07 
0.109778098762035 4.60496039522695e-06 1.89665081506973e-06 -5.88028058245982e-07 
0.108612477779388 2.32839056479861e-06 1.64677567227045e-06 -8.86662462562526e-07 
0.106949768960476 2.29312104238488e-06 6.21452670657163e-07 -1.65146252584236e-06 
0.104846186935902 1.6747547988416e-06 8.0953543601936e-07 -1.87322723377292e-06 
0.102786183357239 6.98727546932787e-07 7.92870423538261e-07 -2.42688292928506e-06 
0.100526437163353 3.00232528616107e-07 -5.84528891067748e-07 -1.90278410627798e-06 
0.098330982029438 -5.14754276537133e-07 -5.43271170272419e-08 -1.787339101611e-06 
0.0963008850812912 -2.56914131568919e-06 -2.28476304542369e-09 -1.79885023499082e-06 
0.0945191234350204 -3.35434538101254e-06 -6.96308219971797e-08 -8.39758399706625e-07 
0.092841736972332 -4.42150667367969e-06 -7.18995238457865e-07 -2.92063873530424e-07 
0.0914225280284882 -4.27820168624748e-06 6.86792930082447e-07 -1.17871707061568e-07 
0.0901195332407951 -3.42902740158024e-06 9.6412968275672e-08 4.99031443723652e-07 
0.0888189971446991 -2.24793325287465e-06 1.76445212218823e-07 8.90169474132563e-07 
0.0875722467899323 -8.96931680927082e-07 -1.48165781865828e-06 1.16576259756584e-07 
0.0860778093338013 1.7157911997856e-06 -1.80529843873956e-06 -8.56939337268159e-08 
0.084573045372963 2.79522373602958e-06 -2.98894610750722e-06 -7.87286523973307e-07 
0.08308345079422 4.61471927337698e-06 -3.53676341546816e-06 -1.18273317184503e-06 
0.0812954232096672 4.57525720776175e-06 -3.22666369356739e-06 -1.58394379923266e-06 
0.0791456177830696 4.70851591671817e-06 -2.22326298171538e-06 -1.7273682715313e-06 
0.0771365091204643 3.72501062884112e-06 -2.81498000731517e-06 -1.76526430095691e-06 
0.0749113857746124 4.22136645283899e-06 -2.33076571021229e-06 -1.63547156262212e-06 
0.0724599361419678 3.71133000953705e-06 -1.81906466423243e-06 -1.66831273418211e-06 
0.0702250525355339 3.70002362615196e-06 -1.79645940079354e-06 -1.60480840349919e-06 
0.0681516528129578 3.15958868668531e-06 -1.69487452694739e-06 -1.50141124777292e-06 
0.0660191476345062 2.6548407277005e-06 -5.71087241496571e-07 -1.55930126766179e-06 
0.0638929381966591 1.49637435242767e-06 -5.13997861162352e-07 -1.5240490256474e-06 
0.0617503263056278 1.16019532470091e-06 -8.50553817599575e-07 -1.59491139584134e-06 
0.059727318584919 6.6274793653065e-07 -9.70582391346397e-07 -1.78059451627632e-06 
0.057694785296917 -2.31535128847327e-08 -1.52788436480478e-06 -2.0537192995107e-06 
0.05576166883111 -7.11514303475269e-07 -1.5824577985768e-06 -1.76575349541963e-06 
0.0539813712239265 -1.30710225221264e-06 -1.9981971490779e-06 -1.69973566244153e-06 
0.0522966422140598 -2.65316930381232e-06 -2.42357305069163e-06 -1.62770891165565e-06 
0.0505350530147552 -2.96022244583583e-06 -3.62295941158663e-06 -1.19059188818937e-06 
0.0488622598350048 -2.40008489527099e-06 -4.15882504967158e-06 -6.6652671648626e-07 
0.0471758395433426 -2.39388100453652e-06 -5.12622227688553e-06 -7.50234789848037e-07 
0.045457698404789 -2.08442133953213e-06 -5.16030968356063e-06 -6.75841022257373e-07 
0.0438478551805019 -1.8986473833138e-06 -5.0717549129331e-06 -7.93033052559622e-07 
0.0421973094344139 -2.70580494543537e-06 -4.88443856738741e-06 -1.34395611439686e-06 
0.0405062809586525 -2.87676539301174e-06 -4.1175671867677e-06 -1.6145910421983e-06 
0.0386480018496513 -2.11889073398197e-06 -3.84451232093852e-06 -1.74185652213055e-06 
0.0367921143770218 -8.1059772583103e-07 -3.69420354218164e-06 -1.9967776552221e-06 
0.0347619354724884 1.55515601818479e-06 -3.15609941026196e-06 -1.73582213847112e-06 
0.0326675549149513 4.91640412292327e-06 -2.52439303949359e-06 -1.24085295283294e-06 
0.030329866334796 8.45293106976897e-06 -2.22328026211471e-06 -6.90886565735127e-07 
0.0278420988470316 1.22362716865609e-05 -1.63289848842396e-06 -2.08968728543368e-07 
0.0250288117676973 1.55706184159499e-05 -9.74885665527836e-07 3.59823928874903e-07 
0.0219511594623327 1.92100123967975e-05 -8.55746804973023e-07 7.39540041649889e-07 
0.0186404269188643 2.19561043195426e-05 -8.65852769038611e-07 1.04193679817399e-06 
0.0153534403070807 2.33162063523196e-05 -1.02415674518852e-06 1.08908955098741e-06 
0.0121790738776326 2.29585075430805e-05 -1.36350774937455e-06 1.03180298083316e-06 
0.00931431911885738 2.14147239603335e-05 -1.79651033249684e-06 9.08353513295879e-07 
0.00683781877160072 1.80603237822652e-05 -1.94302720046835e-06 6.39861923446006e-07 
0.00483815651386976 1.45581589094945e-05 -2.11474707612069e-06 3.19388277603139e-07 
0.00327967084012926 1.09951643025852e-05 -2.10247912946215e-06 -3.98816979441108e-09 
0.00211025355383754 7.88119814387755e-06 -2.12837335311633e-06 -2.21092733454498e-07 
0.00127007730770856 5.3562825996778e-06 -2.01582520276133e-06 -3.70440289998442e-07 
0.000692036177497357 3.54541998603963e-06 -1.96004430108587e-06 -4.56482467825481e-07 
0.000301157066132873 2.30021669267444e-06 -1.86358738574199e-06 -5.14860914790916e-07 
5.17361513630021e-05 1.50859898440103e-06 -1.79629716967611e-06 -5.20579703788826e-07 
-0.000108845815702807 9.4009459417066e-07 -1.72781903984287e-06 -5.11089865540271e-07 
-0.000214158455491997 5.70543249978073e-07 -1.65912433658377e-06 -4.99645977924956e-07 
-0.000279174564639106 3.51118501384917e-07 -1.58730017574271e-06 -4.89090325572761e-07 
-0.000324780936352909 1.71041847352171e-07 -1.5262355645973e-06 -4.69654821699805e-07 
-0.000359781028237194 5.09461699493841e-08 -1.4527566918332e-06 -4.63337443079581e-07 
-0.000385516585083678 -3.32191660845638e-08 -1.39177484470565e-06 -4.516748504102e-07 
-0.000401729106670246 -9.38621980139942e-08 -1.33491641918226e-06 -4.41064855749573e-07 
-0.000417945731896907 -1.6631858557048e-07 -1.29088243738806e-06 -4.34790479175717e-07 
0 0 0 0 
0 0 0 0 
0 0 0 0 
0 0 0 0 
0 0 0 0 
0 0 0 0 
0 0 0 0 
0 0 0 0 
0 0 0 0 
0 0 0 0 
0 0 0 0 
0 0 0 0 
0 0 0 0 
0 0 0 0 
99.9858703613281 0.00706374645233154 0.00348708708770573 0.00145816034637392 
