{
  "ambient_brightness_scale": 1,
  "ambient_integrate_first": false,
  "ambient_occlusion_blend_mode": "SCREEN",
  "ambient_occlusion_scale": 1,
  "ambient_occlusion_texname": "",
  "ambient_saturation_scale": 1,
  "ambient_shadow_brightness_scale": 1,
  "ambient_shadow_occlusion_scale": 1,
  "ambient_shadow_saturation_scale": 0.69999998807907104,
  "auxnormal_distort_scale": 0.69999998807907104,
  "bg_color_temp": 8000,
  "bg_grayscale": false,
  "cameras": [
    {
      "ext_rot": [
        0,
        0,
        0
      ],
      "eye": [
        0,
        0,
        10000
      ],
      "fov": 45,
      "look_at": [
        0,
        0,
        0
      ],
      "name": "Primary",
      "ortho_scale": 1,
      "perspective": false,
      "up": [
        0,
        1,
        0
      ]
    },
    {
      "ext_rot": [
        0,
        0,
        0
      ],
      "eye": [
        0,
        0,
        10000
      ],
      "fov": 45,
      "look_at": [
        0,
        0,
        0
      ],
      "name": "Secondary",
      "ortho_scale": 1,
      "perspective": true,
      "up": [
        0,
        1,
        0
      ]
    }
  ],
  "compmask_close_scale": 0.039999999105930328,
  "compmask_close_scale_feather": 0.20000000298023224,
  "compmask_dist_blur_scale": -1,
  "compmask_feat_label_blur_scale": 0.40000000596046448,
  "compmask_simple_blur_scale": 0.070000000298023224,
  "compmask_simple_blur_scale_feather": 0.60000002384185791,
  "eye_alpha_threshold": 0.11999999731779099,
  "eyeball_radius_scale": 2.5,
  "freq_kernel_scale": 0.0099999997764825821,
  "ignore_pupil_normal": true,
  "is_huawei_depth": false,
  "light_filenames": [
    ".\/lights\/light-studiolight.json"
  ],
  "mtl_filenames": [
    ".\/materials\/face-type-b.dat"
  ],
  "n_max_faces": -1,
  "overwrite_bg_normal": true,
  "overwrite_eyeball_normal": true,
  "post_bg_blur_width": 0,
  "post_bg_color": [
    9.9999999747524271e-07,
    9.9998999303352321e-07,
    9.9998999303352321e-07
  ],
  "post_bg_color2": [
    9.9999999747524271e-07,
    9.9998999303352321e-07,
    9.9998999303352321e-07
  ],
  "post_bg_inpaint": false,
  "post_bg_mode": "TEXTURE",
  "post_bg_org_alpha": 1,
  "post_bg_projshadow_blend_mode": "SCREEN",
  "post_bg_projshadow_enable_alpha_channel": true,
  "post_bg_projshadow_indep_blend": false,
  "post_bg_projshadow_intensity": 0.62000000476837158,
  "post_bg_projshadow_onoff": false,
  "post_bg_projshadow_scale": [
    1,
    1
  ],
  "post_bg_projshadow_scale_by_face": false,
  "post_bg_s_tone_scale": 4.9600000381469727,
  "post_bg_tex_alpha": 0.5,
  "post_bg_tex_blend_mode": "SCREEN",
  "post_bg_tex_scale": 0.67000001668930054,
  "post_bg_tex_trans": [
    0,
    0
  ],
  "post_bg_texname": "textures\/wavelight_BG.png",
  "post_bg_z_offset": 200.00001525878906,
  "post_dropshadow_blur_width": 0.079999998211860657,
  "post_dropshadow_color": [
    0,
    0,
    0
  ],
  "post_dropshadow_intensity": 0,
  "post_exposure": 1,
  "post_exposure_offset": 0,
  "post_fg_tex_alpha": 0.69999998807907104,
  "post_fg_tex_blend_mode": "SCREEN",
  "post_fg_tex_scale": 1,
  "post_fg_tex_trans": [
    0,
    0
  ],
  "post_fg_texname": "textures\/StudioLight_Overlay_Portrait.png",
  "post_freecurve_ctrl_pts": [
    0.35666665434837341,
    0.40666669607162476,
    0.61666667461395264,
    0.69333332777023315
  ],
  "post_freecurve_lut": [
    0,
    0.0044434685260057449,
    0.0088869575411081314,
    0.013330486603081226,
    0.017774077132344246,
    0.022217748686671257,
    0.026661518961191177,
    0.031105412170290947,
    0.035549446940422058,
    0.039993643760681152,
    0.044438019394874573,
    0.048882599920034409,
    0.053327403962612152,
    0.057772450149059296,
    0.062217757105827332,
    0.066663347184658051,
    0.071109242737293243,
    0.075555458664894104,
    0.080002017319202423,
    0.084448941051959991,
    0.088896244764328003,
    0.093343958258628845,
    0.097792096436023712,
    0.1022406741976738,
    0.10668972134590149,
    0.11113925278186798,
    0.11558929085731506,
    0.12003985047340393,
    0.12449095398187637,
    0.12894262373447418,
    0.13339488208293915,
    0.13784775137901306,
    0.14230124652385712,
    0.14675538241863251,
    0.15121018886566162,
    0.15566566586494446,
    0.16012187302112579,
    0.16457879543304443,
    0.16903646290302277,
    0.17349490523338318,
    0.17795413732528687,
    0.18241417407989502,
    0.18687504529953003,
    0.19133675098419189,
    0.1957993358373642,
    0.20026281476020813,
    0.20472718775272369,
    0.20919249951839447,
    0.21365876495838165,
    0.21812599897384644,
    0.22259421646595001,
    0.22706344723701477,
    0.2315337061882019,
    0.2360050231218338,
    0.24047739803791046,
    0.24495087563991547,
    0.24942545592784882,
    0.25390118360519409,
    0.25837805867195129,
    0.26285609602928162,
    0.26733532547950745,
    0.27181577682495117,
    0.27629745006561279,
    0.2807803750038147,
    0.28526458144187927,
    0.28975006937980652,
    0.29423686861991882,
    0.29872503876686096,
    0.30321452021598816,
    0.30770540237426758,
    0.31219765543937683,
    0.31669133901596069,
    0.32118645310401917,
    0.32568302750587463,
    0.3301810622215271,
    0.33468061685562134,
    0.33918166160583496,
    0.34368425607681274,
    0.34818840026855469,
    0.35269412398338318,
    0.35720142722129822,
    0.36171036958694458,
    0.36622095108032227,
    0.37073317170143127,
    0.37524706125259399,
    0.3797626793384552,
    0.3842799961566925,
    0.3887990415096283,
    0.39331987500190735,
    0.39784246683120728,
    0.40236684679985046,
    0.40689307451248169,
    0.4114210307598114,
    0.4159504771232605,
    0.42048099637031555,
    0.42501229047775269,
    0.42954391241073608,
    0.43407559394836426,
    0.43860691785812378,
    0.443137526512146,
    0.44766709208488464,
    0.45219519734382629,
    0.45672154426574707,
    0.46124574542045593,
    0.46576741337776184,
    0.47028625011444092,
    0.47480183839797974,
    0.47931382060050964,
    0.48382186889648438,
    0.48832562565803528,
    0.49282470345497131,
    0.49731871485710144,
    0.50180739164352417,
    0.5062902569770813,
    0.51076704263687134,
    0.51523733139038086,
    0.51970082521438599,
    0.52415710687637329,
    0.52860581874847412,
    0.53304660320281982,
    0.53747916221618652,
    0.54190301895141602,
    0.5463179349899292,
    0.55072343349456787,
    0.55511927604675293,
    0.55950498580932617,
    0.56388026475906372,
    0.56824475526809692,
    0.57259809970855713,
    0.57693994045257568,
    0.58126986026763916,
    0.58558750152587891,
    0.58989262580871582,
    0.59418469667434692,
    0.59846353530883789,
    0.60272860527038574,
    0.60697966814041138,
    0.61121630668640137,
    0.61543822288513184,
    0.61964493989944458,
    0.6238362193107605,
    0.62801164388656616,
    0.63217085599899292,
    0.63631349802017212,
    0.64043915271759033,
    0.64454758167266846,
    0.64863836765289307,
    0.65271109342575073,
    0.65676546096801758,
    0.66080111265182495,
    0.6648176908493042,
    0.66881477832794189,
    0.67279201745986938,
    0.67674911022186279,
    0.68068569898605347,
    0.68460136651992798,
    0.68849575519561768,
    0.69236856698989868,
    0.69621938467025757,
    0.70004832744598389,
    0.70385563373565674,
    0.70764142274856567,
    0.71140605211257935,
    0.7151496410369873,
    0.71887248754501343,
    0.72257477045059204,
    0.72625672817230225,
    0.72991865873336792,
    0.73356062173843384,
    0.73718303442001343,
    0.74078595638275146,
    0.7443697452545166,
    0.74793452024459839,
    0.7514805793762207,
    0.75500810146331787,
    0.75851738452911377,
    0.76200854778289795,
    0.76548188924789429,
    0.76893764734268188,
    0.77237600088119507,
    0.77579724788665771,
    0.77920150756835938,
    0.78258907794952393,
    0.78596013784408569,
    0.78931492567062378,
    0.79265373945236206,
    0.79597675800323486,
    0.79928416013717651,
    0.80257618427276611,
    0.80585312843322754,
    0.80911517143249512,
    0.81236255168914795,
    0.81559544801712036,
    0.81881409883499146,
    0.82201880216598511,
    0.82520973682403564,
    0.82838708162307739,
    0.83155113458633423,
    0.83470207452774048,
    0.83784013986587524,
    0.84096556901931763,
    0.84407860040664673,
    0.84717941284179688,
    0.85026830434799194,
    0.85334539413452148,
    0.85641103982925415,
    0.85946536064147949,
    0.86250859498977661,
    0.86554104089736938,
    0.86856281757354736,
    0.87157422304153442,
    0.87457549571990967,
    0.87756681442260742,
    0.88054847717285156,
    0.88352060317993164,
    0.88648349046707153,
    0.88943731784820557,
    0.89238238334655762,
    0.89531880617141724,
    0.89824694395065308,
    0.90116691589355469,
    0.90407902002334595,
    0.90698337554931641,
    0.90988034009933472,
    0.91277009248733521,
    0.9156528115272522,
    0.91852879524230957,
    0.92139816284179688,
    0.92426127195358276,
    0.92711824178695679,
    0.92996937036514282,
    0.9328148365020752,
    0.93565493822097778,
    0.93848979473114014,
    0.94131964445114136,
    0.9441448450088501,
    0.94696545600891113,
    0.94978183507919312,
    0.9525941014289856,
    0.95540255308151245,
    0.95820742845535278,
    0.96100884675979614,
    0.96380716562271118,
    0.96660250425338745,
    0.96939516067504883,
    0.97218531370162964,
    0.97497320175170898,
    0.97775906324386597,
    0.98054313659667969,
    0.98332566022872925,
    0.9861067533493042,
    0.98888677358627319,
    0.99166584014892578,
    0.99444431066513062,
    0.99722224473953247,
    1
  ],
  "post_grayscale": false,
  "post_tonemap_mode": "LINEAR",
  "post_tonemap_with_fore_back": true,
  "post_use_dropshadow": false,
  "projshadow_blend_mode": "MULTIPLY",
  "projshadow_buffer_range": 1,
  "projshadow_color": [
    0.5,
    0.49999499320983887,
    0.49999499320983887
  ],
  "projshadow_enable_alpha_channel": false,
  "projshadow_ext_scale": 1,
  "projshadow_ext_trans_mode": false,
  "projshadow_fit_to_image": true,
  "projshadow_ignore_ext_move": true,
  "projshadow_intensity": 1,
  "projshadow_mono_inversion": false,
  "projshadow_repeat": false,
  "projshadow_repeat_flip": false,
  "projshadow_scale": [
    1,
    1
  ],
  "projshadow_scale_by_face": false,
  "projshadow_shadow_mode": false,
  "projshadow_texname": "projshadow\/StudioLight_Overlay_Portrait2.png",
  "projshadow_trans": [
    0,
    0,
    0
  ],
  "projshadow_two_sided": false,
  "projshadow_yaw_pitch_roll": [
    0,
    0,
    0
  ],
  "pupil_radius_scale": 2.5999999046325684,
  "relative_light": true,
  "rigid_eyeball_normal": true,
  "screen_width": 2000,
  "shading_grayscale": false,
  "shading_region_thld": 0.004999999888241291,
  "softshadow_blend_mode": "LINEAR_BURN",
  "softshadow_blur_width": 0.039999999105930328,
  "softshadow_buffer_range": 0.69999998807907104,
  "softshadow_displace_blend_mode": "ADD",
  "softshadow_displace_intensity_2d_x": 0.029999999329447746,
  "softshadow_displace_intensity_2d_y": 0.029999999329447746,
  "softshadow_displace_intensity_all": 0,
  "softshadow_displace_intensity_dark": 0,
  "softshadow_displace_tex_scale": 1,
  "softshadow_displace_texname": "",
  "softshadow_intensity": 0.25999999046325684,
  "softshadow_intensity_base_face_scale": 0.5,
  "softshadow_intensity_slope": 0,
  "softshadow_ray_offset": 0.57999998331069946,
  "ssss_quality": 0,
  "ssss_width": 0.059999998658895493,
  "use_ambient": true,
  "use_ambient_occlusion": false,
  "use_bg_color_temp": false,
  "use_bg_s_tone": false,
  "use_estimated_light": true,
  "use_feathering_compmask": true,
  "use_foreground": true,
  "use_freq_separation": false,
  "use_projshadow": false,
  "use_softshadow": false,
  "use_softshadow_displace": false,
  "use_ssss": false
}
