#,version,,,,,,,,,,,,,,,,,,,,,,,,,,,,,,,,,,,,,,,,,,,,,,,,,,,,,,,,,,,,,,,,,,,,,,,
2021,1,30,7,,,,,,,,,,,,,,,,,,,,,,,,,,,,,,,,,,,,,,,,,,,,,,,,,,,,,,,,,,,,,,,,,,,,,
#,row_col_num,,,,,,,,,,,,,,,,,,,,,,,,,,,,,,,,,,,,,,,,,,,,,,,,,,,,,,,,,,,,,,,,,,,,,,,
34,39,,,,,,,,,,,,,,,,,,,,,,,,,,,,,,,,,,,,,,,,,,,,,,,,,,,,,,,,,,,,,,,,,,,,,,,
#,noise,,,,,,,,,,,,,,,,,,,,,,,,,,,,,,,,,,,,,,,,,,,,,,,,,,,,,,,,,,,,,,,,,,,,,,,
-1000,1000,,,,,,,,,,,,,,,,,,,,,,,,,,,,,,,,,,,,,,,,,,,,,,,,,,,,,,,,,,,,,,,,,,,,,,,
#,raw_max,,,,,,,,,,,,,,,,,,,,,,,,,,,,,,,,,,,,,,,,,,,,,,,,,,,,,,,,,,,,,,,,,,,,,,,
1484,1261,1226,1199,1191,1178,1171,1166,1163,1162,1156,1158,1151,1151,1156,1148,1140,1140,1136,1127,1132,1140,1141,1148,1153,1152,1152,1161,1159,1166,1169,1176,1177,1188,1194,1206,1237,1268,1696,,,,,,,,,,,,,,,,,,,,,,,,,,,,,,,,,,
1223,1174,1169,1158,1156,1148,1143,1140,1139,1139,1135,1138,1132,1133,1137,1132,1122,1122,1117,1106,1112,1121,1123,1131,1134,1133,1133,1140,1137,1144,1144,1150,1149,1157,1159,1166,1176,1184,1262,,,,,,,,,,,,,,,,,,,,,,,,,,,,,,,,,,
1166,1135,1139,1128,1128,1122,1118,1116,1115,1116,1112,1116,1111,1113,1117,1112,1102,1102,1097,1085,1091,1102,1104,1111,1114,1113,1112,1119,1115,1121,1121,1127,1125,1132,1133,1137,1148,1145,1182,,,,,,,,,,,,,,,,,,,,,,,,,,,,,,,,,,
1137,1124,1130,1123,1124,1119,1116,1115,1114,1116,1112,1116,1112,1114,1118,1113,1104,1104,1098,1086,1092,1104,1105,1112,1115,1114,1112,1119,1114,1120,1120,1125,1122,1128,1128,1133,1137,1136,1149,,,,,,,,,,,,,,,,,,,,,,,,,,,,,,,,,,
1108,1097,1105,1098,1101,1096,1093,1092,1092,1094,1091,1095,1092,1094,1098,1093,1084,1085,1080,1066,1073,1085,1086,1093,1096,1094,1092,1099,1094,1100,1099,1104,1100,1106,1106,1109,1113,1110,1121,,,,,,,,,,,,,,,,,,,,,,,,,,,,,,,,,,
1105,1097,1104,1100,1102,1098,1096,1095,1096,1098,1095,1100,1096,1098,1104,1098,1089,1090,1085,1070,1078,1090,1091,1098,1100,1098,1096,1104,1098,1104,1102,1108,1104,1109,1108,1110,1113,1109,1117,,,,,,,,,,,,,,,,,,,,,,,,,,,,,,,,,,
1081,1073,1082,1079,1082,1078,1075,1075,1076,1079,1075,1081,1076,1080,1085,1080,1070,1072,1066,1052,1060,1072,1073,1081,1082,1081,1078,1085,1080,1085,1083,1087,1083,1088,1086,1089,1091,1086,1094,,,,,,,,,,,,,,,,,,,,,,,,,,,,,,,,,,
1079,1075,1084,1082,1085,1081,1079,1079,1080,1083,1080,1086,1082,1085,1090,1085,1075,1078,1071,1057,1065,1078,1079,1085,1087,1085,1082,1090,1083,1089,1086,1091,1086,1091,1089,1091,1093,1088,1091,,,,,,,,,,,,,,,,,,,,,,,,,,,,,,,,,,
1058,1055,1064,1061,1065,1061,1061,1060,1061,1064,1062,1067,1064,1068,1072,1068,1059,1061,1054,1038,1047,1060,1062,1068,1070,1068,1065,1072,1066,1071,1068,1072,1067,1072,1070,1071,1073,1067,1070,,,,,,,,,,,,,,,,,,,,,,,,,,,,,,,,,,
1063,1059,1068,1066,1069,1066,1064,1065,1066,1069,1067,1073,1070,1073,1079,1074,1064,1066,1060,1044,1053,1066,1067,1074,1075,1074,1070,1078,1070,1075,1073,1078,1072,1076,1073,1075,1076,1070,1071,,,,,,,,,,,,,,,,,,,,,,,,,,,,,,,,,,
1045,1040,1048,1045,1049,1045,1045,1045,1047,1050,1048,1055,1052,1055,1061,1056,1046,1048,1041,1026,1034,1048,1050,1057,1059,1056,1053,1059,1053,1058,1055,1059,1054,1058,1055,1056,1057,1050,1052,,,,,,,,,,,,,,,,,,,,,,,,,,,,,,,,,,
1073,1045,1054,1052,1056,1053,1052,1053,1054,1058,1056,1062,1058,1062,1067,1063,1054,1056,1048,1033,1041,1056,1057,1064,1065,1063,1059,1066,1059,1064,1061,1065,1060,1064,1060,1062,1062,1056,1055,,,,,,,,,,,,,,,,,,,,,,,,,,,,,,,,,,
1041,1068,1038,1035,1040,1037,1036,1036,1039,1042,1040,1047,1043,1047,1053,1048,1039,1041,1034,1017,1027,1042,1043,1049,1052,1048,1045,1052,1044,1049,1046,1050,1044,1048,1044,1046,1046,1039,1038,,,,,,,,,,,,,,,,,,,,,,,,,,,,,,,,,,
1105,1039,1048,1045,1049,1047,1045,1047,1048,1053,1050,1057,1054,1058,1063,1059,1049,1050,1043,1028,1037,1052,1053,1060,1061,1059,1055,1062,1054,1059,1056,1060,1054,1058,1054,1055,1056,1048,1045,,,,,,,,,,,,,,,,,,,,,,,,,,,,,,,,,,
1023,1049,1036,1032,1036,1048,1032,1033,1035,1039,1037,1044,1040,1044,1050,1046,1036,1038,1031,1013,1023,1038,1040,1047,1048,1045,1042,1048,1041,1046,1042,1045,1040,1044,1040,1041,1042,1034,1031,,,,,,,,,,,,,,,,,,,,,,,,,,,,,,,,,,
1028,1044,1054,1049,1045,1061,1042,1044,1045,1050,1047,1055,1052,1056,1061,1057,1047,1048,1041,1024,1034,1049,1050,1058,1059,1057,1053,1060,1052,1057,1053,1057,1050,1055,1050,1052,1053,1044,1039,,,,,,,,,,,,,,,,,,,,,,,,,,,,,,,,,,
1014,1029,1046,1048,1034,1054,1031,1032,1034,1037,1035,1043,1040,1044,1050,1045,1036,1037,1030,1012,1022,1038,1039,1046,1048,1045,1040,1047,1040,1045,1041,1044,1038,1042,1039,1039,1040,1033,1027,,,,,,,,,,,,,,,,,,,,,,,,,,,,,,,,,,
1026,1037,1062,1067,1045,1079,1043,1064,1046,1050,1047,1057,1053,1057,1062,1058,1047,1049,1042,1024,1034,1049,1050,1059,1060,1057,1053,1060,1052,1057,1054,1057,1050,1055,1050,1052,1052,1044,1036,,,,,,,,,,,,,,,,,,,,,,,,,,,,,,,,,,
1014,1053,1033,1053,1037,1083,1073,1035,1038,1040,1038,1045,1042,1046,1053,1047,1037,1039,1031,1013,1023,1039,1040,1048,1049,1046,1042,1049,1041,1046,1043,1046,1040,1044,1040,1040,1041,1034,1024,,,,,,,,,,,,,,,,,,,,,,,,,,,,,,,,,,
1023,1042,1046,1060,1048,1062,1072,1052,1053,1055,1050,1059,1056,1061,1066,1061,1050,1053,1045,1027,1036,1053,1054,1062,1063,1060,1056,1063,1055,1060,1056,1059,1053,1058,1053,1054,1055,1046,1035,,,,,,,,,,,,,,,,,,,,,,,,,,,,,,,,,,
1020,1084,1038,1052,1039,1101,1055,1079,1043,1055,1042,1056,1046,1056,1057,1105,1058,1044,1036,1015,1027,1043,1044,1052,1054,1050,1046,1054,1045,1050,1046,1049,1044,1047,1044,1044,1045,1037,1026,,,,,,,,,,,,,,,,,,,,,,,,,,,,,,,,,,
984,991,1004,1001,1005,1002,1001,1002,1004,1008,1006,1013,1010,1015,1020,1017,1005,1008,1000,989,993,1007,1009,1016,1017,1014,1011,1018,1010,1015,1017,1040,1010,1027,1034,1011,1037,1019,1085,,,,,,,,,,,,,,,,,,,,,,,,,,,,,,,,,,
970,980,992,988,993,990,990,990,993,996,994,1002,998,1003,1009,1004,993,995,988,976,982,995,997,1005,1008,1004,1000,1007,998,1005,1006,1016,998,1015,1017,1000,1023,1001,1013,,,,,,,,,,,,,,,,,,,,,,,,,,,,,,,,,,
983,993,1006,1002,1006,1004,1003,1004,1005,1009,1007,1014,1010,1016,1020,1018,1006,1009,1000,989,993,1007,1009,1016,1019,1015,1011,1019,1011,1016,1015,1020,1011,1031,1028,1012,1042,1014,1026,,,,,,,,,,,,,,,,,,,,,,,,,,,,,,,,,,
969,982,994,990,994,991,992,993,994,998,995,1003,1000,1004,1010,1005,994,995,988,976,982,995,997,1006,1008,1005,1001,1008,1001,1006,1003,1006,1001,1004,1002,1009,1017,1016,984,,,,,,,,,,,,,,,,,,,,,,,,,,,,,,,,,,
983,997,1009,1005,1009,1006,1006,1007,1009,1012,1009,1016,1012,1017,1022,1019,1007,1009,1001,990,995,1008,1010,1018,1020,1017,1013,1021,1013,1018,1016,1018,1014,1017,1015,1017,1021,1037,997,,,,,,,,,,,,,,,,,,,,,,,,,,,,,,,,,,
975,990,1003,997,1003,998,998,1000,1001,1005,1002,1009,1005,1009,1015,1009,998,1000,992,980,987,1000,1003,1010,1014,1010,1007,1014,1006,1011,1009,1012,1007,1011,1008,1009,1012,1033,997,,,,,,,,,,,,,,,,,,,,,,,,,,,,,,,,,,
991,1008,1020,1015,1019,1016,1015,1016,1018,1021,1017,1026,1020,1026,1032,1028,1014,1016,1008,997,1002,1015,1017,1026,1029,1026,1022,1030,1021,1028,1026,1028,1022,1027,1024,1024,1028,1045,1017,,,,,,,,,,,,,,,,,,,,,,,,,,,,,,,,,,
983,1001,1013,1008,1012,1008,1008,1009,1010,1013,1010,1017,1013,1017,1023,1017,1006,1006,1000,987,994,1006,1010,1017,1021,1018,1015,1022,1014,1020,1018,1020,1016,1019,1018,1017,1022,1032,1011,,,,,,,,,,,,,,,,,,,,,,,,,,,,,,,,,,
997,1017,1029,1022,1027,1022,1022,1023,1024,1028,1023,1032,1026,1031,1036,1032,1017,1020,1011,1002,1006,1017,1020,1029,1034,1031,1028,1035,1027,1033,1031,1035,1030,1033,1031,1032,1036,1039,1015,,,,,,,,,,,,,,,,,,,,,,,,,,,,,,,,,,
993,1010,1022,1015,1018,1015,1016,1016,1018,1020,1016,1022,1018,1021,1028,1020,1010,1009,1003,991,997,1009,1012,1020,1027,1023,1020,1028,1020,1026,1024,1028,1023,1026,1026,1026,1031,1027,1008,,,,,,,,,,,,,,,,,,,,,,,,,,,,,,,,,,
1022,1037,1048,1040,1042,1039,1039,1040,1041,1043,1038,1045,1040,1044,1048,1044,1031,1033,1023,1015,1017,1029,1032,1041,1046,1044,1041,1048,1041,1047,1046,1049,1044,1048,1046,1049,1054,1049,1031,,,,,,,,,,,,,,,,,,,,,,,,,,,,,,,,,,
1070,1046,1055,1044,1046,1040,1041,1041,1043,1044,1040,1046,1041,1044,1050,1043,1032,1031,1024,1014,1019,1030,1033,1042,1048,1045,1042,1050,1043,1049,1048,1052,1047,1050,1052,1054,1063,1058,1079,,,,,,,,,,,,,,,,,,,,,,,,,,,,,,,,,,
1455,1143,1161,1117,1120,1109,1108,1109,1110,1111,1107,1114,1108,1118,1117,1128,1099,1117,1093,1096,1089,1096,1099,1109,1115,1111,1108,1116,1108,1115,1114,1117,1114,1116,1122,1124,1135,1150,1262,,,,,,,,,,,,,,,,,,,,,,,,,,,,,,,,,,
#,raw_min,,,,,,,,,,,,,,,,,,,,,,,,,,,,,,,,,,,,,,,,,,,,,,,,,,,,,,,,,,,,,,,,,,,,,,,
614,614,601,583,580,571,568,563,566,563,563,563,563,559,562,555,553,551,554,547,555,552,556,556,563,558,564,566,567,567,572,572,574,576,582,585,605,618,570,,,,,,,,,,,,,,,,,,,,,,,,,,,,,,,,,,
588,563,563,556,555,549,545,544,545,546,544,547,544,544,544,541,536,536,536,530,535,537,537,542,544,543,544,549,547,549,550,553,551,555,555,560,566,570,616,,,,,,,,,,,,,,,,,,,,,,,,,,,,,,,,,,
564,542,555,541,543,535,535,531,536,534,535,535,536,533,536,530,529,526,529,519,528,528,531,532,538,532,537,539,539,537,542,541,542,542,546,545,559,550,579,,,,,,,,,,,,,,,,,,,,,,,,,,,,,,,,,,
542,537,543,539,537,534,531,530,532,533,531,535,533,533,534,530,526,526,526,519,524,528,528,532,534,533,533,538,534,536,537,539,536,540,539,543,546,544,556,,,,,,,,,,,,,,,,,,,,,,,,,,,,,,,,,,
529,523,533,526,529,522,522,519,523,521,523,524,526,523,527,520,519,516,519,508,518,517,521,522,528,522,527,528,528,526,530,529,529,528,530,530,536,530,543,,,,,,,,,,,,,,,,,,,,,,,,,,,,,,,,,,
524,522,529,526,527,523,520,520,521,523,522,526,524,525,526,522,518,519,518,510,516,520,519,524,526,524,525,530,526,527,527,530,527,529,528,530,532,530,538,,,,,,,,,,,,,,,,,,,,,,,,,,,,,,,,,,
515,510,521,515,519,513,513,509,514,512,514,516,517,515,519,513,511,509,511,500,510,510,514,515,521,514,518,520,520,516,520,519,519,518,520,519,524,518,529,,,,,,,,,,,,,,,,,,,,,,,,,,,,,,,,,,
509,511,519,516,516,513,510,510,512,514,512,518,516,517,518,515,510,511,510,502,507,511,511,516,519,516,516,521,517,518,518,520,516,519,518,520,521,519,524,,,,,,,,,,,,,,,,,,,,,,,,,,,,,,,,,,
502,500,511,505,509,502,504,500,506,504,506,507,509,508,512,506,504,502,505,493,502,503,506,507,514,507,510,512,511,508,512,511,510,509,511,510,514,508,516,,,,,,,,,,,,,,,,,,,,,,,,,,,,,,,,,,
501,501,510,507,508,505,502,502,505,506,505,510,508,510,512,509,504,505,504,496,501,505,505,510,512,509,509,514,510,510,510,513,509,511,509,512,513,510,514,,,,,,,,,,,,,,,,,,,,,,,,,,,,,,,,,,
495,492,502,497,500,493,495,492,497,495,498,500,502,501,505,499,497,495,497,486,495,496,499,501,506,500,504,505,504,501,504,502,502,501,502,501,505,499,506,,,,,,,,,,,,,,,,,,,,,,,,,,,,,,,,,,
507,494,502,499,500,497,495,495,497,499,498,503,502,504,505,502,497,498,497,488,494,499,499,504,506,503,503,507,503,504,503,505,501,504,502,504,505,501,504,,,,,,,,,,,,,,,,,,,,,,,,,,,,,,,,,,
492,508,496,491,495,489,490,487,493,491,493,495,497,496,501,494,492,491,493,480,490,492,495,496,502,496,499,501,499,496,499,497,496,495,497,495,500,493,499,,,,,,,,,,,,,,,,,,,,,,,,,,,,,,,,,,
523,491,499,495,496,493,492,492,494,496,495,501,500,502,503,500,494,496,495,486,492,497,497,502,504,501,500,505,500,501,501,502,498,500,498,500,502,497,500,,,,,,,,,,,,,,,,,,,,,,,,,,,,,,,,,,
483,496,495,489,492,496,488,485,491,490,492,494,496,495,499,493,492,490,491,479,489,491,493,495,501,494,497,499,497,495,497,496,494,493,495,493,498,491,495,,,,,,,,,,,,,,,,,,,,,,,,,,,,,,,,,,
482,493,501,499,495,502,491,491,493,495,494,500,498,501,501,499,493,495,494,485,491,496,495,501,502,500,500,504,499,500,500,501,497,499,497,499,500,496,496,,,,,,,,,,,,,,,,,,,,,,,,,,,,,,,,,,
478,485,501,498,491,498,487,484,490,489,491,493,495,494,499,493,491,489,490,478,488,490,493,495,500,493,497,498,496,494,496,495,494,492,493,492,497,489,493,,,,,,,,,,,,,,,,,,,,,,,,,,,,,,,,,,
481,490,506,508,494,511,491,500,493,495,494,500,499,501,502,499,493,494,493,485,491,495,495,500,502,500,499,504,499,500,499,501,497,499,497,498,500,494,494,,,,,,,,,,,,,,,,,,,,,,,,,,,,,,,,,,
478,498,493,500,492,512,511,486,492,490,491,494,496,495,500,493,491,489,491,478,488,490,493,495,501,494,497,499,497,494,497,496,494,493,494,493,497,490,492,,,,,,,,,,,,,,,,,,,,,,,,,,,,,,,,,,
479,491,497,502,495,501,505,494,497,497,494,500,499,502,504,500,494,495,494,485,491,496,496,501,504,501,501,505,500,501,500,502,498,500,497,499,500,495,494,,,,,,,,,,,,,,,,,,,,,,,,,,,,,,,,,,
481,513,495,499,494,521,498,510,494,498,493,500,497,500,502,522,501,492,492,479,488,492,494,497,502,496,499,501,499,497,499,498,496,495,496,494,499,491,492,,,,,,,,,,,,,,,,,,,,,,,,,,,,,,,,,,
461,467,477,474,475,472,471,471,473,475,474,479,478,481,482,479,473,475,473,467,471,476,475,480,483,480,479,485,480,481,483,496,478,486,490,480,493,485,525,,,,,,,,,,,,,,,,,,,,,,,,,,,,,,,,,,
457,462,473,469,472,466,467,465,470,470,471,474,475,475,478,473,469,468,469,461,467,470,472,475,479,475,476,479,476,475,479,483,474,481,484,474,490,475,488,,,,,,,,,,,,,,,,,,,,,,,,,,,,,,,,,,
460,469,479,476,477,474,472,472,475,477,475,481,479,482,483,480,473,476,474,468,472,476,476,482,484,481,480,486,480,482,482,486,479,488,488,480,498,481,493,,,,,,,,,,,,,,,,,,,,,,,,,,,,,,,,,,
457,463,475,470,473,468,468,467,472,471,472,476,476,476,479,474,470,469,470,462,468,470,473,477,481,476,478,481,478,477,478,478,476,476,476,479,487,483,472,,,,,,,,,,,,,,,,,,,,,,,,,,,,,,,,,,
462,471,481,478,478,476,474,474,477,478,477,483,481,483,484,482,474,477,474,469,473,476,477,482,486,482,482,487,482,483,482,484,481,482,480,483,486,493,477,,,,,,,,,,,,,,,,,,,,,,,,,,,,,,,,,,
459,467,479,474,477,472,472,469,474,474,475,478,479,479,482,477,472,471,472,464,470,473,475,479,484,479,480,483,480,479,481,480,479,478,478,478,483,492,478,,,,,,,,,,,,,,,,,,,,,,,,,,,,,,,,,,
465,476,486,483,484,480,478,478,481,483,481,487,486,487,488,485,478,480,478,473,476,480,481,486,490,486,486,491,486,488,487,488,485,487,485,486,488,497,486,,,,,,,,,,,,,,,,,,,,,,,,,,,,,,,,,,
463,473,484,479,482,477,477,475,479,479,479,483,483,483,486,480,476,476,475,467,473,476,479,482,487,482,484,488,485,484,486,485,484,483,484,483,487,491,486,,,,,,,,,,,,,,,,,,,,,,,,,,,,,,,,,,
468,480,491,487,487,484,481,481,484,486,484,490,487,490,490,487,479,482,479,474,477,481,482,488,491,488,488,493,488,490,490,491,488,490,488,490,492,494,486,,,,,,,,,,,,,,,,,,,,,,,,,,,,,,,,,,
466,477,488,482,485,479,479,477,482,482,481,485,485,485,487,481,477,476,476,468,475,477,480,483,488,484,486,489,486,486,488,487,486,486,486,486,491,487,481,,,,,,,,,,,,,,,,,,,,,,,,,,,,,,,,,,
482,491,501,496,496,493,491,491,493,494,492,498,495,497,498,494,487,489,486,482,484,488,490,495,499,495,495,501,495,497,497,499,495,498,496,499,502,499,492,,,,,,,,,,,,,,,,,,,,,,,,,,,,,,,,,,
507,497,506,500,501,495,494,493,497,496,496,500,498,498,501,495,491,490,489,482,488,490,493,497,503,497,499,502,499,499,502,501,500,500,502,502,508,504,516,,,,,,,,,,,,,,,,,,,,,,,,,,,,,,,,,,
550,550,563,540,540,533,530,530,530,532,529,535,532,536,534,543,525,536,527,529,526,527,527,533,535,532,532,537,531,533,534,536,535,537,539,541,546,552,516,,,,,,,,,,,,,,,,,,,,,,,,,,,,,,,,,,
#,raw_row_delta_max,,,,,,,,,,,,,,,,,,,,,,,,,,,,,,,,,,,,,,,,,,,,,,,,,,,,,,,,,,,,,,,,,,,,,,,
250,200,200,200,200,200,200,200,200,200,200,200,200,200,200,200,200,200,200,200,200,200,200,200,200,200,200,200,200,200,200,200,200,200,200,200,200,200,250,,,,,,,,,,,,,,,,,,,,,,,,,,,,,,,,,,
250,200,200,200,200,200,200,200,200,200,200,200,200,200,200,200,200,200,200,200,200,200,200,200,200,200,200,200,200,200,200,200,200,200,200,200,200,200,250,,,,,,,,,,,,,,,,,,,,,,,,,,,,,,,,,,
250,200,200,200,200,200,200,200,200,200,200,200,200,200,200,200,200,200,200,200,200,200,200,200,200,200,200,200,200,200,200,200,200,200,200,200,200,200,250,,,,,,,,,,,,,,,,,,,,,,,,,,,,,,,,,,
250,200,200,200,200,200,200,200,200,200,200,200,200,200,200,200,200,200,200,200,200,200,200,200,200,200,200,200,200,200,200,200,200,200,200,200,200,200,250,,,,,,,,,,,,,,,,,,,,,,,,,,,,,,,,,,
250,200,200,200,200,200,200,200,200,200,200,200,200,200,200,200,200,200,200,200,200,200,200,200,200,200,200,200,200,200,200,200,200,200,200,200,200,200,250,,,,,,,,,,,,,,,,,,,,,,,,,,,,,,,,,,
250,200,200,200,200,200,200,200,200,200,200,200,200,200,200,200,200,200,200,200,200,200,200,200,200,200,200,200,200,200,200,200,200,200,200,200,200,200,250,,,,,,,,,,,,,,,,,,,,,,,,,,,,,,,,,,
250,200,200,200,200,200,200,200,200,200,200,200,200,200,200,200,200,200,200,200,200,200,200,200,200,200,200,200,200,200,200,200,200,200,200,200,200,200,250,,,,,,,,,,,,,,,,,,,,,,,,,,,,,,,,,,
250,200,200,200,200,200,200,200,200,200,200,200,200,200,200,200,200,200,200,200,200,200,200,200,200,200,200,200,200,200,200,200,200,200,200,200,200,200,250,,,,,,,,,,,,,,,,,,,,,,,,,,,,,,,,,,
250,200,200,200,200,200,200,200,200,200,200,200,200,200,200,200,200,200,200,200,200,200,200,200,200,200,200,200,200,200,200,200,200,200,200,200,200,200,250,,,,,,,,,,,,,,,,,,,,,,,,,,,,,,,,,,
250,200,200,200,200,200,200,200,200,200,200,200,200,200,200,200,200,200,200,200,200,200,200,200,200,200,200,200,200,200,200,200,200,200,200,200,200,200,250,,,,,,,,,,,,,,,,,,,,,,,,,,,,,,,,,,
250,200,200,200,200,200,200,200,200,200,200,200,200,200,200,200,200,200,200,200,200,200,200,200,200,200,200,200,200,200,200,200,200,200,200,200,200,200,250,,,,,,,,,,,,,,,,,,,,,,,,,,,,,,,,,,
250,200,200,200,200,200,200,200,200,200,200,200,200,200,200,200,200,200,200,200,200,200,200,200,200,200,200,200,200,200,200,200,200,200,200,200,200,200,250,,,,,,,,,,,,,,,,,,,,,,,,,,,,,,,,,,
250,200,200,200,200,200,200,200,200,200,200,200,200,200,200,200,200,200,200,200,200,200,200,200,200,200,200,200,200,200,200,200,200,200,200,200,200,200,250,,,,,,,,,,,,,,,,,,,,,,,,,,,,,,,,,,
250,200,200,200,200,200,200,200,200,200,200,200,200,200,200,200,200,200,200,200,200,200,200,200,200,200,200,200,200,200,200,200,200,200,200,200,200,200,250,,,,,,,,,,,,,,,,,,,,,,,,,,,,,,,,,,
250,200,200,200,200,200,200,200,200,200,200,200,200,200,200,200,200,200,200,200,200,200,200,200,200,200,200,200,200,200,200,200,200,200,200,200,200,200,250,,,,,,,,,,,,,,,,,,,,,,,,,,,,,,,,,,
250,200,200,200,200,200,200,200,200,200,200,200,200,200,200,200,200,200,200,200,200,200,200,200,200,200,200,200,200,200,200,200,200,200,200,200,200,200,250,,,,,,,,,,,,,,,,,,,,,,,,,,,,,,,,,,
250,200,200,200,200,200,200,200,200,200,200,200,200,200,200,200,200,200,200,200,200,200,200,200,200,200,200,200,200,200,200,200,200,200,200,200,200,200,250,,,,,,,,,,,,,,,,,,,,,,,,,,,,,,,,,,
250,200,200,200,200,200,200,200,200,200,200,200,200,200,200,200,200,200,200,200,200,200,200,200,200,200,200,200,200,200,200,200,200,200,200,200,200,200,250,,,,,,,,,,,,,,,,,,,,,,,,,,,,,,,,,,
250,200,200,200,200,200,200,200,200,200,200,200,200,200,200,200,200,200,200,200,200,200,200,200,200,200,200,200,200,200,200,200,200,200,200,200,200,200,250,,,,,,,,,,,,,,,,,,,,,,,,,,,,,,,,,,
250,200,200,200,200,200,200,200,200,200,200,200,200,200,200,200,200,200,200,200,200,200,200,200,200,200,200,200,200,200,200,200,200,200,200,200,200,200,250,,,,,,,,,,,,,,,,,,,,,,,,,,,,,,,,,,
250,200,200,200,200,200,200,200,200,200,200,200,200,200,200,200,200,200,200,200,200,200,200,200,200,200,200,200,200,200,200,200,200,200,200,200,200,200,250,,,,,,,,,,,,,,,,,,,,,,,,,,,,,,,,,,
250,200,200,200,200,200,200,200,200,200,200,200,200,200,200,200,200,200,200,200,200,200,200,200,200,200,200,200,200,200,200,200,200,200,200,200,200,200,250,,,,,,,,,,,,,,,,,,,,,,,,,,,,,,,,,,
250,200,200,200,200,200,200,200,200,200,200,200,200,200,200,200,200,200,200,200,200,200,200,200,200,200,200,200,200,200,200,200,200,200,200,200,200,200,250,,,,,,,,,,,,,,,,,,,,,,,,,,,,,,,,,,
250,200,200,200,200,200,200,200,200,200,200,200,200,200,200,200,200,200,200,200,200,200,200,200,200,200,200,200,200,200,200,200,200,200,200,200,200,200,250,,,,,,,,,,,,,,,,,,,,,,,,,,,,,,,,,,
250,200,200,200,200,200,200,200,200,200,200,200,200,200,200,200,200,200,200,200,200,200,200,200,200,200,200,200,200,200,200,200,200,200,200,200,200,200,250,,,,,,,,,,,,,,,,,,,,,,,,,,,,,,,,,,
250,200,200,200,200,200,200,200,200,200,200,200,200,200,200,200,200,200,200,200,200,200,200,200,200,200,200,200,200,200,200,200,200,200,200,200,200,200,250,,,,,,,,,,,,,,,,,,,,,,,,,,,,,,,,,,
250,200,200,200,200,200,200,200,200,200,200,200,200,200,200,200,200,200,200,200,200,200,200,200,200,200,200,200,200,200,200,200,200,200,200,200,200,200,250,,,,,,,,,,,,,,,,,,,,,,,,,,,,,,,,,,
250,200,200,200,200,200,200,200,200,200,200,200,200,200,200,200,200,200,200,200,200,200,200,200,200,200,200,200,200,200,200,200,200,200,200,200,200,200,250,,,,,,,,,,,,,,,,,,,,,,,,,,,,,,,,,,
250,200,200,200,200,200,200,200,200,200,200,200,200,200,200,200,200,200,200,200,200,200,200,200,200,200,200,200,200,200,200,200,200,200,200,200,200,200,250,,,,,,,,,,,,,,,,,,,,,,,,,,,,,,,,,,
250,200,200,200,200,200,200,200,200,200,200,200,200,200,200,200,200,200,200,200,200,200,200,200,200,200,200,200,200,200,200,200,200,200,200,200,200,200,250,,,,,,,,,,,,,,,,,,,,,,,,,,,,,,,,,,
500,500,200,200,200,200,200,200,200,200,200,200,200,200,200,200,200,200,200,200,200,200,200,200,200,200,200,200,200,200,200,200,200,200,200,200,200,500,500,,,,,,,,,,,,,,,,,,,,,,,,,,,,,,,,,,
500,500,200,200,200,200,200,200,200,200,200,200,200,200,200,200,200,200,200,200,200,200,200,200,200,200,200,200,200,200,200,200,200,200,200,200,200,500,500,,,,,,,,,,,,,,,,,,,,,,,,,,,,,,,,,,
500,500,350,350,350,350,350,350,350,350,350,350,350,350,350,350,350,350,350,350,350,350,350,350,350,350,350,350,350,350,350,350,350,350,350,350,350,500,500,,,,,,,,,,,,,,,,,,,,,,,,,,,,,,,,,,
#,raw_row_delta_min,,,,,,,,,,,,,,,,,,,,,,,,,,,,,,,,,,,,,,,,,,,,,,,,,,,,,,,,,,,,,,,,,,,,,,,
-500,-500,-350,-350,-350,-350,-350,-350,-350,-350,-350,-350,-350,-350,-350,-350,-350,-350,-350,-350,-350,-350,-350,-350,-350,-350,-350,-350,-350,-350,-350,-350,-350,-350,-350,-350,-350,-500,-500,,,,,,,,,,,,,,,,,,,,,,,,,,,,,,,,,,
-500,-500,-200,-200,-200,-200,-200,-200,-200,-200,-200,-200,-200,-200,-200,-200,-200,-200,-200,-200,-200,-200,-200,-200,-200,-200,-200,-200,-200,-200,-200,-200,-200,-200,-200,-200,-200,-500,-500,,,,,,,,,,,,,,,,,,,,,,,,,,,,,,,,,,
-500,-500,-200,-200,-200,-200,-200,-200,-200,-200,-200,-200,-200,-200,-200,-200,-200,-200,-200,-200,-200,-200,-200,-200,-200,-200,-200,-200,-200,-200,-200,-200,-200,-200,-200,-200,-200,-500,-500,,,,,,,,,,,,,,,,,,,,,,,,,,,,,,,,,,
-250,-200,-200,-200,-200,-200,-200,-200,-200,-200,-200,-200,-200,-200,-200,-200,-200,-200,-200,-200,-200,-200,-200,-200,-200,-200,-200,-200,-200,-200,-200,-200,-200,-200,-200,-200,-200,-200,-250,,,,,,,,,,,,,,,,,,,,,,,,,,,,,,,,,,
-250,-200,-200,-200,-200,-200,-200,-200,-200,-200,-200,-200,-200,-200,-200,-200,-200,-200,-200,-200,-200,-200,-200,-200,-200,-200,-200,-200,-200,-200,-200,-200,-200,-200,-200,-200,-200,-200,-250,,,,,,,,,,,,,,,,,,,,,,,,,,,,,,,,,,
-250,-200,-200,-200,-200,-200,-200,-200,-200,-200,-200,-200,-200,-200,-200,-200,-200,-200,-200,-200,-200,-200,-200,-200,-200,-200,-200,-200,-200,-200,-200,-200,-200,-200,-200,-200,-200,-200,-250,,,,,,,,,,,,,,,,,,,,,,,,,,,,,,,,,,
-250,-200,-200,-200,-200,-200,-200,-200,-200,-200,-200,-200,-200,-200,-200,-200,-200,-200,-200,-200,-200,-200,-200,-200,-200,-200,-200,-200,-200,-200,-200,-200,-200,-200,-200,-200,-200,-200,-250,,,,,,,,,,,,,,,,,,,,,,,,,,,,,,,,,,
-250,-200,-200,-200,-200,-200,-200,-200,-200,-200,-200,-200,-200,-200,-200,-200,-200,-200,-200,-200,-200,-200,-200,-200,-200,-200,-200,-200,-200,-200,-200,-200,-200,-200,-200,-200,-200,-200,-250,,,,,,,,,,,,,,,,,,,,,,,,,,,,,,,,,,
-250,-200,-200,-200,-200,-200,-200,-200,-200,-200,-200,-200,-200,-200,-200,-200,-200,-200,-200,-200,-200,-200,-200,-200,-200,-200,-200,-200,-200,-200,-200,-200,-200,-200,-200,-200,-200,-200,-250,,,,,,,,,,,,,,,,,,,,,,,,,,,,,,,,,,
-250,-200,-200,-200,-200,-200,-200,-200,-200,-200,-200,-200,-200,-200,-200,-200,-200,-200,-200,-200,-200,-200,-200,-200,-200,-200,-200,-200,-200,-200,-200,-200,-200,-200,-200,-200,-200,-200,-250,,,,,,,,,,,,,,,,,,,,,,,,,,,,,,,,,,
-250,-200,-200,-200,-200,-200,-200,-200,-200,-200,-200,-200,-200,-200,-200,-200,-200,-200,-200,-200,-200,-200,-200,-200,-200,-200,-200,-200,-200,-200,-200,-200,-200,-200,-200,-200,-200,-200,-250,,,,,,,,,,,,,,,,,,,,,,,,,,,,,,,,,,
-250,-200,-200,-200,-200,-200,-200,-200,-200,-200,-200,-200,-200,-200,-200,-200,-200,-200,-200,-200,-200,-200,-200,-200,-200,-200,-200,-200,-200,-200,-200,-200,-200,-200,-200,-200,-200,-200,-250,,,,,,,,,,,,,,,,,,,,,,,,,,,,,,,,,,
-250,-200,-200,-200,-200,-200,-200,-200,-200,-200,-200,-200,-200,-200,-200,-200,-200,-200,-200,-200,-200,-200,-200,-200,-200,-200,-200,-200,-200,-200,-200,-200,-200,-200,-200,-200,-200,-200,-250,,,,,,,,,,,,,,,,,,,,,,,,,,,,,,,,,,
-250,-200,-200,-200,-200,-200,-200,-200,-200,-200,-200,-200,-200,-200,-200,-200,-200,-200,-200,-200,-200,-200,-200,-200,-200,-200,-200,-200,-200,-200,-200,-200,-200,-200,-200,-200,-200,-200,-250,,,,,,,,,,,,,,,,,,,,,,,,,,,,,,,,,,
-250,-200,-200,-200,-200,-200,-200,-200,-200,-200,-200,-200,-200,-200,-200,-200,-200,-200,-200,-200,-200,-200,-200,-200,-200,-200,-200,-200,-200,-200,-200,-200,-200,-200,-200,-200,-200,-200,-250,,,,,,,,,,,,,,,,,,,,,,,,,,,,,,,,,,
-250,-200,-200,-200,-200,-200,-200,-200,-200,-200,-200,-200,-200,-200,-200,-200,-200,-200,-200,-200,-200,-200,-200,-200,-200,-200,-200,-200,-200,-200,-200,-200,-200,-200,-200,-200,-200,-200,-250,,,,,,,,,,,,,,,,,,,,,,,,,,,,,,,,,,
-250,-200,-200,-200,-200,-200,-200,-200,-200,-200,-200,-200,-200,-200,-200,-200,-200,-200,-200,-200,-200,-200,-200,-200,-200,-200,-200,-200,-200,-200,-200,-200,-200,-200,-200,-200,-200,-200,-250,,,,,,,,,,,,,,,,,,,,,,,,,,,,,,,,,,
-250,-200,-200,-200,-200,-200,-200,-200,-200,-200,-200,-200,-200,-200,-200,-200,-200,-200,-200,-200,-200,-200,-200,-200,-200,-200,-200,-200,-200,-200,-200,-200,-200,-200,-200,-200,-200,-200,-250,,,,,,,,,,,,,,,,,,,,,,,,,,,,,,,,,,
-250,-200,-200,-200,-200,-200,-200,-200,-200,-200,-200,-200,-200,-200,-200,-200,-200,-200,-200,-200,-200,-200,-200,-200,-200,-200,-200,-200,-200,-200,-200,-200,-200,-200,-200,-200,-200,-200,-250,,,,,,,,,,,,,,,,,,,,,,,,,,,,,,,,,,
-250,-200,-200,-200,-200,-200,-200,-200,-200,-200,-200,-200,-200,-200,-200,-200,-200,-200,-200,-200,-200,-200,-200,-200,-200,-200,-200,-200,-200,-200,-200,-200,-200,-200,-200,-200,-200,-200,-250,,,,,,,,,,,,,,,,,,,,,,,,,,,,,,,,,,
-250,-200,-200,-200,-200,-200,-200,-200,-200,-200,-200,-200,-200,-200,-200,-200,-200,-200,-200,-200,-200,-200,-200,-200,-200,-200,-200,-200,-200,-200,-200,-200,-200,-200,-200,-200,-200,-200,-250,,,,,,,,,,,,,,,,,,,,,,,,,,,,,,,,,,
-250,-200,-200,-200,-200,-200,-200,-200,-200,-200,-200,-200,-200,-200,-200,-200,-200,-200,-200,-200,-200,-200,-200,-200,-200,-200,-200,-200,-200,-200,-200,-200,-200,-200,-200,-200,-200,-200,-250,,,,,,,,,,,,,,,,,,,,,,,,,,,,,,,,,,
-250,-200,-200,-200,-200,-200,-200,-200,-200,-200,-200,-200,-200,-200,-200,-200,-200,-200,-200,-200,-200,-200,-200,-200,-200,-200,-200,-200,-200,-200,-200,-200,-200,-200,-200,-200,-200,-200,-250,,,,,,,,,,,,,,,,,,,,,,,,,,,,,,,,,,
-250,-200,-200,-200,-200,-200,-200,-200,-200,-200,-200,-200,-200,-200,-200,-200,-200,-200,-200,-200,-200,-200,-200,-200,-200,-200,-200,-200,-200,-200,-200,-200,-200,-200,-200,-200,-200,-200,-250,,,,,,,,,,,,,,,,,,,,,,,,,,,,,,,,,,
-250,-200,-200,-200,-200,-200,-200,-200,-200,-200,-200,-200,-200,-200,-200,-200,-200,-200,-200,-200,-200,-200,-200,-200,-200,-200,-200,-200,-200,-200,-200,-200,-200,-200,-200,-200,-200,-200,-250,,,,,,,,,,,,,,,,,,,,,,,,,,,,,,,,,,
-250,-200,-200,-200,-200,-200,-200,-200,-200,-200,-200,-200,-200,-200,-200,-200,-200,-200,-200,-200,-200,-200,-200,-200,-200,-200,-200,-200,-200,-200,-200,-200,-200,-200,-200,-200,-200,-200,-250,,,,,,,,,,,,,,,,,,,,,,,,,,,,,,,,,,
-250,-200,-200,-200,-200,-200,-200,-200,-200,-200,-200,-200,-200,-200,-200,-200,-200,-200,-200,-200,-200,-200,-200,-200,-200,-200,-200,-200,-200,-200,-200,-200,-200,-200,-200,-200,-200,-200,-250,,,,,,,,,,,,,,,,,,,,,,,,,,,,,,,,,,
-250,-200,-200,-200,-200,-200,-200,-200,-200,-200,-200,-200,-200,-200,-200,-200,-200,-200,-200,-200,-200,-200,-200,-200,-200,-200,-200,-200,-200,-200,-200,-200,-200,-200,-200,-200,-200,-200,-250,,,,,,,,,,,,,,,,,,,,,,,,,,,,,,,,,,
-250,-200,-200,-200,-200,-200,-200,-200,-200,-200,-200,-200,-200,-200,-200,-200,-200,-200,-200,-200,-200,-200,-200,-200,-200,-200,-200,-200,-200,-200,-200,-200,-200,-200,-200,-200,-200,-200,-250,,,,,,,,,,,,,,,,,,,,,,,,,,,,,,,,,,
-250,-200,-200,-200,-200,-200,-200,-200,-200,-200,-200,-200,-200,-200,-200,-200,-200,-200,-200,-200,-200,-200,-200,-200,-200,-200,-200,-200,-200,-200,-200,-200,-200,-200,-200,-200,-200,-200,-250,,,,,,,,,,,,,,,,,,,,,,,,,,,,,,,,,,
-250,-200,-200,-200,-200,-200,-200,-200,-200,-200,-200,-200,-200,-200,-200,-200,-200,-200,-200,-200,-200,-200,-200,-200,-200,-200,-200,-200,-200,-200,-200,-200,-200,-200,-200,-200,-200,-200,-250,,,,,,,,,,,,,,,,,,,,,,,,,,,,,,,,,,
-250,-200,-200,-200,-200,-200,-200,-200,-200,-200,-200,-200,-200,-200,-200,-200,-200,-200,-200,-200,-200,-200,-200,-200,-200,-200,-200,-200,-200,-200,-200,-200,-200,-200,-200,-200,-200,-200,-250,,,,,,,,,,,,,,,,,,,,,,,,,,,,,,,,,,
-250,-200,-200,-200,-200,-200,-200,-200,-200,-200,-200,-200,-200,-200,-200,-200,-200,-200,-200,-200,-200,-200,-200,-200,-200,-200,-200,-200,-200,-200,-200,-200,-200,-200,-200,-200,-200,-200,-250,,,,,,,,,,,,,,,,,,,,,,,,,,,,,,,,,,
#,raw_col_delta_max,,,,,,,,,,,,,,,,,,,,,,,,,,,,,,,,,,,,,,,,,,,,,,,,,,,,,,,,,,,,,,,,,,,,,,,
250,200,200,200,200,200,200,200,200,200,200,200,200,200,200,200,200,200,200,200,200,200,200,200,200,200,200,200,200,200,200,200,200,200,200,500,500,500,,,,,,,,,,,,,,,,,,,,,,,,,,,,,,,,,,,
250,200,200,200,200,200,200,200,200,200,200,200,200,200,200,200,200,200,200,200,200,200,200,200,200,200,200,200,200,200,200,200,200,200,200,500,500,500,,,,,,,,,,,,,,,,,,,,,,,,,,,,,,,,,,,
250,200,200,200,200,200,200,200,200,200,200,200,200,200,200,200,200,200,200,200,200,200,200,200,200,200,200,200,200,200,200,200,200,200,200,500,500,500,,,,,,,,,,,,,,,,,,,,,,,,,,,,,,,,,,,
250,200,200,200,200,200,200,200,200,200,200,200,200,200,200,200,200,200,200,200,200,200,200,200,200,200,200,200,200,200,200,200,200,200,200,200,200,350,,,,,,,,,,,,,,,,,,,,,,,,,,,,,,,,,,,
250,200,200,200,200,200,200,200,200,200,200,200,200,200,200,200,200,200,200,200,200,200,200,200,200,200,200,200,200,200,200,200,200,200,200,200,200,350,,,,,,,,,,,,,,,,,,,,,,,,,,,,,,,,,,,
250,200,200,200,200,200,200,200,200,200,200,200,200,200,200,200,200,200,200,200,200,200,200,200,200,200,200,200,200,200,200,200,200,200,200,200,200,350,,,,,,,,,,,,,,,,,,,,,,,,,,,,,,,,,,,
250,200,200,200,200,200,200,200,200,200,200,200,200,200,200,200,200,200,200,200,200,200,200,200,200,200,200,200,200,200,200,200,200,200,200,200,200,350,,,,,,,,,,,,,,,,,,,,,,,,,,,,,,,,,,,
250,200,200,200,200,200,200,200,200,200,200,200,200,200,200,200,200,200,200,200,200,200,200,200,200,200,200,200,200,200,200,200,200,200,200,200,200,350,,,,,,,,,,,,,,,,,,,,,,,,,,,,,,,,,,,
250,200,200,200,200,200,200,200,200,200,200,200,200,200,200,200,200,200,200,200,200,200,200,200,200,200,200,200,200,200,200,200,200,200,200,200,200,350,,,,,,,,,,,,,,,,,,,,,,,,,,,,,,,,,,,
250,200,200,200,200,200,200,200,200,200,200,200,200,200,200,200,200,200,200,200,200,200,200,200,200,200,200,200,200,200,200,200,200,200,200,200,200,350,,,,,,,,,,,,,,,,,,,,,,,,,,,,,,,,,,,
250,200,200,200,200,200,200,200,200,200,200,200,200,200,200,200,200,200,200,200,200,200,200,200,200,200,200,200,200,200,200,200,200,200,200,200,200,350,,,,,,,,,,,,,,,,,,,,,,,,,,,,,,,,,,,
250,200,200,200,200,200,200,200,200,200,200,200,200,200,200,200,200,200,200,200,200,200,200,200,200,200,200,200,200,200,200,200,200,200,200,200,200,350,,,,,,,,,,,,,,,,,,,,,,,,,,,,,,,,,,,
250,200,200,200,200,200,200,200,200,200,200,200,200,200,200,200,200,200,200,200,200,200,200,200,200,200,200,200,200,200,200,200,200,200,200,200,200,350,,,,,,,,,,,,,,,,,,,,,,,,,,,,,,,,,,,
250,200,200,200,200,200,200,200,200,200,200,200,200,200,200,200,200,200,200,200,200,200,200,200,200,200,200,200,200,200,200,200,200,200,200,200,200,350,,,,,,,,,,,,,,,,,,,,,,,,,,,,,,,,,,,
250,200,200,200,200,200,200,200,200,200,200,200,200,200,200,200,200,200,200,200,200,200,200,200,200,200,200,200,200,200,200,200,200,200,200,200,200,350,,,,,,,,,,,,,,,,,,,,,,,,,,,,,,,,,,,
250,200,200,200,200,200,200,200,200,200,200,200,200,200,200,200,200,200,200,200,200,200,200,200,200,200,200,200,200,200,200,200,200,200,200,200,200,350,,,,,,,,,,,,,,,,,,,,,,,,,,,,,,,,,,,
250,200,200,200,200,200,200,200,200,200,200,200,200,200,200,200,200,200,200,200,200,200,200,200,200,200,200,200,200,200,200,200,200,200,200,200,200,350,,,,,,,,,,,,,,,,,,,,,,,,,,,,,,,,,,,
250,200,200,200,200,200,200,200,200,200,200,200,200,200,200,200,200,200,200,200,200,200,200,200,200,200,200,200,200,200,200,200,200,200,200,200,200,350,,,,,,,,,,,,,,,,,,,,,,,,,,,,,,,,,,,
250,200,200,200,200,200,200,200,200,200,200,200,200,200,200,200,200,200,200,200,200,200,200,200,200,200,200,200,200,200,200,200,200,200,200,200,200,350,,,,,,,,,,,,,,,,,,,,,,,,,,,,,,,,,,,
250,200,200,200,200,200,200,200,200,200,200,200,200,200,200,200,200,200,200,200,200,200,200,200,200,200,200,200,200,200,200,200,200,200,200,200,200,350,,,,,,,,,,,,,,,,,,,,,,,,,,,,,,,,,,,
250,200,200,200,200,200,200,200,200,200,200,200,200,200,200,200,200,200,200,200,200,200,200,200,200,200,200,200,200,200,200,200,200,200,200,200,200,350,,,,,,,,,,,,,,,,,,,,,,,,,,,,,,,,,,,
250,200,200,200,200,200,200,200,200,200,200,200,200,200,200,200,200,200,200,200,200,200,200,200,200,200,200,200,200,200,200,200,200,200,200,200,200,350,,,,,,,,,,,,,,,,,,,,,,,,,,,,,,,,,,,
250,200,200,200,200,200,200,200,200,200,200,200,200,200,200,200,200,200,200,200,200,200,200,200,200,200,200,200,200,200,200,200,200,200,200,200,200,350,,,,,,,,,,,,,,,,,,,,,,,,,,,,,,,,,,,
250,200,200,200,200,200,200,200,200,200,200,200,200,200,200,200,200,200,200,200,200,200,200,200,200,200,200,200,200,200,200,200,200,200,200,200,200,350,,,,,,,,,,,,,,,,,,,,,,,,,,,,,,,,,,,
250,200,200,200,200,200,200,200,200,200,200,200,200,200,200,200,200,200,200,200,200,200,200,200,200,200,200,200,200,200,200,200,200,200,200,200,200,350,,,,,,,,,,,,,,,,,,,,,,,,,,,,,,,,,,,
250,200,200,200,200,200,200,200,200,200,200,200,200,200,200,200,200,200,200,200,200,200,200,200,200,200,200,200,200,200,200,200,200,200,200,200,200,350,,,,,,,,,,,,,,,,,,,,,,,,,,,,,,,,,,,
250,200,200,200,200,200,200,200,200,200,200,200,200,200,200,200,200,200,200,200,200,200,200,200,200,200,200,200,200,200,200,200,200,200,200,200,200,350,,,,,,,,,,,,,,,,,,,,,,,,,,,,,,,,,,,
250,200,200,200,200,200,200,200,200,200,200,200,200,200,200,200,200,200,200,200,200,200,200,200,200,200,200,200,200,200,200,200,200,200,200,200,200,350,,,,,,,,,,,,,,,,,,,,,,,,,,,,,,,,,,,
250,200,200,200,200,200,200,200,200,200,200,200,200,200,200,200,200,200,200,200,200,200,200,200,200,200,200,200,200,200,200,200,200,200,200,200,200,350,,,,,,,,,,,,,,,,,,,,,,,,,,,,,,,,,,,
250,200,200,200,200,200,200,200,200,200,200,200,200,200,200,200,200,200,200,200,200,200,200,200,200,200,200,200,200,200,200,200,200,200,200,200,200,350,,,,,,,,,,,,,,,,,,,,,,,,,,,,,,,,,,,
500,500,200,200,200,200,200,200,200,200,200,200,200,200,200,200,200,200,200,200,200,200,200,200,200,200,200,200,200,200,200,200,200,200,200,500,500,500,,,,,,,,,,,,,,,,,,,,,,,,,,,,,,,,,,,
500,500,200,200,200,200,200,200,200,200,200,200,200,200,200,200,200,200,200,200,200,200,200,200,200,200,200,200,200,200,200,200,200,200,200,500,500,500,,,,,,,,,,,,,,,,,,,,,,,,,,,,,,,,,,,
500,500,350,350,350,350,350,350,350,350,350,350,350,350,350,350,350,350,350,350,350,350,350,350,350,350,350,350,350,350,350,350,350,350,350,500,500,500,,,,,,,,,,,,,,,,,,,,,,,,,,,,,,,,,,,
500,500,350,350,350,350,350,350,350,350,350,350,350,350,350,350,350,350,350,350,350,350,350,350,350,350,350,350,350,350,350,350,350,350,350,500,500,500,,,,,,,,,,,,,,,,,,,,,,,,,,,,,,,,,,,
#,raw_col_delta_min,,,,,,,,,,,,,,,,,,,,,,,,,,,,,,,,,,,,,,,,,,,,,,,,,,,,,,,,,,,,,,,,,,,,,,,
-500,-500,-500,-350,-350,-350,-350,-350,-350,-350,-350,-350,-350,-350,-350,-350,-350,-350,-350,-350,-350,-350,-350,-350,-350,-350,-350,-350,-350,-350,-350,-350,-350,-350,-350,-500,-500,-500,,,,,,,,,,,,,,,,,,,,,,,,,,,,,,,,,,,
-500,-500,-500,-350,-350,-350,-350,-350,-350,-350,-350,-350,-350,-350,-350,-350,-350,-350,-350,-350,-350,-350,-350,-350,-350,-350,-350,-350,-350,-350,-350,-350,-350,-350,-350,-500,-500,-500,,,,,,,,,,,,,,,,,,,,,,,,,,,,,,,,,,,
-500,-500,-500,-350,-350,-350,-350,-350,-350,-350,-350,-350,-350,-350,-350,-350,-350,-350,-350,-350,-350,-350,-350,-350,-350,-350,-350,-350,-350,-350,-350,-350,-350,-350,-350,-500,-500,-500,,,,,,,,,,,,,,,,,,,,,,,,,,,,,,,,,,,
-350,-200,-200,-200,-200,-200,-200,-200,-200,-200,-200,-200,-200,-200,-200,-200,-200,-200,-200,-200,-200,-200,-200,-200,-200,-200,-200,-200,-200,-200,-200,-200,-200,-200,-200,-200,-200,-250,,,,,,,,,,,,,,,,,,,,,,,,,,,,,,,,,,,
-350,-200,-200,-200,-200,-200,-200,-200,-200,-200,-200,-200,-200,-200,-200,-200,-200,-200,-200,-200,-200,-200,-200,-200,-200,-200,-200,-200,-200,-200,-200,-200,-200,-200,-200,-200,-200,-250,,,,,,,,,,,,,,,,,,,,,,,,,,,,,,,,,,,
-350,-200,-200,-200,-200,-200,-200,-200,-200,-200,-200,-200,-200,-200,-200,-200,-200,-200,-200,-200,-200,-200,-200,-200,-200,-200,-200,-200,-200,-200,-200,-200,-200,-200,-200,-200,-200,-250,,,,,,,,,,,,,,,,,,,,,,,,,,,,,,,,,,,
-350,-200,-200,-200,-200,-200,-200,-200,-200,-200,-200,-200,-200,-200,-200,-200,-200,-200,-200,-200,-200,-200,-200,-200,-200,-200,-200,-200,-200,-200,-200,-200,-200,-200,-200,-200,-200,-250,,,,,,,,,,,,,,,,,,,,,,,,,,,,,,,,,,,
-350,-200,-200,-200,-200,-200,-200,-200,-200,-200,-200,-200,-200,-200,-200,-200,-200,-200,-200,-200,-200,-200,-200,-200,-200,-200,-200,-200,-200,-200,-200,-200,-200,-200,-200,-200,-200,-250,,,,,,,,,,,,,,,,,,,,,,,,,,,,,,,,,,,
-350,-200,-200,-200,-200,-200,-200,-200,-200,-200,-200,-200,-200,-200,-200,-200,-200,-200,-200,-200,-200,-200,-200,-200,-200,-200,-200,-200,-200,-200,-200,-200,-200,-200,-200,-200,-200,-250,,,,,,,,,,,,,,,,,,,,,,,,,,,,,,,,,,,
-350,-200,-200,-200,-200,-200,-200,-200,-200,-200,-200,-200,-200,-200,-200,-200,-200,-200,-200,-200,-200,-200,-200,-200,-200,-200,-200,-200,-200,-200,-200,-200,-200,-200,-200,-200,-200,-250,,,,,,,,,,,,,,,,,,,,,,,,,,,,,,,,,,,
-350,-200,-200,-200,-200,-200,-200,-200,-200,-200,-200,-200,-200,-200,-200,-200,-200,-200,-200,-200,-200,-200,-200,-200,-200,-200,-200,-200,-200,-200,-200,-200,-200,-200,-200,-200,-200,-250,,,,,,,,,,,,,,,,,,,,,,,,,,,,,,,,,,,
-350,-200,-200,-200,-200,-200,-200,-200,-200,-200,-200,-200,-200,-200,-200,-200,-200,-200,-200,-200,-200,-200,-200,-200,-200,-200,-200,-200,-200,-200,-200,-200,-200,-200,-200,-200,-200,-250,,,,,,,,,,,,,,,,,,,,,,,,,,,,,,,,,,,
-350,-200,-200,-200,-200,-200,-200,-200,-200,-200,-200,-200,-200,-200,-200,-200,-200,-200,-200,-200,-200,-200,-200,-200,-200,-200,-200,-200,-200,-200,-200,-200,-200,-200,-200,-200,-200,-250,,,,,,,,,,,,,,,,,,,,,,,,,,,,,,,,,,,
-350,-200,-200,-200,-200,-200,-200,-200,-200,-200,-200,-200,-200,-200,-200,-200,-200,-200,-200,-200,-200,-200,-200,-200,-200,-200,-200,-200,-200,-200,-200,-200,-200,-200,-200,-200,-200,-250,,,,,,,,,,,,,,,,,,,,,,,,,,,,,,,,,,,
-350,-200,-200,-200,-200,-200,-200,-200,-200,-200,-200,-200,-200,-200,-200,-200,-200,-200,-200,-200,-200,-200,-200,-200,-200,-200,-200,-200,-200,-200,-200,-200,-200,-200,-200,-200,-200,-250,,,,,,,,,,,,,,,,,,,,,,,,,,,,,,,,,,,
-350,-200,-200,-200,-200,-200,-200,-200,-200,-200,-200,-200,-200,-200,-200,-200,-200,-200,-200,-200,-200,-200,-200,-200,-200,-200,-200,-200,-200,-200,-200,-200,-200,-200,-200,-200,-200,-250,,,,,,,,,,,,,,,,,,,,,,,,,,,,,,,,,,,
-350,-200,-200,-200,-200,-200,-200,-200,-200,-200,-200,-200,-200,-200,-200,-200,-200,-200,-200,-200,-200,-200,-200,-200,-200,-200,-200,-200,-200,-200,-200,-200,-200,-200,-200,-200,-200,-250,,,,,,,,,,,,,,,,,,,,,,,,,,,,,,,,,,,
-350,-200,-200,-200,-200,-200,-200,-200,-200,-200,-200,-200,-200,-200,-200,-200,-200,-200,-200,-200,-200,-200,-200,-200,-200,-200,-200,-200,-200,-200,-200,-200,-200,-200,-200,-200,-200,-250,,,,,,,,,,,,,,,,,,,,,,,,,,,,,,,,,,,
-350,-200,-200,-200,-200,-200,-200,-200,-200,-200,-200,-200,-200,-200,-200,-200,-200,-200,-200,-200,-200,-200,-200,-200,-200,-200,-200,-200,-200,-200,-200,-200,-200,-200,-200,-200,-200,-250,,,,,,,,,,,,,,,,,,,,,,,,,,,,,,,,,,,
-350,-200,-200,-200,-200,-200,-200,-200,-200,-200,-200,-200,-200,-200,-200,-200,-200,-200,-200,-200,-200,-200,-200,-200,-200,-200,-200,-200,-200,-200,-200,-200,-200,-200,-200,-200,-200,-250,,,,,,,,,,,,,,,,,,,,,,,,,,,,,,,,,,,
-350,-200,-200,-200,-200,-200,-200,-200,-200,-200,-200,-200,-200,-200,-200,-200,-200,-200,-200,-200,-200,-200,-200,-200,-200,-200,-200,-200,-200,-200,-200,-200,-200,-200,-200,-200,-200,-250,,,,,,,,,,,,,,,,,,,,,,,,,,,,,,,,,,,
-350,-200,-200,-200,-200,-200,-200,-200,-200,-200,-200,-200,-200,-200,-200,-200,-200,-200,-200,-200,-200,-200,-200,-200,-200,-200,-200,-200,-200,-200,-200,-200,-200,-200,-200,-200,-200,-250,,,,,,,,,,,,,,,,,,,,,,,,,,,,,,,,,,,
-350,-200,-200,-200,-200,-200,-200,-200,-200,-200,-200,-200,-200,-200,-200,-200,-200,-200,-200,-200,-200,-200,-200,-200,-200,-200,-200,-200,-200,-200,-200,-200,-200,-200,-200,-200,-200,-250,,,,,,,,,,,,,,,,,,,,,,,,,,,,,,,,,,,
-350,-200,-200,-200,-200,-200,-200,-200,-200,-200,-200,-200,-200,-200,-200,-200,-200,-200,-200,-200,-200,-200,-200,-200,-200,-200,-200,-200,-200,-200,-200,-200,-200,-200,-200,-200,-200,-250,,,,,,,,,,,,,,,,,,,,,,,,,,,,,,,,,,,
-350,-200,-200,-200,-200,-200,-200,-200,-200,-200,-200,-200,-200,-200,-200,-200,-200,-200,-200,-200,-200,-200,-200,-200,-200,-200,-200,-200,-200,-200,-200,-200,-200,-200,-200,-200,-200,-250,,,,,,,,,,,,,,,,,,,,,,,,,,,,,,,,,,,
-350,-200,-200,-200,-200,-200,-200,-200,-200,-200,-200,-200,-200,-200,-200,-200,-200,-200,-200,-200,-200,-200,-200,-200,-200,-200,-200,-200,-200,-200,-200,-200,-200,-200,-200,-200,-200,-250,,,,,,,,,,,,,,,,,,,,,,,,,,,,,,,,,,,
-350,-200,-200,-200,-200,-200,-200,-200,-200,-200,-200,-200,-200,-200,-200,-200,-200,-200,-200,-200,-200,-200,-200,-200,-200,-200,-200,-200,-200,-200,-200,-200,-200,-200,-200,-200,-200,-250,,,,,,,,,,,,,,,,,,,,,,,,,,,,,,,,,,,
-350,-200,-200,-200,-200,-200,-200,-200,-200,-200,-200,-200,-200,-200,-200,-200,-200,-200,-200,-200,-200,-200,-200,-200,-200,-200,-200,-200,-200,-200,-200,-200,-200,-200,-200,-200,-200,-250,,,,,,,,,,,,,,,,,,,,,,,,,,,,,,,,,,,
-350,-200,-200,-200,-200,-200,-200,-200,-200,-200,-200,-200,-200,-200,-200,-200,-200,-200,-200,-200,-200,-200,-200,-200,-200,-200,-200,-200,-200,-200,-200,-200,-200,-200,-200,-200,-200,-250,,,,,,,,,,,,,,,,,,,,,,,,,,,,,,,,,,,
-350,-200,-200,-200,-200,-200,-200,-200,-200,-200,-200,-200,-200,-200,-200,-200,-200,-200,-200,-200,-200,-200,-200,-200,-200,-200,-200,-200,-200,-200,-200,-200,-200,-200,-200,-200,-200,-250,,,,,,,,,,,,,,,,,,,,,,,,,,,,,,,,,,,
-350,-200,-200,-200,-200,-200,-200,-200,-200,-200,-200,-200,-200,-200,-200,-200,-200,-200,-200,-200,-200,-200,-200,-200,-200,-200,-200,-200,-200,-200,-200,-200,-200,-200,-200,-200,-200,-250,,,,,,,,,,,,,,,,,,,,,,,,,,,,,,,,,,,
-500,-500,-500,-200,-200,-200,-200,-200,-200,-200,-200,-200,-200,-200,-200,-200,-200,-200,-200,-200,-200,-200,-200,-200,-200,-200,-200,-200,-200,-200,-200,-200,-200,-200,-200,-500,-500,-500,,,,,,,,,,,,,,,,,,,,,,,,,,,,,,,,,,,
-500,-500,-500,-350,-350,-350,-350,-350,-350,-350,-350,-350,-350,-350,-350,-350,-350,-350,-350,-350,-350,-350,-350,-350,-350,-350,-350,-350,-350,-350,-350,-350,-350,-350,-350,-500,-500,-500,,,,,,,,,,,,,,,,,,,,,,,,,,,,,,,,,,,
-500,-500,-500,-350,-350,-350,-350,-350,-350,-350,-350,-350,-350,-350,-350,-350,-350,-350,-350,-350,-350,-350,-350,-350,-350,-350,-350,-350,-350,-350,-350,-350,-350,-350,-350,-500,-500,-500,,,,,,,,,,,,,,,,,,,,,,,,,,,,,,,,,,,
#,line_max,,,,,,,,,,,,,,,,,,,,,,,,,,,,,,,,,,,,,,,,,,,,,,,,,,,,,,,,,,,,,,,,,,,,,,,
42659,42729,42734,42791,42807,42814,42809,42775,42795,42807,42760,42734,42770,42832,42875,42843,42759,42790,42783,42778,42744,42770,42815,42830,42793,42803,42820,42812,42817,42768,42789,42899,42884,42824,42844,42852,42869,42868,42673,42444,42879,42917,42969,43012,43030,42918,42813,42880,42969,42908,42828,42761,42821,42984,42870,42777,42765,43041,42977,42942,42907,43081,43038,42856,42760,42894,42874,42953,42793,42940,43041,43059,42658
#,line_min,,,,,,,,,,,,,,,,,,,,,,,,,,,,,,,,,,,,,,,,,,,,,,,,,,,,,,,,,,,,,,,,,,,,,,,
22970,23007,23010,23040,23049,23053,23050,23032,23043,23049,23024,23010,23029,23063,23086,23068,23023,23040,23036,23034,23015,23029,23053,23062,23041,23047,23056,23052,23055,23028,23039,23098,23090,23058,23069,23073,23083,23082,22977,22854,23088,23108,23136,23159,23169,23109,23053,23089,23137,23103,23061,23024,23057,23144,23083,23033,23027,23175,23141,23122,23103,23197,23173,23075,23024,23096,23085,23128,23042,23121,23175,23185,22969
