0 0 0 0 
0 0 0 0 
0 0 0 0 
0 0 0 0 
0 0 0 0 
0 0 0 0 
0 0 0 0 
0 0 0 0 
0 0 0 0 
0 0 0 0 
0.0104796420782804 1.31644937937381e-05 -7.31978389012511e-09 -6.1771334713967e-09 
0.0124681936576962 1.35351556309615e-05 1.68715445170164e-07 1.28576004954084e-07 
0.014036382548511 1.25457418107544e-05 2.45636151419149e-08 3.36881744722461e-09 
0.015525403432548 1.13604983198456e-05 -1.62260533898007e-07 -5.20572633888605e-08 
0.0167925916612148 9.55323230300564e-06 1.13430154158323e-07 -6.55114718028926e-08 
0.0177806597203016 7.56799227019656e-06 -9.93637598867281e-08 1.66133872880891e-07 
0.0184977110475302 5.86535497859586e-06 5.37795514787831e-08 -1.36126843131024e-07 
0.0189417004585266 4.51375854026992e-06 -1.69113487658024e-08 3.84301657163633e-08 
0.0191075392067432 3.75227773474762e-06 -1.2071653399115e-10 -8.33190672011597e-09 
0.0188999194651842 3.37837786901218e-06 -2.36212738258246e-09 5.30004096166437e-10 
0.0184173509478569 3.09479946736246e-06 -1.79937187372303e-09 -5.09574271667645e-10 
0.0176845267415047 2.54729775406304e-06 -1.97615257491179e-09 -1.23673382645961e-09 
0.0167889520525932 1.7236100120499e-06 -9.02117935908109e-10 -6.16631190553107e-10 
0.0157797783613205 7.18576870895049e-07 -1.32718813716792e-09 -5.9730520529655e-10 
0.0147477630525827 -3.42729862268243e-07 9.40944100413788e-10 8.74716798993092e-10 
0.0137280495837331 -1.26307986647589e-06 1.56253315841681e-10 6.69870825475982e-10 
0.0127762667834759 -1.84997531960107e-06 -1.68420041801731e-10 8.99848973112682e-10 
0.0118749123066664 -2.13032058127283e-06 1.48488610296482e-09 1.50902190743096e-09 
0.0110398074612021 -1.94388258023537e-06 9.31129173764589e-10 1.12862152956694e-09 
0.0102400789037347 -1.92129891729564e-06 7.111897182277e-10 1.52991216917364e-10 
0.00949407089501619 -1.84878547315748e-06 -4.46340575610549e-10 -3.40066828863339e-11 
0.00880371686071157 -1.85550948117452e-06 4.65151112072348e-10 1.40251155134052e-09 
0.00818571820855141 -1.97659596778976e-06 4.47161724315137e-10 1.2065987098353e-09 
0.00759084662422538 -2.55853251474036e-06 1.12126463669426e-09 8.32994562216527e-10 
0.00701031601056457 -2.89374747808324e-06 1.79290571278301e-09 1.83329273983901e-09 
0.00640597147867084 -3.2273997021548e-06 9.746952134293e-10 1.49690293493876e-09 
0.00585069973021746 -3.29103158946964e-06 1.14141351925667e-09 1.6038279593289e-09 
0.00534635689109564 -3.2487687349203e-06 1.07449449338048e-09 1.95893101739841e-09 
0.0049119177274406 -2.97168685392535e-06 1.73202208131329e-09 1.8584273009381e-09 
0.00460337614640594 -2.61163927461894e-06 1.4720314966965e-09 1.57226176522585e-09 
0.00440466124564409 -2.28295107262966e-06 8.77613370864339e-10 1.25902865910632e-09 
0.00424551218748093 -2.25137114284735e-06 8.92905638316677e-10 9.68580438076572e-10 
0.00412737345322967 -2.26230872613087e-06 6.90305090866872e-10 1.31258182101135e-09 
0.00405665533617139 -2.35828815675632e-06 1.05463404675987e-09 1.10842202083461e-09 
0.00404726900160313 -2.53088683166425e-06 7.99046273591841e-10 1.11736697672171e-09 
0.00411016773432493 -2.67188920588524e-06 8.90283735621722e-10 1.12348286229746e-09 
0.00425667222589254 -2.82135852103238e-06 9.57092405329263e-10 1.24429166969975e-09 
0.00445516221225262 -3.08595735987183e-06 9.32445121115677e-10 1.12292375398226e-09 
0.00468855630606413 -3.26089525515272e-06 1.36537448014451e-09 1.51577406182213e-09 
0.00495761912316084 -3.48532876159879e-06 1.65649916006316e-09 1.64942504099486e-09 
0.00521723600104451 -3.63090612154338e-06 9.41686839617262e-10 2.11027284535703e-09 
0.00544153060764074 -3.71885107597336e-06 1.50009105137627e-09 1.61099344975213e-09 
0.0056385500356555 -3.78563504455087e-06 1.51718992924543e-09 1.85366277882792e-09 
0.0058119548484683 -3.68320979760028e-06 4.41785247273785e-10 1.72947500765019e-09 
0.00592704582959414 -3.59424348062021e-06 1.24056298567154e-09 1.74835756983072e-09 
0.00599346542730927 -3.59965815732721e-06 1.43715594980165e-09 1.74578773659562e-09 
0.00604177080094814 -3.53195423485886e-06 1.27159094365226e-09 1.76291403697348e-09 
0.00607148325070739 -3.43308443007118e-06 1.41520017926666e-09 1.62326752040087e-09 
0.00607671635225415 -3.54364897248161e-06 1.03461528233595e-09 1.55027035653177e-09 
0.00608808407559991 -3.56662985723233e-06 8.09297684423171e-10 1.26583277193504e-09 
0.00613548653200269 -3.629393859228e-06 1.12065479118684e-09 1.79591996829487e-09 
0.00619795406237245 -3.72871022591426e-06 1.16643139591588e-09 2.06465378127518e-09 
0.00628353655338287 -3.84413351639523e-06 1.3624794625855e-09 1.78362502545326e-09 
0.0064199329353869 -3.95958386434359e-06 1.87288984321299e-09 1.98641370019459e-09 
0.00661881500855088 -3.93326581615838e-06 1.60207325183848e-09 1.67073332946188e-09 
0.00688262935727835 -3.81232916879526e-06 1.77257919453666e-09 1.29505439705468e-09 
0.0072225178591907 -3.81642621505307e-06 1.57752477747408e-09 2.20042428722422e-09 
0.00763561297208071 -3.558702474038e-06 1.42806377834148e-09 2.21984985948609e-09 
0.00809260364621878 -3.28681812789e-06 1.76774528348744e-09 1.85660631313311e-09 
0.00857811141759157 -3.15180477628019e-06 1.80886150502602e-09 9.71040581276839e-10 
0.00906551256775856 -3.04611035062408e-06 7.67686580971372e-10 1.42209655162873e-09 
0.00952206458896399 -2.91133596874715e-06 1.38327127530147e-09 2.08715444927066e-09 
0.00990821607410908 -3.10404971060052e-06 1.55288870651304e-09 1.56855206601136e-09 
0.010204104706645 -3.50288087247463e-06 6.51352582980991e-10 1.09389353131206e-09 
0.0102839935570955 -3.78748745788471e-06 1.78770165337738e-09 1.51145473914482e-09 
0.0101992236450315 -3.94655444324599e-06 1.36019162599865e-09 2.07979256039437e-09 
0.00996082276105881 -3.93504114981624e-06 1.63895774729639e-09 1.94908267303617e-09 
0.00957334600389004 -3.81189124709636e-06 1.22059840013122e-09 1.93992133468157e-09 
0.00912575144320726 -3.40838164447632e-06 9.85065848335687e-11 9.64789137469779e-10 
0.00871564913541079 -3.1911299629428e-06 9.8237229462228e-10 7.82957532141637e-10 
0.00837969034910202 -3.2334792194888e-06 1.80832693263966e-09 1.43400147312178e-09 
0.00809447839856148 -3.41528516401013e-06 1.09258257996458e-09 1.72109293483658e-09 
0.00792366545647383 -3.40958195010899e-06 1.00699015792571e-09 1.07962250250893e-09 
0.00781368371099234 -3.46468596035265e-06 1.52850532231241e-09 1.76743175650529e-09 
0.00783020630478859 -3.67141615242872e-06 7.34084959486125e-10 1.61692481626119e-09 
0.00787675753235817 -3.496784984236e-06 7.51802120557699e-10 1.08857467484569e-09 
0.00796907860785723 -3.39824214279361e-06 1.15521614496572e-09 1.59145474576405e-09 
0.00812895316630602 -3.61563525075326e-06 1.29153143735294e-09 1.32491229098974e-09 
0.00831007678061724 -3.60687431566475e-06 1.35706990089801e-09 1.69627412116569e-09 
0.00851790327578783 -3.55609290636494e-06 1.92798288445317e-09 1.62665314551447e-09 
0.00872936379164457 -3.51746871274372e-06 1.21857857138252e-09 1.05915110015786e-09 
0.00901444256305695 -3.31610112880298e-06 1.75859427020697e-09 2.00864858079797e-09 
0.00938625633716583 -2.95395511784591e-06 1.02565278492506e-09 6.16060147340391e-10 
0.0100061073899269 -2.66819802163809e-06 9.812325396652e-10 1.02172892368912e-09 
0.01116534601897 -2.41463203565218e-06 6.14896078499072e-10 1.06895758911207e-09 
0.0135961193591356 -1.88665444511571e-08 7.10545025595088e-11 7.63854923757634e-10 
0.0182124264538288 -4.88388423036668e-09 -1.7697046050813e-09 -4.03008737492883e-10 
0.0262174475938082 1.3292610674398e-08 -6.60155541343244e-10 8.78179334806717e-11 
0.0390780605375767 3.64748461834097e-08 -1.35364375264402e-09 -3.22582671685723e-09 
0.0577773861587048 4.03853528041509e-08 -3.37641470338212e-09 -2.99288427374478e-10 
0.0814236178994179 1.29297646367377e-09 -3.86746545899541e-09 2.5749977705658e-09 
0.107585728168488 -8.11947302281624e-09 7.74591679686409e-09 -9.25039933541427e-10 
0.134284481406212 -5.03438684518187e-09 1.86784210320923e-09 -8.719918120903e-09 
0.159365594387054 -1.99424584934604e-08 -1.54950496877859e-10 9.27302679087916e-09 
0.17924340069294 2.46263948611158e-08 1.0010726275711e-10 -1.06925615028786e-08 
0.193185448646545 7.04952208252507e-08 -6.69424116139794e-09 2.98115176988745e-09 
0.202878549695015 8.65666879690252e-08 1.51400197934137e-10 2.86486034895006e-09 
0.20853465795517 9.30793612496927e-08 -1.06983719661002e-08 -5.99741545315169e-09 
0.211102053523064 8.76127433002694e-08 2.02281724703823e-09 -5.01601915559036e-09 
0.21179111301899 6.63320497551467e-08 -9.05173891396771e-09 -1.10328990388098e-08 
0.21142578125 7.88620945968432e-08 -2.07459063261695e-08 -1.49329135723519e-08 
0.209625899791718 1.06981315184385e-07 -1.18741034782488e-08 -2.30541470358503e-08 
0.20678074657917 7.35593812350999e-08 -2.06567563054705e-08 1.90690112589209e-08 
0.203640624880791 4.71189605377731e-08 2.94667881206578e-08 1.70312866032418e-08 
0.199764221906662 3.08182234221022e-08 8.55751380868242e-09 6.40767394699537e-09 
0.195906177163124 -1.16953731321701e-08 -1.64956155401796e-08 -2.49608911317978e-09 
0.192329779267311 -9.5131945272442e-08 3.46390893746218e-09 1.03346673441251e-08 
0.188533544540405 -8.66477785166353e-08 1.14896447911406e-09 -1.52678083509272e-08 
0.184138566255569 -8.72743203217397e-08 8.88010376343118e-09 -4.74788341975341e-09 
0.179418966174126 -7.45365468901582e-08 -2.37577468809036e-09 -2.17541318292547e-09 
0.17462645471096 -3.29225940731703e-08 3.38336220151447e-10 -9.1970111526507e-09 
0.16924761235714 1.64481798492488e-08 -5.82380588198816e-09 4.59861393409255e-09 
0.164042562246323 -1.28612470007283e-09 -9.20276210791826e-09 -1.56557238284449e-08 
0.157675966620445 2.90645857603522e-08 2.06115018386299e-08 5.49193357457511e-09 
0.15183088183403 -1.90440550795756e-08 7.27548954415624e-09 6.69275790343704e-09 
0.145800575613976 -3.42460316460347e-08 7.78029818349069e-09 9.29454113673955e-09 
0.139458835124969 -5.74682553633465e-08 5.39006128619235e-09 6.59489307608396e-09 
0.132356554269791 -1.97326494344452e-08 1.31532322811267e-08 1.93268423487325e-09 
0.12533962726593 -4.04014099331107e-08 2.36423347566017e-09 7.0638366267417e-09 
0.118361815810204 -5.57121302335872e-08 1.81734305382264e-09 4.24171764379366e-09 
0.110663220286369 -6.89085618432728e-08 6.2490799201953e-09 -2.29904997817165e-10 
0.102796904742718 -6.66834284857032e-08 -6.3948122352997e-09 2.36334329883903e-09 
0.0953901186585426 -1.0093684977619e-07 -1.56625346026118e-09 3.76633746412836e-09 
0.0881285145878792 -9.75114380707964e-08 5.86697712634532e-09 1.09864881636668e-08 
0.080384187400341 -5.6027738537523e-08 7.12057435237057e-09 6.26718232865642e-09 
0.0728678032755852 -6.28075667918893e-08 6.20969986542264e-09 6.62600951883974e-09 
0.0656709969043732 -6.80617995385546e-08 6.25648377550192e-09 2.3120265701948e-09 
0.0583447851240635 -5.28873442817712e-08 3.49748369155023e-10 -2.60515969907615e-10 
0.0513540357351303 -4.43685485151946e-08 5.24674137469816e-10 7.16661174848809e-10 
0.0448638647794724 -4.55645158581319e-08 -1.5897120286823e-09 5.41300071432715e-09 
0.0388533361256123 -3.65383971256961e-08 -2.08287209702007e-09 1.12307718680427e-09 
0.0330181978642941 -2.07851439881779e-08 1.14505260828679e-09 2.08037476134848e-09 
0.0277164131402969 -2.44494572143594e-08 1.20049747920348e-09 3.24484328295682e-09 
0.0227578468620777 -2.52779295806249e-08 -1.287704110009e-10 -6.06150130089134e-10 
0.0182856526225805 -2.90792831947329e-08 1.97858662787098e-09 1.95607152697619e-09 
0.0143118482083082 -2.79623304777488e-08 1.44493117471001e-09 1.81803427867777e-09 
0.0111589748412371 -3.49622246176295e-08 1.59392121723556e-09 1.63793356655617e-09 
0.00862834975123405 -3.54294706994551e-08 7.90834286945596e-10 1.00342500974904e-09 
0.00660532200708985 -3.4782538023137e-08 2.43801800969834e-09 1.7258547924115e-09 
0.00502587482333183 -3.2448956517328e-08 1.66686997538079e-09 1.62970026362785e-09 
0.00380751374177635 -3.38130757882027e-08 8.95320428906388e-10 1.23050369893463e-09 
0.00284577067941427 -3.40923384101188e-08 1.42433731475933e-09 1.61584923219493e-09 
0.00213896739296615 -3.73706006939756e-08 1.48666501331718e-09 1.82206993937228e-09 
0.00160113943275064 -3.94357721233973e-08 1.40872535858705e-09 1.73473979625527e-09 
0.00119229569099844 -4.16745979237021e-08 1.61982560697993e-09 1.88400139933265e-09 
0.000887126720044762 -4.18362697018893e-08 1.65869362689364e-09 1.95318539120137e-09 
0.000670950685162097 -4.22092080043512e-08 1.59868018823062e-09 1.9936050588143e-09 
0.000505507632624358 -4.202955551591e-08 1.55405288637667e-09 1.94664129260502e-09 
0.000379111559595913 -4.20201649831142e-08 1.5791755680894e-09 1.94104332607026e-09 
0.000281618733424693 -4.12822146245162e-08 1.56757140601371e-09 1.92592675141157e-09 
0.000210762795177288 -4.10248048865469e-08 1.53422319293384e-09 1.89808702089067e-09 
0.000142851393320598 -4.00296175939729e-08 1.52327372937577e-09 1.87515092342494e-09 
9.3576185463462e-05 -3.85435987482197e-08 1.4607783871412e-09 1.80461490195682e-09 
4.78154870506842e-05 -3.68524365512712e-08 1.39239264562718e-09 1.71650382796429e-09 
1.57778886205051e-05 -3.52819870386156e-08 1.33308741823157e-09 1.64398894497708e-09 
-1.34538677230012e-05 -3.33139382746594e-08 1.25985899490644e-09 1.55052948258572e-09 
-3.19730752380565e-05 -3.15239185511018e-08 1.191305720738e-09 1.46789513877366e-09 
-4.57385103800334e-05 -3.00795545626897e-08 1.13648435107194e-09 1.40319000863087e-09 
-5.63291177968495e-05 -2.9036420983175e-08 1.09320252850154e-09 1.35227518072156e-09 
-6.39837235212326e-05 -2.78958691524167e-08 1.05113995285677e-09 1.29727728559459e-09 
-6.44895771984011e-05 -2.70712916972116e-08 1.02111785693637e-09 1.26004850997674e-09 
0 0 0 0 
0 0 0 0 
0 0 0 0 
0 0 0 0 
0 0 0 0 
0 0 0 0 
0 0 0 0 
0 0 0 0 
0 0 0 0 
0 0 0 0 
0 0 0 0 
0 0 0 0 
0 0 0 0 
0 0 0 0 
99.9928588867188 0.00593670224770904 2.92098211502889e-05 2.73352052317932e-05 
