<eps>	0
(ni3)^(hao3)^(you1)^(you1)	1
(ni3)^(hao4)^(you1)^(you1)	2
(wei1)^(xin4)^(zhi1)^(fu4)	3
(wei1)^(shen1)^(zhi1)^(fu4)	4
(zhi1)^(fu4)^(bao3)^(zhi1)^(fu4)	5
(wei1)^(xin4)^(sao3)^(yi1)^(sao3)	6
(wei1)^(xin4)^(sao3)^(yi1)^(sao4)	7
(wei1)^(xin4)^(sao3)^(yi2)^(sao3)	8
(wei1)^(xin4)^(sao3)^(yi2)^(sao4)	9
(wei1)^(xin4)^(sao4)^(yi1)^(sao3)	10
(wei1)^(xin4)^(sao4)^(yi1)^(sao4)	11
(wei1)^(xin4)^(sao4)^(yi2)^(sao3)	12
(wei1)^(xin4)^(sao4)^(yi2)^(sao4)	13
(wei1)^(shen1)^(sao3)^(yi1)^(sao3)	14
(wei1)^(shen1)^(sao3)^(yi1)^(sao4)	15
(wei1)^(shen1)^(sao3)^(yi2)^(sao3)	16
(wei1)^(shen1)^(sao3)^(yi2)^(sao4)	17
(wei1)^(shen1)^(sao4)^(yi1)^(sao3)	18
(wei1)^(shen1)^(sao4)^(yi1)^(sao4)	19
(wei1)^(shen1)^(sao4)^(yi2)^(sao3)	20
(wei1)^(shen1)^(sao4)^(yi2)^(sao4)	21
(zhi1)^(fu4)^(bao3)^(sao3)^(yi1)^(sao3)	22
(zhi1)^(fu4)^(bao3)^(sao3)^(yi1)^(sao4)	23
(zhi1)^(fu4)^(bao3)^(sao3)^(yi2)^(sao3)	24
(zhi1)^(fu4)^(bao3)^(sao3)^(yi2)^(sao4)	25
(zhi1)^(fu4)^(bao3)^(sao4)^(yi1)^(sao3)	26
(zhi1)^(fu4)^(bao3)^(sao4)^(yi1)^(sao4)	27
(zhi1)^(fu4)^(bao3)^(sao4)^(yi2)^(sao3)	28
(zhi1)^(fu4)^(bao3)^(sao4)^(yi2)^(sao4)	29
(xiao3)^(yi4)^(xiao3)^(yi4)	30
有过	31
我到	32
他说	33
山市	34
清除	35
诺	36
那就	37
那个	38
冷	39
会不	40
公交	41
刚从	42
冬季	43
春节	44
新的	45
他看	46
你那	47
现在	48
后就	49
大	50
那	51
的	52
样的	53
打成	54
而	55
哈	56
啥	57
家	58
灯	59
新	60
乌	61
一几	62
啊	63
大概	64
还有	65
能	66
类型	67
你觉得	68
在	69
女朋友	70
一起	71
时间	72
一个	73
你又	74
穿哪套	75
衣服	76
你这	77
机好	78
工厂	79
激动	80
不愿	81
确实	82
住宿	83
初三	84
节奏	85
利用	86
实力	87
科比	88
第十	89
替我	90
柳	91
自助	92
练习	93
龚	94
猛烈	95
胸罩	96
蘑菇	97
助理	98
之类	99
金牛	100
三级	101
欠费	102
惠	103
本事	104
广元	105
虹桥	106
自	107
瞎	108
前台	109
乔	110
熟	111
阅兵	112
承德	113
会让	114
脱掉	115
兆	116
狗狗	117
长期	118
山区	119
验证	120
鄙视	121
说不	122
份	123
体会	124
步骤	125
欣	126
厘米	127
迷茫	128
组	129
沈	130
源	131
面子	132
问道	133
你比	134
人间	135
哇	136
商品	137
夜班	138
枪	139
就够	140
接到	141
男友	142
纽约	143
箱	144
西路	145
野	146
瓜	147
来吃	148
坑	149
宇	150
奇	151
鞍山	152
自知	153
蜜	154
威	155
情绪	156
现场	157
燕子	158
几度	159
觉觉	160
冰	161
民兵	162
霆锋	163
暖	164
断	165
水平	166
西南	167
风流	168
桌	169
也快	170
之际	171
侦探	172
足彩	173
就得	174
魔女	175
售价	176
古诗	177
总会	178
珠	179
订购	180
四分	181
心都	182
喝醉	183
恐龙	184
立	185
屋	186
六分	187
苍井	188
平方	189
盛	190
良心	191
伞	192
国语	193
湘潭	194
海阔	195
滚蛋	196
搬	197
切糕	198
快捷	199
订票	200
伦敦	201
己	202
会玩	203
工具	204
复活	205
红柿	206
呆	207
太冷	208
汽油	209
送到	210
谁能	211
天河	212
灵	213
九百	214
原则	215
关键	216
西班	217
位于	218
凌晨	219
你一个	220
呃	221
骑士	222
以后	223
户口	224
四百	225
拜托	226
你啊	227
四日	228
冰冰	229
精	230
魅力	231
秋天	232
也好	233
用手	234
条路	235
会来	236
设	237
混蛋	238
请假	239
零三	240
交流	241
敏	242
就来	243
眼里	244
排骨	245
厚	246
蛮	247
会很	248
骂人	249
五七	250
那也	251
巴马	252
当前	253
竟然	254
型	255
等级	256
心如	257
千里	258
刺激	259
人人	260
和谁	261
京	262
存	263
带来	264
周日	265
像我	266
很忙	267
你看	268
共产	269
季节	270
前面	271
土	272
得多	273
集合	274
何处	275
文章	276
驰	277
烦恼	278
句	279
步	280
敷衍	281
无论	282
俄	283
松	284
盐城	285
我的爱	286
忙吗	287
耳机	288
人们	289
完全	290
致	291
懒	292
蓝色	293
毛球	294
长城	295
邮	296
情侣	297
火星	298
牡丹	299
明日	300
教学	301
系列	302
战士	303
追求	304
体重	305
轻松	306
平洋	307
字母	308
友谊	309
拒绝	310
温暖	311
负责	312
糊涂	313
修改	314
香蕉	315
不听	316
女士	317
为啥	318
扣	319
猪猪	320
旅行	321
说错	322
川	323
张翰	324
我从	325
国荣	326
摸	327
球队	328
千年	329
设定	330
资格	331
毕竟	332
朝阳	333
见识	334
同样	335
后台	336
冻	337
根	338
最贵	339
说些	340
路由	341
我得	342
永恒	343
顾问	344
准时	345
讨论	346
盘	347
邓丽	348
股份	349
堵车	350
鼻子	351
第几	352
新加	353
外星	354
提高	355
书店	356
改成	357
三围	358
汤圆	359
十日	360
陕西	361
快速	362
使	363
看一下	364
饭馆	365
子都	366
新婚	367
复习	368
叔	369
人说	370
贵州	371
眼光	372
叫他	373
剧	374
周边	375
寝室	376
四年	377
晴天	378
试	379
讨厌	380
集团	381
悟空	382
产品	383
事成	384
培训	385
杨幂	386
看书	387
城	388
梁静	389
评论	390
比我	391
补偿	392
舍	393
得	394
浪漫	395
零零	396
浪费	397
卖	398
存在	399
义乌	400
天涯	401
最爱	402
我们就	403
山西	404
五三	405
最快	406
篮球	407
破	408
牛肉	409
把他	410
门票	411
窗	412
不爱	413
记忆	414
海口	415
精灵	416
减	417
奇迹	418
识别	419
趟	420
企业	421
更新	422
见到	423
站到	424
说明	425
非常	426
军	427
摩托	428
活	429
轩	430
他们	431
万	432
股票	433
不及	434
学校	435
蓝	436
岳阳	437
植物	438
躺在	439
宽带	440
乱	441
成年	442
愉快	443
今天	444
催眠	445
南昌	446
邮编	447
看来	448
地	449
西安	450
穿梭	451
决定	452
功能	453
事我	454
四四	455
码	456
网吧	457
日来	458
题	459
女孩	460
预防	461
另	462
纸	463
早起	464
爸	465
客运	466
欺负	467
习近平	468
浙江	469
人不	470
飞车	471
故	472
南	473
只在	474
学习	475
相关	476
小^V^小^V	477
肚子	478
酒吧	479
科技	480
头	481
元	482
几日	483
密码	484
机里	485
日语	486
赶紧	487
太不	488
明星	489
关掉	490
客气	491
商丘	492
周围	493
阳	494
胡	495
含	496
不对	497
耽误	498
道为	499
送	500
期末	501
木	502
普通	503
我用	504
鸡鸡	505
朱	506
想睡	507
昨	508
不得	509
不该	510
寄	511
痛	512
面	513
怕	514
过我	515
左右	516
我干	517
国	518
她在	519
九七	520
数字	521
教	522
都睡	523
观看	524
按	525
社	526
有些	527
国庆	528
名称	529
解决	530
就像	531
嫉妒	532
实在	533
政局	534
似	535
浏览	536
宇宙	537
日前	538
肺	539
婚前	540
诚	541
里来	542
厕所	543
身材	544
计算	545
中央	546
们	547
厉害	548
失眠	549
停止播放	550
着	551
钢琴	552
滋味	553
约会	554
杰	555
只要	556
主席	557
香烟	558
骗人	559
性	560
六十	561
未来	562
浩特	563
旅游	564
有看	565
会在	566
浪	567
骗我	568
学会	569
我买	570
室	571
见面	572
几时	573
也要	574
秀	575
不够	576
四级	577
摄像	578
三九	579
元旦	580
杰克	581
不	582
运会	583
新闻	584
我请	585
都市	586
百度	587
然后	588
此	589
空间	590
局	591
咋办	592
我看	593
如此	594
全球	595
当兵	596
女生	597
笑	598
香港	599
也会	600
武汉	601
联播	602
司机	603
其实	604
忍	605
太累	606
预报	607
我很	608
分	609
年级	610
有种	611
平平	612
全部	613
唱吧	614
希	615
同学	616
飞	617
联通	618
领导	619
就算	620
提前	621
针	622
有没	623
途	624
要到	625
虽然	626
几年	627
吗	628
关闭	629
机会	630
做呢	631
十二	632
单位	633
拯救	634
琴	635
推荐	636
滚	637
听听	638
柯南	639
理我	640
最火	641
快递	642
要我	643
升起	644
新娘	645
三年	646
往	647
居然	648
直接	649
正常	650
亦菲	651
张雨	652
蛋	653
总	654
粉	655
精神	656
圆	657
感冒	658
周星	659
体育	660
何必	661
有害	662
登陆	663
我写	664
莫	665
滨	666
至	667
有空	668
光棍	669
可怕	670
公	671
半	672
变成	673
眼睛	674
每天	675
完美	676
网	677
专业	678
牛奶	679
之	680
子座	681
能否	682
还在	683
工资	684
地铁	685
祝您	686
寂寞	687
会用	688
瓶子	689
价格	690
表白	691
并不	692
派	693
思考	694
生气	695
远	696
主流	697
扫描	698
刚刚	699
错过	700
美国	701
乖	702
长得	703
乡	704
县	705
有	706
人睡	707
人多	708
样子	709
关心	710
懂	711
蓝牙	712
发言	713
富	714
熟悉	715
部分	716
十元	717
春	718
你开	719
长流	720
百科	721
期间	722
减肥	723
所谓	724
节目	725
雅人	726
主持	727
起	728
车站	729
板	730
光	731
郁闷	732
我	733
环境	734
沙	735
姓名	736
脑	737
酒	738
主人	739
没事	740
允许	741
零四	742
问	743
芜湖	744
节日	745
地震	746
视频	747
算	748
经历	749
性格	750
公共	751
火影	752
时	753
离	754
七日	755
对我	756
赚钱	757
坐	758
美	759
饿	760
泰州	761
挂	762
爱我	763
凡	764
分数	765
天水	766
唐诗	767
八五	768
美容	769
生	770
成	771
编码	772
女友	773
农历	774
最后	775
距离	776
再过	777
不同	778
治疗	779
反正	780
既然	781
五十	782
认真	783
园	784
消息	785
窝里	786
疼	787
期中	788
运	789
每	790
人都	791
本来	792
移动	793
恭喜	794
常州	795
深圳	796
从	797
为我	798
就没	799
还要	800
陪我	801
毕业	802
东北	803
我妈	804
周	805
邮局	806
鬼	807
我没	808
不许	809
有人	810
人心	811
鼻涕	812
父亲	813
管理	814
批发	815
安全	816
也很	817
河南	818
酒泉	819
地址	820
日元	821
两	822
实验	823
泉州	824
有多	825
心	826
表	827
严	828
颜色	829
油性皮肤	830
公园	831
气冷	832
死	833
惹	834
怪	835
工程	836
自私	837
峰	838
购买	839
称呼	840
来自	841
汽	842
聪明	843
就能	844
晓得	845
成都	846
福利	847
加入	848
重庆	849
的心	850
事吧	851
考	852
用我	853
属于	854
要买	855
龙岗	856
金	857
错	858
时就	859
先	860
相	861
关于	862
坏人	863
市区	864
胜利	865
全	866
让你	867
种人	868
柳州	869
喝	870
姨妈	871
洋	872
面积	873
戴	874
买票	875
卓	876
着呢	877
人呢	878
违章	879
玩吧	880
襄樊	881
控制	882
食品	883
办公	884
五四	885
尽快	886
用卡	887
缘分	888
日	889
合适	890
丑	891
穷	892
服装	893
粥	894
交	895
我心	896
东	897
舞	898
长途	899
责任	900
周年	901
特	902
突然	903
男女	904
二百	905
死人	906
赢	907
从事	908
合肥	909
汽车	910
日期	911
西	912
重要	913
餐馆	914
结果	915
今儿	916
组织	917
睡吧	918
徐州	919
比赛	920
维修	921
进来	922
跳舞	923
跟着	924
认	925
香	926
取消	927
章	928
我一会	929
活动	930
有缘	931
内容	932
洗完	933
早晨	934
公司	935
装备	936
宠物	937
没吃	938
规则	939
药	940
共	941
很久	942
输入	943
装	944
温度	945
疯	946
原	947
演唱	948
笨	949
某	950
高跟	951
如	952
甲	953
其	954
块	955
购物	956
李	957
游记	958
石	959
值	960
食物	961
真的很	962
原来	963
预	964
服务	965
都听	966
前	967
说他	968
文学	969
主义	970
不睡	971
形成	972
孤单	973
明明	974
杀	975
生人	976
事件	977
晕	978
天天	979
请我	980
僵尸	981
别说	982
删除	983
这个	984
有关	985
精彩	986
想买	987
市场	988
真心	989
色球	990
快快	991
四川	992
特曼	993
江南	994
五六	995
直	996
蹲	997
次	998
力	999
炒	1000
索尼	1001
我生	1002
草	1003
贵阳	1004
经验	1005
他在	1006
茶	1007
勇气	1008
感动	1009
空	1010
星级	1011
史	1012
夫妻	1013
寺	1014
智商	1015
不如	1016
你们	1017
骗	1018
病	1019
泽东	1020
待	1021
怕我	1022
收	1023
太笨	1024
机票	1025
睡着	1026
人类	1027
据说	1028
西游	1029
属	1030
尾巴	1031
动漫	1032
米	1033
油	1034
寻找	1035
互	1036
媛	1037
忍者	1038
叫做	1039
委屈	1040
价钱	1041
未	1042
名叫	1043
面对	1044
聊聊	1045
货	1046
后面	1047
彩	1048
骂	1049
玉	1050
无敌	1051
操作	1052
能不	1053
零五	1054
陌	1055
李白	1056
五百	1057
文明	1058
想吃	1059
心疼	1060
自动	1061
校区	1062
谈过	1063
幽默	1064
身	1065
日文	1066
他不	1067
不接	1068
相片	1069
十年	1070
长江	1071
科学	1072
才不	1073
瑞	1074
今日	1075
二五	1076
早睡	1077
名单	1078
套	1079
各种	1080
作用	1081
古代	1082
愚人	1083
随时	1084
傻子	1085
羽	1086
秦	1087
没到	1088
自由	1089
费	1090
狮	1091
很不	1092
中心	1093
康	1094
员工	1095
姓	1096
检查	1097
汇	1098
又没	1099
炫	1100
巧	1101
也没	1102
物流	1103
期待	1104
温	1105
躺	1106
吧	1107
觉	1108
陪着	1109
数	1110
危害	1111
梅	1112
郭	1113
卫生	1114
最炫	1115
可惜	1116
就想	1117
失败	1118
喜不	1119
场	1120
专卖	1121
能让	1122
网游	1123
几次	1124
军训	1125
有雨	1126
牙	1127
商务	1128
商城	1129
郑	1130
永远	1131
书	1132
猪头	1133
几条	1134
任	1135
喝多	1136
主	1137
脱	1138
租	1139
作品	1140
领	1141
龙江	1142
对面	1143
招	1144
南站	1145
节课	1146
光明	1147
假期	1148
很多	1149
五日	1150
真正	1151
满	1152
想过	1153
让人	1154
决不	1155
相遇	1156
利亚	1157
到来	1158
添加	1159
专用	1160
说呢	1161
也就	1162
云	1163
丢	1164
指	1165
流氓	1166
并	1167
要跟	1168
初中	1169
要再	1170
女子	1171
气象	1172
要听	1173
启动	1174
送我	1175
脚	1176
校园	1177
章节	1178
骗子	1179
切都	1180
太多	1181
经过	1182
房产	1183
有在	1184
哦	1185
一条	1186
二七	1187
频道	1188
枝花	1189
决赛	1190
四五	1191
代表	1192
羊	1193
最新	1194
时尚	1195
勇士	1196
兔子	1197
养	1198
西站	1199
抢	1200
谁在	1201
洋洋	1202
作业	1203
生病	1204
客	1205
糟	1206
终极	1207
理	1208
生产	1209
做过	1210
轻	1211
六日	1212
爱人	1213
人民	1214
舍得	1215
状况	1216
新年	1217
克	1218
有无	1219
笨蛋	1220
离我	1221
避孕	1222
桌面	1223
去做	1224
祝福	1225
各位	1226
火线	1227
梦想	1228
清理	1229
双节	1230
收入	1231
入	1232
材料	1233
人体	1234
葡萄	1235
过节	1236
白痴	1237
漫游	1238
抽烟	1239
早饭	1240
优惠	1241
付款	1242
孕妇	1243
式	1244
亲亲	1245
也想	1246
第四	1247
色情	1248
动听	1249
六九	1250
二六	1251
结	1252
美元	1253
姑娘	1254
吉林	1255
绝对	1256
要对	1257
翅膀	1258
混	1259
扣扣	1260
我拿	1261
能干	1262
翻	1263
喂	1264
湖人	1265
副	1266
麦当劳	1267
耍	1268
九五	1269
周六	1270
门市	1271
地理	1272
介意	1273
丽	1274
总统	1275
租车	1276
交通	1277
不清	1278
特产	1279
承认	1280
俊杰	1281
做到	1282
曾	1283
单机	1284
团	1285
猪	1286
会吗	1287
能吃	1288
亚	1289
日记	1290
平顶	1291
成语	1292
人要	1293
谱	1294
吹	1295
姐姐	1296
叔叔	1297
邓	1298
业	1299
心中	1300
公安	1301
铁	1302
哈喽	1303
子书	1304
绵阳	1305
天可	1306
发来	1307
伤感	1308
嘻嘻	1309
项目	1310
日程	1311
说对	1312
身高	1313
屁	1314
有流	1315
同事	1316
驾驶	1317
额	1318
午夜	1319
俩	1320
古	1321
佳	1322
来着	1323
暖文	1324
父母	1325
不靠	1326
仙	1327
真实	1328
天来	1329
利	1330
有病	1331
秋	1332
宋词	1333
人也	1334
升	1335
脾气	1336
公主	1337
主演	1338
腾	1339
遵义	1340
跟他	1341
表示	1342
这样	1343
天然	1344
喽	1345
基金	1346
克力	1347
欠	1348
七七	1349
假如	1350
周五	1351
妹子	1352
假日	1353
纠结	1354
军事	1355
评价	1356
就在	1357
泡	1358
机能	1359
随	1360
足球	1361
着急	1362
输	1363
我怕	1364
事都	1365
桥	1366
五天	1367
想干	1368
要带	1369
机器	1370
泪	1371
情	1372
聚会	1373
喊我	1374
粤语	1375
丝	1376
羽绒	1377
求	1378
初	1379
店里	1380
顺便	1381
要脸	1382
政策	1383
准确	1384
中考	1385
十天	1386
闯	1387
几种	1388
书记	1389
没来	1390
病毒	1391
命	1392
一组	1393
金刚	1394
素	1395
柴油	1396
胸部	1397
果	1398
人员	1399
容易	1400
总理	1401
美图	1402
酱油	1403
面试	1404
许嵩	1405
言	1406
那不	1407
肯德	1408
珠海	1409
反	1410
会儿	1411
黑色	1412
辽宁	1413
格式	1414
敏感	1415
一定	1416
动力	1417
扬州	1418
真诚	1419
<UNK>	1420
#0	1421
<s>	1422
</s>	1423
<Version>	Kirin_Net_1.1_20180516