0 0 0 0 
0 0 0 0 
0 0 0 0 
0 0 0 0 
0 0 0 0 
0 0 0 0 
0 0 0 0 
0 0 0 0 
0 0 0 0 
0 0 0 0 
0.00221590464934707 -4.27721663642799e-10 4.07928441026328e-10 -1.38879211949994e-11 
0.00367331341840327 3.12139746938556e-07 -9.376161358432e-08 8.8546405763168e-09 
0.0066623198799789 -2.55288682637911e-07 -5.49961001183874e-08 5.69212188494816e-09 
0.0123086916282773 1.0094416325046e-07 2.29523010375488e-07 -8.8611553650253e-09 
0.0235351622104645 -1.31279405124474e-08 -8.0295833981836e-08 -4.66240113183858e-09 
0.0388284586369991 1.58674839934037e-09 -9.54481382819949e-09 -4.60007392177886e-08 
0.0561058111488819 4.28609281399872e-09 -1.1179849934706e-08 -9.31453314478858e-08 
0.0738761276006699 -7.5484045680696e-09 1.47343257594912e-08 1.66008746305124e-07 
0.0901256650686264 -2.73411382423205e-09 4.42279413093161e-09 -1.40509328616645e-07 
0.101873159408569 5.75223690901794e-09 -1.43341187808232e-08 -4.99520460550684e-08 
0.110543668270111 -3.18473247773454e-10 8.93638141263864e-09 4.77331418835547e-08 
0.117272816598415 -2.45950065869138e-10 -6.68489041899534e-09 2.36636110706456e-09 
0.123250618577003 -4.80901185540006e-09 -1.24001729023826e-11 7.70901328883689e-11 
0.127730786800385 1.21097594174557e-08 -1.72822733901512e-08 8.13869593940808e-09 
0.131686255335808 4.98982055674446e-09 -4.43266356953131e-09 -6.21665208200284e-09 
0.134772658348083 -7.26525550831525e-09 2.25616840765497e-08 -4.30907798332214e-09 
0.138035997748375 1.06559365775638e-08 -2.65379576092073e-08 1.30489563598957e-09 
0.140858814120293 -6.99716817820217e-09 1.81377561858653e-08 1.13929505829446e-08 
0.143750920891762 -1.69102190028525e-08 1.87878814728037e-08 1.13302500714951e-09 
0.146356642246246 7.58483231777518e-09 -2.51793625949404e-08 1.23375629712541e-08 
0.148893520236015 2.05243849693559e-10 1.07426654238907e-08 1.11580984452075e-08 
0.151079714298248 -4.86726214887767e-09 1.36555664553839e-08 -5.86153126036493e-09 
0.15316154062748 -1.03646655702505e-08 1.56287551789092e-08 -1.0066577793566e-08 
0.155406951904297 -7.49266870769816e-09 1.06986979275803e-08 1.17601208771134e-08 
0.157678991556168 3.09930037190043e-08 -3.11196153290894e-08 1.93059577213717e-08 
0.160028204321861 -1.18881713362384e-08 1.25580656984425e-08 -1.64442404138043e-09 
0.162209093570709 2.09116066685056e-08 -2.76592508896556e-08 -4.21989065912953e-09 
0.16436704993248 -1.87045792188201e-08 3.15887831447981e-08 -1.03157953290633e-08 
0.166127413511276 -1.10233022709849e-08 1.11997948692988e-08 -2.44275488725521e-09 
0.167543604969978 1.85616286785262e-08 -2.0296081260085e-08 1.6183409057291e-09 
0.168144226074219 1.00235304500984e-08 -2.17034248350956e-08 4.95072116635242e-09 
0.168486639857292 -2.78661804742342e-09 7.55667706187069e-09 7.03175695448977e-09 
0.167897880077362 -1.63965108157527e-08 3.50077442590191e-08 -3.7993372892231e-09 
0.166704043745995 -5.14397724415971e-09 1.40390621350406e-09 -2.61279486934995e-09 
0.165225833654404 -1.36004691952962e-08 2.45010642885291e-08 -9.19269105281728e-09 
0.163638293743134 1.19191956304832e-09 2.72692535219221e-09 3.75650932582516e-09 
0.161671832203865 -5.14345410707051e-09 1.4682994375903e-08 -1.0492339219681e-09 
0.160062417387962 9.80268932693207e-09 -9.81780701181378e-09 -3.19478710153476e-09 
0.158493667840958 1.06834292523672e-08 -1.67899205649746e-08 -4.50843096189146e-09 
0.156357496976852 1.05584154752592e-08 -2.52482426077449e-08 -9.22542309211849e-09 
0.154419869184494 1.40036560125623e-08 -2.89924741991854e-08 -1.18266541004886e-09 
0.151925042271614 1.54939066021598e-08 -2.54871377336485e-08 7.79391662319995e-09 
0.148628920316696 -1.85376680672533e-09 5.42872280462348e-09 4.49102444122218e-09 
0.144423544406891 -7.96000509950545e-09 1.6276697323292e-08 2.37820940718336e-09 
0.139973104000092 7.34773042410097e-09 -2.3614663557936e-09 5.69296432217925e-09 
0.134444445371628 -4.80116169043754e-09 -4.81435225019311e-10 1.47647796211459e-08 
0.128873273730278 -1.73000866965367e-08 1.05763895419386e-08 -5.72624347938699e-09 
0.122991979122162 -2.25386216357037e-08 3.41250157021022e-08 4.41954872698602e-09 
0.117619127035141 2.82195311562816e-09 -1.80659807114125e-08 6.10573203108089e-10 
0.111936636269093 8.0462321250252e-09 -2.41663524747082e-08 5.79293102376255e-09 
0.106430932879448 -7.36766603282035e-09 1.81936457011034e-08 -3.38179484415946e-09 
0.100933484733105 2.29604935064742e-09 -1.53323878038236e-08 5.00372943079697e-09 
0.0956933498382568 6.45886100159032e-09 -1.30661534925025e-08 -1.42389899870921e-09 
0.0898690745234489 5.86608273067668e-09 3.66889896241673e-09 1.93518800983838e-09 
0.0840550363063812 -2.14964801514839e-09 -8.35283131550568e-09 -1.28809218846726e-09 
0.0783360525965691 -8.55747750438951e-10 1.40435774120817e-09 6.17750683939988e-10 
0.0723619163036346 -2.37305286532319e-09 3.60092511364485e-09 -1.71388525593841e-09 
0.066530205309391 -3.14996784211985e-09 9.39354016793459e-09 1.61871027692939e-09 
0.0612309649586678 8.71790639678238e-10 -5.03875519086705e-09 -2.39408409763442e-10 
0.0563517399132252 -3.27909921438163e-09 3.9966603360142e-09 1.61038049562023e-09 
0.0517294220626354 -3.07361225360125e-09 5.5590283487561e-09 -1.73659786550928e-09 
0.0477800816297531 1.35912558985041e-09 -2.90433033178772e-09 2.23848251046377e-09 
0.0442120395600796 -2.1168540254024e-09 3.21772697375877e-09 -4.02456823422881e-09 
0.0411261990666389 -3.40800743181546e-09 6.51206821800088e-09 -2.1016555162845e-09 
0.0383925773203373 2.54196375060189e-09 -5.01512342765409e-09 7.10697195538401e-11 
0.0360400825738907 -8.83848161326029e-10 5.93768501033765e-09 1.6816764647487e-09 
0.0339791998267174 -1.05208552980685e-09 5.14216225155906e-09 -1.8371335563927e-09 
0.0319229438900948 -2.45080533645137e-09 4.86751217110282e-09 -2.3601951504304e-09 
0.0301157496869564 2.95880187017872e-09 -3.25903348752377e-09 1.02792097056437e-09 
0.0284325499087572 -2.24531082615442e-09 3.27999449822869e-09 -6.97827767792703e-11 
0.0266354568302631 -8.63092985969871e-10 1.61804158960166e-09 -2.88518053892517e-09 
0.0248412098735571 -1.1504903696391e-09 1.73003933401361e-09 1.04066488759713e-09 
0.0232812147587538 -1.22350796161186e-09 9.56626333703525e-10 -2.01804195576472e-09 
0.021671000868082 1.7784779204888e-09 -3.37216587986688e-09 7.05877301054869e-10 
0.0200334545224905 -5.57975943227262e-10 1.85002613228846e-09 -5.66737143326002e-11 
0.0186355393379927 -1.5841935541161e-09 1.50303103296778e-09 7.07156500023842e-10 
0.0172675214707851 3.5520569124925e-11 -1.3274756849313e-09 1.51951984328491e-09 
0.0158870238810778 3.64357100046675e-10 8.86895890062078e-10 7.49888873219362e-10 
0.0145701467990875 -8.88713769242599e-10 2.27923502293947e-09 2.89220924987177e-10 
0.0134478770196438 -1.91679259270439e-11 -4.87222706624379e-10 3.41522338187517e-10 
0.0124884014949203 -2.52175936382715e-11 -1.07894138068332e-09 4.95544993928121e-10 
0.0116261597722769 -8.60446935924131e-10 1.86728343898324e-09 -1.26259236399306e-09 
0.0109380418434739 -2.14702200462824e-10 8.8057910963002e-10 -1.27004440297895e-09 
0.0103870825842023 -9.07837305330617e-10 1.91456095421927e-09 1.09502698575348e-10 
0.00989111792296171 -2.1329436827866e-10 2.8703717180889e-10 6.01275251810307e-10 
0.00945267640054226 -6.11253658799882e-10 1.78265391337362e-09 -7.41523176195358e-10 
0.00918436329811811 -9.16774989256908e-11 2.00092165059118e-09 9.6731268828254e-11 
0.00900255143642426 7.11523617802357e-10 -4.31583269122626e-10 -1.37646921638535e-10 
0.00885489862412214 2.37448366524617e-10 -4.37442082557027e-10 7.11474656966971e-10 
0.00879765767604113 -3.30835414619202e-10 1.05870701094801e-09 7.82086635037205e-12 
0.0088123707100749 -3.45034695259372e-10 1.09578823792589e-09 5.54883083925262e-10 
0.00877843704074621 2.17725046325334e-10 -5.5114096619846e-10 3.93967580780696e-10 
0.0087148854508996 -2.58024573929205e-10 2.39768708359955e-11 -5.86707793459595e-10 
0.00866580475121737 -6.93874457891042e-10 9.04198382833954e-10 -9.54272882935925e-10 
0.0085914945229888 6.39284791770223e-10 -3.22845500333457e-10 -9.06867844707726e-11 
0.00837768521159887 -3.32481431275511e-10 5.36212962920501e-10 -2.19566115289282e-10 
0.00812785979360342 4.57188814584342e-10 -1.6623043219699e-11 -3.75075276393133e-10 
0.00788919720798731 -4.93759644282221e-10 1.92601726234365e-10 3.84787229856798e-10 
0.00764536019414663 -8.35682467670296e-10 7.80514208820193e-10 6.03730121451207e-10 
0.00733563303947449 1.87435469922725e-10 -3.79513642734253e-10 2.68210870180141e-10 
0.00705689284950495 -2.88862572750404e-10 3.72724101582733e-10 -5.64559732296743e-10 
0.00680635590106249 -3.03738062479297e-10 5.09194464370921e-10 7.32996024987997e-11 
0.00655207689851522 -1.04141556489523e-10 -1.07385135506011e-10 3.57849250232078e-10 
0.0062959142960608 5.64273627823297e-10 -1.36415168050519e-09 -9.0441168443256e-11 
0.00605283305048943 -1.74036930700172e-11 1.16150235263124e-10 3.32361083099642e-10 
0.00587284099310637 1.78406733830627e-10 3.05007130663171e-10 -2.40450853672414e-10 
0.00570338079705834 -4.58328125452212e-10 8.03997646237065e-10 -1.63611138526143e-10 
0.0055553144775331 -1.6846372907775e-10 -1.12861775480866e-10 5.70940308919354e-11 
0.00542203243821859 -4.49233233945634e-10 9.57346424357297e-10 1.98751043400947e-10 
0.00534387351945043 -4.14410450400027e-10 3.60961205370103e-10 -2.23147847422389e-10 
0.00526008615270257 -1.09921842461613e-10 1.15897437480417e-10 -5.21727883118217e-10 
0.00523052364587784 -3.20301812850587e-10 6.6594879610804e-10 -1.0373151643206e-10 
0.00522548798471689 -1.08894837591578e-10 -2.65510835539828e-10 -1.9054856303935e-10 
0.00520533416420221 4.82041628835361e-10 -6.53326115429564e-10 -1.00225369670248e-10 
0.00523697352036834 -3.28867454102433e-11 3.31445842993716e-11 -1.01992199408318e-10 
0.00526846619322896 2.23801380205835e-10 3.59484192413717e-10 1.76700404308505e-10 
0.00528454128652811 -6.61636995191728e-11 3.76187941908412e-10 2.64576333064426e-10 
0.00528751127421856 -3.19099413559343e-10 5.98469052093265e-10 -2.0141885381797e-10 
0.00535783357918262 -1.51844689599834e-10 6.47407738529893e-10 -8.93295090675927e-11 
0.00540237221866846 1.1145784989397e-10 -2.43989245474197e-10 1.89644883130669e-10 
0.00545355165377259 -2.42152936591467e-10 4.55434634449858e-10 -8.28711578526597e-12 
0.00549275986850262 2.47116188623053e-10 -3.4638761303718e-10 -4.04645733587117e-10 
0.00557612301781774 -9.55149154213686e-11 6.40344943736437e-10 -2.7550306480606e-10 
0.00559363374486566 -3.45817367797263e-11 1.61692534361713e-10 -2.90375751221816e-10 
0.00565149914473295 -3.71993373604607e-11 1.33951016945133e-10 4.10726785915472e-10 
0.0056823743507266 -7.875984586736e-11 -4.86404250210626e-10 3.22573495692424e-10 
0.0057138972915709 -2.65914623653885e-10 5.42961176019929e-10 -9.11230049749356e-11 
0.00573974335566163 1.97966545933959e-10 -5.40109790225785e-10 3.70570074625931e-10 
0.00582722015678883 -4.40681519053854e-10 6.58492982363867e-10 -2.15974890749315e-10 
0.00586336478590965 -3.39349437439296e-10 1.22770249522119e-09 2.40804154394425e-10 
0.00590686360374093 2.91563162502229e-10 -3.93368193921106e-12 -1.9391541150604e-10 
0.00593076972290874 3.05845654358095e-10 -1.00632324695482e-09 7.72926514458483e-11 
0.00590494368225336 -1.21419833822717e-12 1.1320461235087e-10 1.09404672821167e-10 
0.00582478241994977 3.61362537115717e-11 9.99421899405828e-12 -2.96584617975881e-10 
0.00572203565388918 -9.95045018603591e-11 1.79362063396082e-11 2.08732517381627e-10 
0.00556510547176003 -2.23585164271789e-10 4.3635839386269e-10 -6.13157927209507e-11 
0.00540849845856428 3.82064990755993e-10 -2.94961610691757e-10 1.32168093743695e-13 
0.00520435068756342 -2.18713415434113e-12 8.35064586923728e-11 -3.61848662144837e-10 
0.00497775012627244 -2.18700904608404e-10 3.65790675527222e-10 1.41450129387266e-10 
0.00464388448745012 3.30515420587929e-10 -3.26819793450284e-10 3.04299641040728e-10 
0.00428730761632323 9.12657536350503e-12 -1.45632852999178e-10 -1.43777323380334e-10 
0.00384309561923146 -2.48634255545221e-11 -3.6429408101224e-11 -6.96452825965643e-11 
0.00338316010311246 -5.54419565812481e-10 8.65514326875427e-10 2.21594374794076e-11 
0.0028683403506875 -1.10330272695691e-10 1.92055774062005e-10 -1.5871104430687e-10 
0.00238532992079854 1.3507787943734e-10 -2.74520128851208e-11 -7.44318981449332e-11 
0.00195268634706736 -2.25889570937277e-10 5.50629764006771e-10 -2.41998903555141e-11 
0.0015503061003983 -2.80893121262782e-11 -7.03267166723975e-11 1.11693492996223e-11 
0.00119075074326247 -1.00245402256949e-11 7.39602198929212e-11 5.59335910921277e-11 
0.000897979829460382 -8.55927898002484e-11 6.5669768234411e-11 -5.37489115715051e-11 
0.000682490819599479 -6.07297198640389e-11 1.44023334924803e-10 1.7294818355218e-11 
0.000488093966851011 -1.62149061538885e-11 -3.33168805044526e-11 8.97980127756437e-12 
0.000351179682184011 -4.89063563952064e-12 2.59187411116857e-11 -1.02367914492363e-11 
0.000245591130806133 -1.15132382794148e-11 4.84687637247738e-11 -4.49568897734065e-12 
0.000179898837814108 1.6599324345612e-11 -2.44060119336531e-11 -1.32089304771821e-11 
0.000120762670121621 1.2626893888118e-12 -1.24825573055015e-12 -1.40781570429072e-11 
9.15476775844581e-05 -8.09980554850043e-12 1.23530578127751e-11 -3.56552921952982e-13 
6.55227631796151e-05 -5.15077130253117e-12 5.97898076534764e-12 2.17213269940175e-12 
4.75514498248231e-05 -2.24822721203721e-12 6.00133929096885e-13 -3.33072848815452e-12 
7.65982895245543e-06 -1.2742174936714e-12 2.52445005004265e-12 -3.84878760806284e-13 
-2.18601417145692e-05 1.35835971377257e-12 -4.054756530536e-12 -1.05985934004821e-12 
-6.56311167404056e-05 8.8627499436611e-12 -1.45244875154882e-11 3.51663820676376e-13 
0 0 0 0 
0 0 0 0 
0 0 0 0 
0 0 0 0 
0 0 0 0 
0 0 0 0 
0 0 0 0 
0 0 0 0 
0 0 0 0 
0 0 0 0 
0 0 0 0 
0 0 0 0 
0 0 0 0 
0 0 0 0 
99.9987258911133 4.23103301727679e-05 2.95778754662024e-05 2.5544972231728e-05 
