0.000600239436607808 0.000405042752390727 
0.000617742538452148 0.000270847813226283 
0.000600133382249624 0.000319898128509521 
0.00060261064209044 0.000367820262908936 
0.00061740045202896 0.000676818192005157 
0.000700407370459288 0.000857871258631349 
0.000805299438070506 0.00162032293155789 
0.000977057497948408 0.00207222788594663 
0.00118788261897862 0.00312860496342182 
0.00142304098699242 0.0042556831613183 
0.00168612971901894 0.00553384376689792 
0.00195900723338127 0.00694073783233762 
0.00226447964087129 0.00763527629896998 
0.00255703716538846 0.00839275307953358 
0.00288581219501793 0.00819901749491692 
0.0032469651196152 0.00768448133021593 
0.00359354517422616 0.00605539698153734 
0.00378053076565266 0.00439171865582466 
0.00378383533097804 0.00331423850730062 
0.0036516587715596 0.002607875270769 
0.00346878659911454 0.00206092465668917 
0.00322941993363202 0.00142795557621866 
0.00300334044732153 0.00097012531477958 
0.00282248249277472 0.000596776604652405 
0.00274565839208663 0.000173591150087304 
0.00276182894594967 0.000240940571529791 
0.00287010986357927 0.000276369188213721 
0.00305271008983254 0.000180540038854815 
0.00326466653496027 0.000385772058507428 
0.00349891977384686 0.000488220655824989 
0.00369680742733181 0.000822369242087007 
0.00383215164765716 0.000630626163911074 
0.00387036218307912 0.000873491517268121 
0.00384382251650095 0.000953499984461814 
0.00376928574405611 0.00122754985932261 
0.00367393321357667 0.000804672134108841 
0.00359538639895618 0.000834170321468264 
0.00363962515257299 0.000892822514288127 
0.0038746886420995 0.00138683232944459 
0.00435623899102211 0.00168100721202791 
0.00516455387696624 0.00203061709180474 
0.00648436276242137 0.00245818658731878 
0.00853059347718954 0.0030141354072839 
0.0116020236164331 0.0030104611068964 
0.0159719660878181 0.00318257743492723 
0.021908700466156 0.00179023563396186 
0.0294646583497524 -0.00109103426802903 
0.0383159145712852 -0.00283000175841153 
0.0479225777089596 -0.00445752684026957 
0.0577935799956322 -0.0075494023039937 
0.0672243013978004 -0.0132055636495352 
0.0760599076747894 -0.0105417864397168 
0.0838067308068275 -0.0106857493519783 
0.0906272977590561 -0.00699535757303238 
0.0966637805104256 -0.00681194802746177 
0.101848721504211 -0.00784323643893003 
0.106218613684177 -0.0105305649340153 
0.109678141772747 -0.0153494011610746 
0.112665764987469 -0.015425194054842 
0.115140087902546 -0.00680427579209208 
0.117269478738308 -0.00669798301532865 
0.119036667048931 -0.000250841170782223 
0.120833218097687 -0.0101424055173993 
0.122401230037212 -0.00313032045960426 
0.123579606413841 -0.00854716543108225 
0.124438479542732 -0.00291312439367175 
0.124956235289574 -0.0163742732256651 
0.125379532575607 -0.0169382784515619 
0.125596225261688 -0.0117504978552461 
0.125858649611473 -0.0100520364940166 
0.126048475503922 -0.0119115551933646 
0.126390978693962 -0.0112638296559453 
0.126681178808212 -0.00273156864568591 
0.127106681466103 -0.00394417019560933 
0.127397269010544 -0.0164642799645662 
0.127537444233894 -0.0184046234935522 
0.127711072564125 -0.018795371055603 
0.127487614750862 0.00160540221258998 
0.127223283052444 0.00332146929576993 
0.126859784126282 0.0109130330383778 
0.126865729689598 -0.00641299085691571 
0.126598194241524 -0.00408449536189437 
0.126222997903824 -0.00775255169719458 
0.125751301646233 0.00353300175629556 
0.125416412949562 0.00439261924475431 
0.125014841556549 0.0208912342786789 
0.124243006110191 0.0199028681963682 
0.123611219227314 0.0122534958645701 
0.122873112559319 -0.00344741065055132 
0.122389167547226 -0.0111738871783018 
0.121685311198235 -0.00352862314321101 
0.120969451963902 0.0131092146039009 
0.120120085775852 0.0149937588721514 
0.119110062718391 0.0155257238075137 
0.117999397218227 0.00754175474867225 
0.116789363324642 0.00784414354711771 
0.115814298391342 0.012251291424036 
0.114663779735565 0.0149705288931727 
0.113715797662735 0.0220735818147659 
0.112948462367058 0.0179714187979698 
0.112541288137436 0.00719049153849483 
0.112288244068623 0.00226948666386306 
0.11174838244915 0.00242232764139771 
0.111256502568722 0.0130532924085855 
0.110355362296104 0.0139874396845698 
0.109306640923023 0.0183738525956869 
0.107651829719543 0.0134344594553113 
0.106079027056694 0.0190393663942814 
0.104365147650242 0.0215637851506472 
0.10241974145174 0.0251778941601515 
0.100336723029613 0.0227892305701971 
0.0982204377651215 0.0185202304273844 
0.0962986871600151 0.0223370008170605 
0.0944990962743759 0.0222156010568142 
0.0927291885018349 0.0301807709038258 
0.0913206860423088 0.0338599719107151 
0.0898426994681358 0.0271945502609015 
0.0882533043622971 0.0149310417473316 
0.0867651775479317 0.00518767395988107 
0.0849791541695595 0.00902220048010349 
0.0832846015691757 0.00882966350764036 
0.0812892913818359 0.0154007617384195 
0.0791322141885757 0.0144152082502842 
0.0769682377576828 0.0147336721420288 
0.0748884305357933 0.010566558688879 
0.0728136822581291 0.00664699729532003 
0.0705828219652176 0.0056653106585145 
0.0680984109640121 5.33910606463905e-05 
0.0657361149787903 -0.00131437927484512 
0.0633463338017464 -0.00772995827719569 
0.060714814811945 -0.011949585750699 
0.0581692047417164 -0.0208398550748825 
0.0555471479892731 -0.0254110042005777 
0.0531269311904907 -0.0313543379306793 
0.0504788756370544 -0.0282015390694141 
0.0479910150170326 -0.0340931415557861 
0.0454575791954994 -0.0351117551326752 
0.0430116727948189 -0.0460416823625565 
0.0403828471899033 -0.0491527579724789 
0.0377851352095604 -0.0597973018884659 
0.0352088995277882 -0.0624377131462097 
0.0326424352824688 -0.0669260919094086 
0.0298396293073893 -0.0672980919480324 
0.0269098412245512 -0.0691497549414635 
0.0240581557154655 -0.0705857202410698 
0.021415201947093 -0.0722645297646523 
0.0189496614038944 -0.0732309147715569 
0.0166058968752623 -0.0726440101861954 
0.0143909221515059 -0.0724497362971306 
0.0122569901868701 -0.0687442645430565 
0.0102724935859442 -0.0645921900868416 
0.0084687490016222 -0.0571584291756153 
0.00686411093920469 -0.0496855266392231 
0.00547846965491772 -0.0411653704941273 
0.00428557675331831 -0.0336714088916779 
0.003315937705338 -0.0263748914003372 
0.00253475992940366 -0.0204440634697676 
0.00193676026538014 -0.0154254194349051 
0.0014466445427388 -0.0113317733630538 
0.00106273463461548 -0.00717874430119991 
0.000787589291576296 -0.00405669258907437 
0.000616559525951743 -0.00218096096068621 
0.000477733003208414 -0.000957216660026461 
0.00036005035508424 -0.000175534310983494 
0.000282202730886638 0.0001328035723418 
0.000235070663620718 0.000172870175447315 
0.000205758246011101 0.000351735448930413 
0.000173601452843286 0.000328978465404361 
0.000158267561346292 1.78275695361663e-05 
0.000125493461382575 5.58829960937146e-05 
0.000107947271317244 0.000274003192316741 
8.16516694612801e-05 0.000693843292538077 
7.35016510589048e-05 0.000628874287940562 
5.54056641703937e-05 0.000684376165736467 
5.07691256643739e-05 0.000579357147216797 
4.59614093415439e-05 0.000486744509544224 
3.92315669159871e-05 0.000384904240490869 
3.48205103364307e-05 0.000210057580261491 
3.65240339306183e-05 0.000260065426118672 
3.39809375873301e-05 0.000155358895426616 
2.94903584290296e-05 9.0517700300552e-05 
1.49169582073228e-05 0.000156869646161795 
1.7299882529187e-05 0.000110102337202989 
2.08074452530127e-05 0.000160523632075638 
2.35593561228598e-05 0.000207415650947951 
