0 0 0 0 
0 0 0 0 
0 0 0 0 
0 0 0 0 
0 0 0 0 
0 0 0 0 
0 0 0 0 
0 0 0 0 
0 0 0 0 
0 0 0 0 
0.0126789230853319 0.000132868823129684 3.0905990570318e-05 5.13429085913231e-06 
0.0173612404614687 0.000190944570931606 3.37784003932029e-05 6.25264783593593e-06 
0.0220436826348305 0.000255310704233125 3.37021956511308e-05 6.71362158755073e-06 
0.0271868444979191 0.000324407883454114 3.2631192880217e-05 6.86704879626632e-06 
0.0333629697561264 0.000409557396778837 2.79665473499335e-05 6.33644503977848e-06 
0.0401928760111332 0.000503210176248103 2.05920969165163e-05 5.11233702127356e-06 
0.0473771318793297 0.000587992428336293 1.20745435197023e-05 3.32974741468206e-06 
0.054905116558075 0.000661556900013238 2.80310155176267e-06 1.3220649179857e-06 
0.0626671016216278 0.000717392191290855 -6.03124271947308e-06 -2.10751082363458e-07 
0.070118635892868 0.000736048677936196 -1.16559385787696e-05 -1.15326281502348e-06 
0.0776244103908539 0.000725486665032804 -1.45325129778939e-05 -1.62264325354045e-06 
0.0854615047574043 0.00069212878588587 -1.66051559062907e-05 -1.69958559581573e-06 
0.0936229601502419 0.000638352357782423 -1.64363900694298e-05 -1.10323765056819e-06 
0.101516388356686 0.000570546952076256 -1.57997874339344e-05 -8.86678776623739e-07 
0.109104976058006 0.000495439453516155 -1.54453045979608e-05 -8.69070788667159e-07 
0.116331502795219 0.000419303076341748 -1.31730776047334e-05 -1.12609313873691e-06 
0.12321700155735 0.000351971917552873 -9.3698681666865e-06 -1.29376576296636e-06 
0.129846706986427 0.000289075833279639 -8.4809598774882e-06 -1.47936577832297e-06 
0.136215776205063 0.000233081416809 -4.09819449487259e-06 -1.42814076298237e-06 
0.142159700393677 0.000185505909030326 -3.63485327170565e-07 -1.69223460488865e-06 
0.147584527730942 0.000145876401802525 5.09157246142422e-07 -1.63363563387975e-06 
0.152422517538071 0.00011154028470628 4.01064625066283e-07 -1.51819119764696e-06 
0.15641313791275 8.51625736686401e-05 1.81977520696819e-06 -1.70345651895332e-06 
0.159565612673759 6.92210232955404e-05 -3.13337704938021e-06 -1.79398182353907e-06 
0.162254855036736 5.43330606888048e-05 -9.00475424714386e-06 -1.2260392168173e-06 
0.164865493774414 3.51546841557138e-05 -1.22871379062417e-05 -6.32221997420856e-07 
0.167500749230385 1.20568183774594e-05 -1.18725629363325e-05 -1.37405990585648e-07 
0.170187830924988 -1.73950429598335e-05 -8.44423357193591e-06 -3.41622872213065e-08 
0.1730767339468 -5.71715245314408e-05 5.70717645587138e-07 -8.52858728084271e-10 
0.175670191645622 -8.75353434821591e-05 1.19788564916234e-05 -4.40754973851654e-07 
0.177556484937668 -0.000118719886813778 2.25043986574747e-05 -1.04235880371562e-06 
0.178592458367348 -0.000146138481795788 2.62418852798874e-05 -1.88592105132557e-06 
0.178892612457275 -0.000156672685989179 2.78987408819376e-05 -1.43916895467555e-06 
0.178305938839912 -0.000166097932378761 2.86448503175052e-05 -1.23498807624856e-06 
0.177073612809181 -0.000182334770215675 2.66950482910033e-05 -1.28027386381291e-06 
0.175371497869492 -0.00019652207265608 2.29775869229343e-05 -6.56716508729005e-07 
0.173384919762611 -0.000199859845452011 2.25863441301044e-05 -2.72657558753053e-07 
0.170726835727692 -0.000210280471947044 2.20284600800369e-05 -1.24443727145263e-06 
0.167546153068542 -0.000216563799767755 1.78800910362042e-05 -1.01200680546754e-06 
0.164427503943443 -0.000217911423533224 1.3827510883857e-05 -1.2050089708282e-06 
0.160831093788147 -0.000212710394407623 1.11384224510402e-05 -5.23500887084083e-07 
0.156701222062111 -0.0002193930267822 1.02890298876446e-05 -1.30785593910332e-07 
0.152292132377625 -0.000214027779293247 6.02336785959778e-06 1.05103868008882e-06 
0.147318586707115 -0.000211483566090465 5.03812725582975e-06 1.3000828857912e-06 
0.14166048169136 -0.000200440685148351 5.57137445866829e-06 2.17259776036371e-06 
0.13563896715641 -0.000199258109205402 4.346306923253e-06 1.83160648248304e-06 
0.129363238811493 -0.000187638550414704 1.24945063362247e-06 2.35409515880747e-06 
0.122959949076176 -0.00018247750995215 -7.07680555933621e-07 2.32876709560514e-06 
0.116861663758755 -0.000175461274920963 -3.64679226549924e-06 2.18944887819816e-06 
0.110718086361885 -0.000174729022546671 -7.28784061720944e-06 2.19944809032313e-06 
0.104624316096306 -0.000164219061844051 -1.11500021375832e-05 1.78744937784359e-06 
0.0984719917178154 -0.000156015652464703 -1.46020265674451e-05 1.4609811387345e-06 
0.0922300890088081 -0.000151704807649367 -1.82419789780397e-05 1.12400823581993e-06 
0.085822120308876 -0.000144316669320688 -2.23338520299876e-05 9.2951819397058e-07 
0.0793133899569511 -0.000137776180054061 -2.41878060478484e-05 9.10159940303856e-07 
0.072845920920372 -0.00013187677541282 -2.52595691563329e-05 1.27986186271301e-06 
0.06658985465765 -0.000127379695186391 -2.65143862634432e-05 1.15213424578542e-06 
0.0607467293739319 -0.000119947602797765 -2.60025753959781e-05 1.57992144522723e-06 
0.055479671806097 -0.000112124638690148 -2.45422979787691e-05 2.01236071006861e-06 
0.0507910773158073 -0.000103881837276276 -2.41832840401912e-05 2.22952053263725e-06 
0.0467332042753696 -9.70758919720538e-05 -2.41461802943377e-05 2.25420899369055e-06 
0.0432005114853382 -8.85694535099901e-05 -2.44892617047299e-05 2.76644209407095e-06 
0.0401692017912865 -8.23247610242106e-05 -2.49330096266931e-05 2.7365476853447e-06 
0.0375256724655628 -7.48107777326368e-05 -2.49094882747158e-05 2.37871381614241e-06 
0.0351898968219757 -7.15446221875027e-05 -2.44415932684205e-05 2.21860614146863e-06 
0.033095583319664 -6.59821089357138e-05 -2.36609193962067e-05 2.2356125555234e-06 
0.0312802083790302 -6.22511797701009e-05 -2.24737414100673e-05 2.12338500205078e-06 
0.0296051762998104 -6.0449823649833e-05 -2.03684448933927e-05 2.12707664104528e-06 
0.0280731115490198 -5.93093391216826e-05 -1.96494056581287e-05 2.48231117438991e-06 
0.0266390740871429 -5.69528892810922e-05 -1.89488091564272e-05 2.58398972619034e-06 
0.0252411141991615 -5.36435181857087e-05 -1.84296950465068e-05 2.40139638663095e-06 
0.0238866880536079 -5.30346223968081e-05 -1.77183082996635e-05 2.12640384233964e-06 
0.0225721057504416 -5.01621907460503e-05 -1.73694788827561e-05 1.96203586710908e-06 
0.021268492564559 -4.91514183522668e-05 -1.65203873621067e-05 1.67880045864877e-06 
0.0200253129005432 -4.51825799245853e-05 -1.65201072377386e-05 1.41013299526094e-06 
0.0188434962183237 -4.35911897511687e-05 -1.58290604304057e-05 1.40768759138155e-06 
0.0176858380436897 -4.06966028094757e-05 -1.52738975884859e-05 1.38802670335281e-06 
0.0166416391730309 -3.75131785403937e-05 -1.48744466059725e-05 1.20707056794345e-06 
0.0157136451452971 -3.48104986187536e-05 -1.44734885907383e-05 1.14031558950956e-06 
0.0149131156504154 -3.28094938595314e-05 -1.35905656861723e-05 1.07443543129193e-06 
0.0142429349943995 -3.16991281579249e-05 -1.30583885038504e-05 1.04407877188351e-06 
0.0137179074808955 -3.04559944197536e-05 -1.29198715512757e-05 1.0576874274193e-06 
0.0132950386032462 -3.02714488498168e-05 -1.24279813462636e-05 1.03914737792365e-06 
0.0129679404199123 -2.95135159831261e-05 -1.1976341738773e-05 8.70119379214884e-07 
0.0127246538177133 -2.92596087092534e-05 -1.1786728464358e-05 7.96998506302771e-07 
0.0125675080344081 -2.83813769783592e-05 -1.16444898594636e-05 5.66300116133789e-07 
0.012477595359087 -2.80810872936854e-05 -1.16585006253445e-05 4.09706984783043e-07 
0.0124566415324807 -2.89743638859363e-05 -1.17287499961094e-05 3.63913869705357e-07 
0.0125108230859041 -2.98297291010385e-05 -1.1972316315223e-05 4.10930454108893e-07 
0.0126076200976968 -3.02977114188252e-05 -1.23840727610514e-05 3.69775136732642e-07 
0.0127478670328856 -3.13827513309661e-05 -1.27175781017286e-05 2.46674659365453e-07 
0.0128938145935535 -3.18358543154318e-05 -1.27860075735953e-05 2.2672783472899e-07 
0.0130547033622861 -3.13764139718842e-05 -1.29698964883573e-05 1.73267878267325e-07 
0.0132021056488156 -2.99871280731168e-05 -1.3242635759525e-05 1.25993802058133e-08 
0.0133287366479635 -3.01604541164124e-05 -1.28059418784687e-05 7.79858737587347e-08 
0.0133638456463814 -2.98230770567898e-05 -1.23097388495808e-05 1.8673158308502e-07 
0.0133729260414839 -2.90301759378053e-05 -1.15572784125106e-05 1.38903985202887e-07 
0.0133382584899664 -2.80081421806244e-05 -1.12472052933299e-05 1.67001218187579e-07 
0.0132577894255519 -2.68661460722797e-05 -1.08722433651565e-05 1.95195468677412e-07 
0.0131616573780775 -2.54749556916067e-05 -1.08605363493552e-05 1.16750804579624e-07 
0.013111942447722 -2.4127957658493e-05 -1.05269955383847e-05 1.32622986370734e-07 
0.0130645837634802 -2.33467289945111e-05 -1.01181612990331e-05 1.82389584324483e-07 
0.012999108992517 -2.26468218897935e-05 -9.84348935162416e-06 1.0759222135448e-07 
0.0129685085266829 -2.19514804484788e-05 -8.9863042376237e-06 -7.1475412255495e-09 
0.012947216629982 -2.15248910535593e-05 -8.31858505989658e-06 -2.1623705492857e-08 
0.0129362717270851 -2.08391447813483e-05 -8.24199833004968e-06 -7.31760536609727e-08 
0.0129432985559106 -1.97339068108704e-05 -8.39976473798743e-06 -2.25955091082142e-07 
0.0129705453291535 -1.90663795365253e-05 -8.16747888165992e-06 -3.29547617639037e-07 
0.012994360178709 -1.84557648026384e-05 -8.51123422762612e-06 -3.51640125018093e-07 
0.0129836816340685 -1.71731226146221e-05 -8.49585467221914e-06 -4.03229819312401e-07 
0.0129647422581911 -1.54382578330114e-05 -8.10778419690905e-06 -4.88341470372688e-07 
0.0129389800131321 -1.39946941999369e-05 -7.65912864153506e-06 -4.75402941901848e-07 
0.0128857921808958 -1.17071858767304e-05 -7.2801244641596e-06 -6.18109993411053e-07 
0.0127842640504241 -1.04890623333631e-05 -6.93939318807679e-06 -6.55571000152122e-07 
0.0126902516931295 -8.54196332511492e-06 -6.71292673359858e-06 -8.5106006508795e-07 
0.0125565379858017 -6.9207499109325e-06 -6.89337730364059e-06 -1.00718318662985e-06 
0.0124021163210273 -4.55567578683258e-06 -6.91182640366605e-06 -1.161821273854e-06 
0.0122126024216413 -2.92804816126591e-06 -6.70387362333713e-06 -1.08307847312972e-06 
0.0119997542351484 -1.2790300161214e-06 -6.66014557282324e-06 -1.16262435767567e-06 
0.0117775108665228 1.15825598001607e-08 -6.63147557133925e-06 -1.3280865687193e-06 
0.0115292351692915 5.50153799849795e-07 -6.3148813751468e-06 -1.40889767408225e-06 
0.0111997053027153 1.11608392217022e-06 -6.18953481534845e-06 -1.56768453507539e-06 
0.0108717940747738 2.13573866858496e-06 -6.40261669104802e-06 -1.87009607088839e-06 
0.0105058737099171 4.31619582741405e-06 -6.23579762759618e-06 -2.10451230486797e-06 
0.0100916903465986 5.64011997994385e-06 -6.23000414634589e-06 -2.1033897610323e-06 
0.00963135063648224 7.423840543197e-06 -5.89156661590096e-06 -2.36427035815723e-06 
0.00917019229382277 8.66091977513861e-06 -5.87388058193028e-06 -2.5575100153219e-06 
0.00863473024219275 9.94378387986217e-06 -5.674390195054e-06 -2.64507116298773e-06 
0.00808137562125921 1.07916348497383e-05 -5.57570956516429e-06 -2.76457490144821e-06 
0.00748379249125719 1.22315041153342e-05 -5.23347944181296e-06 -2.95321774501645e-06 
0.00685680378228426 1.44979831020464e-05 -4.89958756588749e-06 -2.96650296149892e-06 
0.00615798821672797 1.66539448400727e-05 -4.10978736908874e-06 -2.8828749236709e-06 
0.00544317252933979 1.86892993951915e-05 -3.10901054945134e-06 -2.81767756860063e-06 
0.0047093559987843 2.01319362531649e-05 -1.78856510046899e-06 -2.69819975073915e-06 
0.00398027757182717 2.15847103390843e-05 -3.09787424157548e-07 -2.53307371167466e-06 
0.00327424705028534 2.24773357331287e-05 1.15923126031703e-06 -2.2830497528048e-06 
0.00263845222070813 2.38185712078121e-05 2.63943002209999e-06 -2.09731138056668e-06 
0.00207531196065247 2.45653500314802e-05 4.10733991884626e-06 -1.85882424830197e-06 
0.00157955335453153 2.49939475907013e-05 5.38023141416488e-06 -1.60028139362112e-06 
0.00115517911035568 2.48468531935941e-05 6.33643458058941e-06 -1.32929551455163e-06 
0.000811244128271937 2.38880729739321e-05 7.05160073266597e-06 -1.11603571895103e-06 
0.000543934525921941 2.16665594052756e-05 7.37569234843249e-06 -9.04210139651695e-07 
0.000330215174471959 1.98274374270113e-05 7.5590651249513e-06 -7.38410165013192e-07 
0.000173693741089664 1.78037498699268e-05 7.70313363318564e-06 -5.82520215175464e-07 
5.12439000885934e-05 1.63973436428932e-05 7.85693737270776e-06 -4.4958159151065e-07 
-3.65347295883112e-05 1.50639552884968e-05 8.03212424216326e-06 -3.40437367185586e-07 
-0.000107440799183678 1.45410404002178e-05 8.23681693873368e-06 -2.6087079163517e-07 
-0.000155534755322151 1.3784995644528e-05 8.31909528642427e-06 -2.09164412012797e-07 
-0.000190456878044643 1.32867244246881e-05 8.38827509141993e-06 -1.77027374093086e-07 
-0.000208305631531402 1.24507550935959e-05 8.25326878839405e-06 -1.55823656200482e-07 
-0.000219617955735885 1.18251555250026e-05 8.00766065367498e-06 -1.43916651040854e-07 
-0.000219271285459399 1.09506145236082e-05 7.6811020335299e-06 -1.28709871205501e-07 
-0.000216642452869564 1.03117818071041e-05 7.29047906133928e-06 -1.17533552668192e-07 
-0.000212377344723791 9.61006298894063e-06 6.81199935570476e-06 -9.73469269638372e-08 
-0.000205000498681329 9.00438590178965e-06 6.49825869913911e-06 -8.84263542388908e-08 
-0.000193925312487409 8.28543488751166e-06 6.16565694144811e-06 -7.75581270318071e-08 
-0.000185299388249405 7.71787745179608e-06 5.81337144467398e-06 -6.68598332254078e-08 
-0.000175312859937549 7.23204038877157e-06 5.56376653548796e-06 -6.11574151321292e-08 
-0.000167007208801806 6.7546156969911e-06 5.36976949661039e-06 -6.11149459928129e-08 
-0.000159808274474926 6.41488350083819e-06 5.1516017265385e-06 -4.86227840212905e-08 
-0.00015998599701561 6.25633174422546e-06 4.91309219796676e-06 -4.67051499697391e-08 
0 0 0 0 
0 0 0 0 
0 0 0 0 
0 0 0 0 
0 0 0 0 
0 0 0 0 
0 0 0 0 
0 0 0 0 
0 0 0 0 
0 0 0 0 
0 0 0 0 
0 0 0 0 
0 0 0 0 
0 0 0 0 
99.7305374145508 0.245400115847588 0.0181162841618061 0.00234486511908472 
