0 0 0 0 
0 0 0 0 
0 0 0 0 
0 0 0 0 
0 0 0 0 
0 0 0 0 
0 0 0 0 
0 0 0 0 
0 0 0 0 
0 0 0 0 
0.0244839414954185 6.13286320003681e-05 4.44119723397307e-06 2.77847880170157e-06 
0.0330492816865444 6.81696037645452e-05 7.70737460698001e-06 2.80565313914849e-06 
0.0415169261395931 6.50895890430547e-05 1.15677830763161e-05 1.8940307882076e-06 
0.0499985031783581 6.31363654974848e-05 1.38867853820557e-05 1.31135618630651e-06 
0.0592434778809547 5.83733053645119e-05 1.48187564263935e-05 5.39575125912961e-07 
0.0691219791769981 5.00567839480937e-05 1.51949698192766e-05 -3.9667673945587e-07 
0.078862652182579 4.10013090004213e-05 1.4085568182054e-05 -1.20533979952597e-06 
0.0882477760314941 3.35494805767667e-05 1.17101853902568e-05 -1.62484138854779e-06 
0.0969361662864685 2.68276235146914e-05 9.13178155315109e-06 -1.79177573045308e-06 
0.10428012907505 2.10010693990625e-05 6.83217285768478e-06 -1.79862206550752e-06 
0.110149435698986 1.65001547429711e-05 3.93167920265114e-06 -1.68239182585239e-06 
0.115221172571182 1.38011473609367e-05 1.42587373375136e-06 -1.44897455811588e-06 
0.119774378836155 9.39704568736488e-06 -8.31450222449348e-07 -1.10749772375129e-06 
0.123776003718376 5.64165202376898e-06 -2.56103453466494e-06 -9.44009855174954e-07 
0.12740433216095 3.31158094013517e-06 -3.569091177269e-06 -9.1037281890749e-07 
0.130772098898888 2.57758620136883e-06 -4.38319921158836e-06 -7.07838182734122e-07 
0.134084925055504 3.61374577551032e-06 -5.43723172086175e-06 -3.59068735633628e-07 
0.137569040060043 4.79597019875655e-06 -5.61838442081353e-06 -6.65338973249163e-07 
0.140936195850372 6.38544452158385e-06 -6.26705832473817e-06 -5.39694042345218e-07 
0.144260734319687 6.92509229338611e-06 -6.4530290728726e-06 -7.18285491529969e-07 
0.147421136498451 6.95338394507417e-06 -7.14191310180468e-06 -6.35304957086191e-07 
0.150169506669044 5.16612590217846e-06 -6.3045722527022e-06 -3.70617556200159e-07 
0.152476131916046 4.46459671366028e-06 -6.14850659985677e-06 2.3904092927296e-07 
0.154671251773834 3.8588909774262e-06 -5.38608901479165e-06 2.59654768797191e-07 
0.156567007303238 3.11040002998197e-06 -5.02789634992951e-06 6.34275011179852e-07 
0.158473387360573 2.74918897957832e-06 -3.99969030695502e-06 7.95830544575438e-07 
0.160422891378403 3.38298696078709e-06 -4.141806584812e-06 5.6425625416523e-07 
0.162326827645302 3.77415244656731e-06 -3.65743994734657e-06 5.48144441836484e-07 
0.164182215929031 3.95350616599899e-06 -4.23635219704011e-06 5.22803645708336e-07 
0.16577884554863 3.68975520359527e-06 -4.08060031986679e-06 2.67536137243951e-07 
0.166795998811722 3.94824746763334e-06 -3.97157600673381e-06 1.41143360110618e-07 
0.16725954413414 3.21281913784333e-06 -3.65710070582281e-06 2.63403308053967e-07 
0.167277097702026 3.2796626783238e-06 -3.40683027388877e-06 -2.23422475187363e-07 
0.166713207960129 3.00367355521303e-06 -1.79866538019269e-06 -1.70745551031359e-07 
0.165779560804367 1.17164404400683e-06 -1.33202286178857e-06 -4.92220920023101e-07 
0.164548441767693 -3.45366487408683e-07 -5.85396584540376e-08 -7.52123128222593e-07 
0.16296498477459 -1.97635495169379e-06 -4.12005732641774e-07 -1.45524961681076e-06 
0.160888582468033 -3.57130306838371e-06 1.28214037431462e-06 -8.5334988852992e-07 
0.158737272024155 -4.74544549433631e-06 8.30148394470598e-07 -1.22440644645394e-06 
0.15603044629097 -4.0718828131503e-06 1.11182237105822e-06 -1.19532899134356e-06 
0.153001710772514 -3.73469265468884e-06 -1.27886778500397e-07 -1.08038591406512e-06 
0.149892315268517 -5.00073610965046e-06 1.39652343023045e-06 -8.5602289345843e-07 
0.146442279219627 -5.98164115217514e-06 4.32183284715393e-08 -1.17358308671101e-06 
0.142251461744308 -9.39949222811265e-06 1.1557399375306e-06 -8.66885784489568e-07 
0.137721255421638 -1.50592713907827e-05 1.11873418973119e-06 1.18199153575915e-07 
0.132724389433861 -1.79946564458078e-05 2.37854942497506e-06 5.62884451937862e-07 
0.127266570925713 -2.2122496375232e-05 2.46228069045173e-06 1.0897498441409e-06 
0.121549420058727 -2.53959860856412e-05 3.57766589331732e-06 1.13027942916233e-06 
0.115982338786125 -2.73147124971729e-05 3.82697544409893e-06 1.16491503376892e-06 
0.110364310443401 -2.69288011622848e-05 4.7589305722795e-06 9.68999529504799e-07 
0.10477077960968 -2.94950350507861e-05 5.686549229722e-06 7.79877723289246e-07 
0.0990164205431938 -2.88653445750242e-05 6.0774723351642e-06 9.27711994336278e-07 
0.0932986438274384 -2.94150977424579e-05 6.24792073722347e-06 1.51333642861573e-06 
0.0873428657650948 -3.005228973052e-05 7.10016365701449e-06 1.57061742811493e-06 
0.0812431946396828 -2.96192720270483e-05 7.28297027308145e-06 1.47206014844414e-06 
0.0750793442130089 -2.91529868263751e-05 7.40348923500278e-06 1.67595499078743e-06 
0.0690861120820045 -2.76738428510725e-05 7.43946793591022e-06 1.70352461736911e-06 
0.0633566156029701 -2.63268866547151e-05 7.40088717066101e-06 1.39658970965684e-06 
0.0580701567232609 -2.40629215113586e-05 6.59687611914705e-06 1.62204617026873e-06 
0.0535051710903645 -2.28872304433025e-05 5.88597640671651e-06 1.71787462477369e-06 
0.049508199095726 -2.03075505851302e-05 5.04446052218555e-06 1.64421498993761e-06 
0.0460611023008823 -1.943287497852e-05 4.05852688345476e-06 1.61450225277804e-06 
0.0430691987276077 -1.73445605469169e-05 3.24165898746287e-06 1.47541118167283e-06 
0.0404413379728794 -1.53014352690661e-05 2.72176657745149e-06 1.32660863982892e-06 
0.0380133800208569 -1.28540705190971e-05 2.37218387155735e-06 1.28286399103672e-06 
0.0359119139611721 -1.14195026981179e-05 1.78111440618522e-06 1.25257724903349e-06 
0.0340821109712124 -8.8679562395555e-06 1.53725818563544e-06 1.10974815470399e-06 
0.0324065573513508 -8.00430734670954e-06 1.34040908505995e-06 9.32609850679e-07 
0.0309057757258415 -6.99681277183117e-06 8.97498296126287e-07 7.31804334463959e-07 
0.0295647550374269 -6.46704120299546e-06 7.5265717214279e-07 5.32775345618575e-07 
0.0282246693968773 -5.69417579754372e-06 5.32450712853461e-07 4.39269484786564e-07 
0.026841452345252 -5.07342747368966e-06 9.18955862516668e-08 3.52215892007735e-07 
0.0255414880812168 -3.98959537051269e-06 -3.94080132082308e-07 4.05869258202074e-07 
0.0242006964981556 -3.04708646581275e-06 -7.0415831032733e-07 4.57842901369077e-07 
0.0228874925523996 -1.67043958754221e-06 -1.09196150788193e-06 5.00262274272245e-07 
0.0215858053416014 -3.65537715651953e-07 -1.24913913168712e-06 4.358895751011e-07 
0.0203489512205124 1.01472380720224e-06 -1.51493895828025e-06 3.39278898309203e-07 
0.0191582944244146 2.54741189564811e-06 -1.67299219810957e-06 3.2822015327838e-07 
0.0180755034089088 4.10575557907578e-06 -2.03161494027881e-06 2.87291982203897e-07 
0.0170636940747499 5.50931326870341e-06 -2.47651769313961e-06 2.56818537991421e-07 
0.0162135493010283 6.72257010592148e-06 -3.12115480483044e-06 2.71957986797133e-07 
0.0154622467234731 7.94622974353842e-06 -3.46164597431198e-06 2.3177577190836e-07 
0.0147937033325434 9.12659288587747e-06 -3.85741122954641e-06 2.89919057649968e-07 
0.0142629621550441 9.71365989244077e-06 -4.01603256250382e-06 2.09314634957991e-07 
0.0138069437816739 1.03582369774813e-05 -4.17526734963758e-06 2.92765378162585e-07 
0.0134261725470424 1.09062311821617e-05 -4.16993907492724e-06 2.75404573812921e-07 
0.0131254242733121 1.12121524580289e-05 -4.18274066760205e-06 3.33883264147516e-07 
0.0128888068720698 1.16323853944778e-05 -4.39025052401121e-06 2.85747177031226e-07 
0.0126806022599339 1.2275505469006e-05 -4.54317796538817e-06 4.00566534608515e-07 
0.0125424955040216 1.25407059385907e-05 -4.7324374463642e-06 3.53955158516328e-07 
0.0124087752774358 1.26601662486792e-05 -4.88080831928528e-06 3.86220477821553e-07 
0.0122880898416042 1.29988566186512e-05 -5.02288185089128e-06 4.12225091395158e-07 
0.0121766095981002 1.34977553898352e-05 -4.97997552884044e-06 4.2371101471872e-07 
0.0120081538334489 1.35612281155773e-05 -5.1326437642274e-06 4.77907633467112e-07 
0.0117941293865442 1.38125105877407e-05 -4.93822653879761e-06 5.64994365959137e-07 
0.0115149803459644 1.40402826218633e-05 -5.09651590618887e-06 6.24076108124427e-07 
0.0111579932272434 1.40025322252768e-05 -5.04542322232737e-06 6.35387948477728e-07 
0.0107261687517166 1.3437637790048e-05 -5.11617690790445e-06 7.04726915046194e-07 
0.0102675221860409 1.33051153170527e-05 -5.01800650454243e-06 7.18475348548964e-07 
0.00977514870464802 1.28125629998976e-05 -5.06459446114604e-06 6.82978281929536e-07 
0.00927406083792448 1.24409743875731e-05 -4.88119894725969e-06 7.28513782632945e-07 
0.00877635180950165 1.1990864550171e-05 -4.77571347801131e-06 7.66799473694846e-07 
0.00829784199595451 1.175491433969e-05 -4.69516908196965e-06 7.6031352591599e-07 
0.00785763189196587 1.13935548142763e-05 -4.51595860795351e-06 7.60536977395532e-07 
0.00744212372228503 1.10975115603651e-05 -4.47775028078468e-06 8.03268392246537e-07 
0.00706151640042663 1.06129318737658e-05 -4.25119105784688e-06 7.49850357806281e-07 
0.00674095517024398 1.03733900687075e-05 -4.0896870814322e-06 7.63550247029343e-07 
0.00645459583029151 1.00130473583704e-05 -4.00362250729813e-06 7.80135337663523e-07 
0.00620164070278406 9.80744061962469e-06 -4.01766374125145e-06 7.79544166107371e-07 
0.00597818475216627 9.49665991356596e-06 -4.04914953833213e-06 7.64458150115388e-07 
0.00579632958397269 9.50373396335635e-06 -4.13010639022104e-06 7.99721192379366e-07 
0.0056349067017436 9.54348615778144e-06 -4.21853837906383e-06 8.29980933758634e-07 
0.0054978197440505 9.45438659982756e-06 -4.11909786635078e-06 8.29508792321576e-07 
0.00536287995055318 9.25183212530101e-06 -4.12839654018171e-06 8.46884120164759e-07 
0.00525266584008932 9.10821381694404e-06 -4.05289119953522e-06 8.47566866468696e-07 
0.00515274470672011 8.79281014931621e-06 -3.98655447497731e-06 8.26417988264438e-07 
0.00506431562826037 8.45180329633877e-06 -3.82757434636005e-06 8.06510001893912e-07 
0.00497856363654137 8.33437752589816e-06 -3.79216771762003e-06 8.00141947365773e-07 
0.00490322476252913 8.10725032351911e-06 -3.654618467408e-06 7.66393782214436e-07 
0.00481052277609706 7.76732395024737e-06 -3.62799823960813e-06 7.65405502534122e-07 
0.00471308268606663 7.38760991225718e-06 -3.58010652234952e-06 7.99822430508357e-07 
0.00459026312455535 6.7938631218567e-06 -3.64056563739723e-06 8.10551171070983e-07 
0.00445839436724782 6.3546149249305e-06 -3.72671547665959e-06 8.5507684843833e-07 
0.00429654493927956 6.01745250605745e-06 -3.74448404727445e-06 9.09507264168496e-07 
0.00411406205967069 5.69158692087512e-06 -3.69215354112384e-06 9.35574234972592e-07 
0.00390368956141174 5.70102702113218e-06 -3.69739041161665e-06 9.2432532028397e-07 
0.0036729066632688 5.41361850991962e-06 -3.57324211108789e-06 9.24618632325291e-07 
0.0034204691182822 4.95230096930754e-06 -3.3858239021356e-06 8.7595566355958e-07 
0.00315585802309215 4.46809872300946e-06 -3.16251862386707e-06 8.40887764752551e-07 
0.00288336118683219 4.0737550079939e-06 -2.98940335596853e-06 8.17450313661539e-07 
0.00259523140266538 3.38149038725533e-06 -2.89047170554113e-06 8.00501823050581e-07 
0.00230073090642691 3.22923415296827e-06 -2.88254864244664e-06 7.73097724504623e-07 
0.00197330256924033 2.98542613563768e-06 -2.77651975011395e-06 7.38412154532853e-07 
0.00165363925043494 2.92008007818367e-06 -2.80975996247435e-06 6.90158174165845e-07 
0.00134554470423609 3.00669375974394e-06 -2.68286839855136e-06 6.10937036071846e-07 
0.00107379967812449 3.28577198160929e-06 -2.55673148785718e-06 5.11539781200554e-07 
0.000848707277327776 3.53110908690724e-06 -2.53905727731762e-06 4.17266932117855e-07 
0.000682156009133905 3.7135212096473e-06 -2.39101404986286e-06 3.37760241109208e-07 
0.000554441940039396 3.77954370378575e-06 -2.31610783885117e-06 2.60430653042931e-07 
0.000460189941804856 3.74680735149013e-06 -2.17795923163067e-06 2.1109580927714e-07 
0.000389690074371174 3.71185774383775e-06 -2.12561508305953e-06 1.87540024398913e-07 
0.000335661956341937 3.56345162799698e-06 -1.98392058337049e-06 1.53017438719871e-07 
0.000300061888992786 3.58021156898758e-06 -2.0781726561836e-06 1.50748547866897e-07 
0.00026969489408657 3.55248971573019e-06 -2.03810100174451e-06 1.46602502582027e-07 
0.000248298398219049 3.52519032276177e-06 -2.07517655326228e-06 1.30750322568929e-07 
0.000222259521251544 3.24453912980971e-06 -1.98118118532875e-06 1.16726901921993e-07 
0.000202730429009534 3.14667181555706e-06 -1.88822457403148e-06 1.08518662500501e-07 
0.000191936458577402 3.14584622174152e-06 -1.8627378040037e-06 9.62963468964517e-08 
0.000190964710782282 3.3334988529532e-06 -1.86449346983864e-06 8.80868995523088e-08 
0.000182986506843008 3.19677542393038e-06 -1.94217068383296e-06 9.48768956732238e-08 
0.000185545242857188 3.51303060597274e-06 -1.98538236872992e-06 9.88725687989245e-08 
0.000179023103555664 3.50593813891464e-06 -2.02013416128466e-06 1.07736106258471e-07 
0.000169015256687999 3.48444837072748e-06 -1.94135418496444e-06 1.05136791717086e-07 
0.000143154844408855 2.86025010609592e-06 -1.75732145635266e-06 9.55798427071386e-08 
0.000135524023789912 2.83104236586951e-06 -1.62254707447573e-06 9.48969542946543e-08 
0.000114161339297425 2.29335341828119e-06 -1.45838214393734e-06 7.86924800877387e-08 
0.000106045474240091 2.1627527075907e-06 -1.3040485100646e-06 7.35454364075849e-08 
9.62070553214289e-05 1.85294231869193e-06 -1.22783899314527e-06 7.20332877790497e-08 
0.000100588251370937 2.09647555493575e-06 -1.2360279697532e-06 7.34467135998784e-08 
0.000104678772913758 2.32932143262587e-06 -1.21292566745979e-06 7.77727322542887e-08 
0.000111697343527339 2.54525298259978e-06 -1.24250732369546e-06 6.26247000923286e-08 
0 0 0 0 
0 0 0 0 
0 0 0 0 
0 0 0 0 
0 0 0 0 
0 0 0 0 
0 0 0 0 
0 0 0 0 
0 0 0 0 
0 0 0 0 
0 0 0 0 
0 0 0 0 
0 0 0 0 
0 0 0 0 
99.9695205688477 0.0214700009673834 0.00589666049927473 0.00112467037979513 
