0 0 0 0 
0 0 0 0 
0 0 0 0 
0 0 0 0 
0 0 0 0 
0 0 0 0 
0 0 0 0 
0 0 0 0 
0 0 0 0 
0 0 0 0 
-0.000311016949126497 -1.4747483589872e-07 -1.59704450197751e-06 -3.53680491116393e-07 
-0.000264858943410218 -2.78705755363262e-07 -1.59103512942238e-06 -3.49480330896768e-07 
-0.000193166677490808 -6.81048788919725e-07 -1.75377238065266e-06 -4.69372139377811e-07 
-1.47063001350034e-05 -1.09054849417589e-06 -2.07820517061919e-06 -5.79342554374307e-07 
0.000416425988078117 -1.47015521179128e-06 -2.51410779128491e-06 -6.77803768667218e-07 
0.00103401450905949 -1.63947129294684e-06 -2.79469600172888e-06 -7.2796314043444e-07 
0.00169835356064141 -1.55535440171661e-06 -2.90885509457439e-06 -7.33787942408526e-07 
0.00232378463260829 -1.24889697872277e-06 -2.79613391285238e-06 -6.9608279318345e-07 
0.0027868440374732 -8.26709140255844e-07 -2.48620017373469e-06 -5.89629792102642e-07 
0.00292852520942688 -4.18505720745088e-07 -2.04023558580957e-06 -4.83393250760855e-07 
0.00281779281795025 -1.40871833309575e-07 -1.71230988144089e-06 -4.04958115041154e-07 
0.00260805152356625 -4.14153582539711e-08 -1.5054780533319e-06 -3.4414659921822e-07 
0.00238632131367922 -2.62251251825774e-08 -1.39726159886777e-06 -3.06665128846362e-07 
0.00220821052789688 -3.20599014003164e-08 -1.30775163142971e-06 -2.75469176358456e-07 
0.00211065518669784 -6.09502990300825e-08 -1.30246564822301e-06 -2.45774714358049e-07 
0.00209918618202209 -1.20107088719124e-07 -1.31435774619604e-06 -2.16225458871122e-07 
0.00217179604806006 -1.5186184043614e-07 -1.34593574330211e-06 -2.08180978233941e-07 
0.00231401273049414 -1.70941305555061e-07 -1.38351765599509e-06 -1.90395255117437e-07 
0.00249438709579408 -1.52273713638351e-07 -1.4161355466058e-06 -1.59928021048472e-07 
0.00267859897576272 -1.34994650125009e-07 -1.39828512146778e-06 -1.44124115308841e-07 
0.00283789238892496 -6.91033221755788e-08 -1.37582776460476e-06 -1.44940372592828e-07 
0.00294190808199346 -1.78158092722924e-08 -1.35130062517419e-06 -1.26317900139838e-07 
0.00297077069990337 2.60010892816354e-08 -1.33632613597001e-06 -1.1669025923311e-07 
0.00291163055226207 4.32463913568881e-08 -1.40455301789189e-06 -1.58373111958099e-07 
0.00277878087945282 8.59496154248518e-08 -1.56668943418481e-06 -1.8565681614291e-07 
0.00264991307631135 5.73987932739328e-08 -1.74028696164896e-06 -1.92350086081206e-07 
0.00260602636262774 7.80972229108556e-08 -1.87209400337451e-06 -1.85397794894016e-07 
0.00269767828285694 7.22659834195838e-08 -2.00031308850157e-06 -1.5752303283989e-07 
0.0029934523627162 9.60200949862156e-08 -2.14947749554995e-06 -8.49813375225494e-08 
0.00358333601616323 1.27067252719826e-07 -2.35974925999471e-06 1.16573959374477e-08 
0.00453734304755926 1.32778822603541e-07 -2.71018711828219e-06 1.04136560707957e-07 
0.00598827563226223 6.76957512268928e-08 -3.3023752621375e-06 2.38307833910767e-07 
0.0081559494137764 -8.78158843420351e-08 -4.15299291489646e-06 3.21964506611039e-07 
0.0113168992102146 -3.4081838862221e-07 -5.14180965183186e-06 3.9962671394278e-07 
0.0156805254518986 -9.97979554995254e-07 -6.24846870778129e-06 4.6612029791504e-07 
0.0214531868696213 -1.65889741765568e-06 -7.18569299351657e-06 5.52118308405625e-07 
0.0286839343607426 -3.01061118079815e-06 -7.86303280619904e-06 5.7441997114438e-07 
0.0371408015489578 -4.398837518238e-06 -7.5850211942452e-06 6.17764726484893e-07 
0.046423465013504 -5.94364018979832e-06 -6.94813343216083e-06 6.117985549281e-07 
0.0561400130391121 -6.95957351126708e-06 -5.64610127185006e-06 2.26553638071891e-07 
0.0655247718095779 -7.95420874055708e-06 -3.84389841201482e-06 -2.50251197542184e-08 
0.0741540044546127 -7.26210009815986e-06 -1.63496963523357e-06 -1.30068301018582e-07 
0.0820160880684853 -7.41028907214059e-06 2.45334007331621e-07 -2.86155909634545e-07 
0.088873989880085 -7.01511726219906e-06 1.96970654542383e-06 -4.3188526888116e-07 
0.0946841984987259 -7.91659840615466e-06 3.61431580131466e-06 -2.6581372480905e-07 
0.0995966121554375 -8.32364185043843e-06 4.40742815044359e-06 -6.91859895596281e-07 
0.103843607008457 -8.60421187098837e-06 5.76497177462443e-06 -7.34332900265144e-07 
0.107451513409615 -8.58435487316456e-06 6.30382010058383e-06 -7.2008873530649e-07 
0.110508538782597 -8.44614260131493e-06 6.90476190357003e-06 -1.04663854472165e-06 
0.113184906542301 -6.98042140356847e-06 6.13834981777472e-06 -1.13718704142229e-06 
0.115710638463497 -6.6630245783017e-06 5.94027596889646e-06 -6.94073321483302e-07 
0.118056669831276 -7.54312941353419e-06 4.72434930998133e-06 -8.94042102572712e-07 
0.119976669549942 -7.93592425907264e-06 3.9554865907121e-06 -5.71846101138362e-07 
0.121777229011059 -7.20349544280907e-06 2.49642380367732e-06 -1.79330186256266e-07 
0.12322673946619 -7.27121459931368e-06 1.28950091493607e-06 1.65131481821845e-07 
0.124300442636013 -6.30476961305249e-06 2.26345093778946e-07 2.61651081245873e-07 
0.124987743794918 -5.1479592002579e-06 -5.57952660074079e-07 7.35614946734131e-07 
0.125349089503288 -3.75277363673376e-06 -1.62683659254981e-06 4.79734183045366e-07 
0.125507354736328 -3.9510523492936e-06 -1.7479795815234e-06 3.71695591638854e-07 
0.125724107027054 -2.95457107313268e-06 -1.7311029978373e-06 5.36623531388614e-07 
0.125940844416618 -1.38802090532408e-06 -1.44722923778318e-06 1.2240091109561e-06 
0.126352190971375 -2.77592448583164e-07 -1.62514572821237e-06 1.2802165656467e-06 
0.126958355307579 1.0566096761977e-06 2.39188040040972e-07 1.77643175902631e-06 
0.127443194389343 1.86662691703532e-06 -4.53642883257999e-08 2.55358531831007e-06 
0.127933591604233 2.46770900957927e-06 1.42372925893142e-06 2.60294882536982e-06 
0.128346279263496 2.48735273089551e-06 2.87577427116048e-06 1.29140005356021e-06 
0.128542646765709 3.54393205270753e-06 5.07954246131703e-06 1.16876117317588e-06 
0.128646582365036 3.83943097403971e-06 5.43962141819065e-06 2.32833016866607e-07 
0.128362745046616 4.51629102826701e-06 7.85857355367625e-06 -7.99330962308886e-07 
0.127901583909988 2.25634380512929e-06 8.27097483124817e-06 -1.51544634263701e-06 
0.12701641023159 2.2345061552187e-06 6.55765052215429e-06 -8.95133496214839e-07 
0.126255378127098 4.62335627560151e-08 4.52403810413671e-06 -8.72673695084814e-07 
0.125268042087555 -2.53124494520307e-06 1.68140479672729e-06 -1.61815620458583e-07 
0.124829515814781 -4.80214021081338e-06 -1.46393233535491e-06 7.22312393008906e-07 
0.124364294111729 -5.81446374781081e-06 -2.20176934817573e-06 8.97136658295494e-07 
0.12431912869215 -7.49852506487514e-06 -2.83480676444015e-06 1.30246257867839e-06 
0.123887479305267 -6.45062391413376e-06 -4.76518516734359e-06 1.66405948220927e-06 
0.123655460774899 -4.90653883389314e-06 -3.90879131373367e-06 2.21038135350682e-06 
0.122956946492195 -3.12741849484155e-06 -2.819638893925e-06 2.15223826671718e-06 
0.122044578194618 -5.65251866646577e-07 -4.2056999518536e-06 3.51093285644311e-06 
0.121085792779922 1.2348363043202e-06 -2.920900215031e-06 3.33350362780038e-06 
0.120056375861168 1.0472903113623e-06 -1.64092421073292e-06 2.9352934234339e-06 
0.11882920563221 1.54252370521135e-06 -1.07054518139194e-06 2.12806230592832e-06 
0.117740206420422 4.38780745071199e-07 -3.50986937291964e-07 2.02532828552648e-06 
0.116640880703926 8.77666423093615e-07 2.19031903725408e-06 2.82904352388869e-07 
0.115443572402 4.9726875062106e-08 2.67962946054467e-06 -5.50749689409713e-07 
0.114381954073906 1.49582405128967e-07 3.79411835638166e-06 -1.15038039893989e-06 
0.113646477460861 3.6003515901939e-07 4.80463040730683e-06 -1.77958122549171e-06 
0.112952068448067 9.95396248981706e-07 4.83953726870823e-06 -2.34382491726137e-06 
0.112478852272034 2.35278503168956e-06 3.70175916941662e-06 -2.23692381950968e-06 
0.112009160220623 4.61044464827864e-06 3.25556811731076e-06 -1.8982854044225e-06 
0.111745297908783 6.01767806074349e-06 3.79080370294105e-06 -8.74938905326417e-07 
0.111281156539917 5.77949640501174e-06 2.54981864600268e-06 -4.3923574821747e-07 
0.110605537891388 7.21788092050701e-06 2.58662930718856e-06 -2.28196512352952e-07 
0.109635852277279 5.87122985962196e-06 2.11888095691393e-06 6.70370283728516e-08 
0.108466662466526 3.25966448144754e-06 1.23384518246894e-06 -1.19594041336768e-08 
0.106797471642494 3.29058298120799e-06 5.86551927028722e-08 -7.34840398308734e-07 
0.104690231382847 2.38558686760371e-06 -1.2965548989996e-07 -8.16918884538609e-07 
0.102622136473656 1.19451965474582e-06 -5.85048496759555e-07 -1.24319717542676e-06 
0.100405111908913 1.24146697544347e-06 -2.10010807677463e-06 -7.8459089536409e-07 
0.0982151105999947 -8.65410410000322e-09 -1.60901834078686e-06 -9.15071382223687e-07 
0.0961908102035522 -2.19388834921119e-06 -2.11042424780317e-06 -9.14775739602192e-07 
0.0944503843784332 -2.94766368824639e-06 -2.29993975153775e-06 -1.73792130908623e-07 
0.0928070098161697 -3.69022677659814e-06 -3.24104871651798e-06 3.56033638126974e-07 
0.0913778096437454 -3.91967432733509e-06 -1.77635081399785e-06 4.69622023047123e-07 
0.0901037827134132 -2.48825244852924e-06 -2.16085595639015e-06 1.08453116354212e-06 
0.0888364911079407 -1.08856386304979e-06 -1.67490202329645e-06 1.23358211112645e-06 
0.0876294299960136 1.04987179838645e-06 -3.05288426716288e-06 2.02386743808347e-07 
0.0861706584692001 4.00602039007936e-06 -2.93398352368968e-06 -2.96717672654268e-07 
0.0846837982535362 5.48350089957239e-06 -3.91956473322352e-06 -1.20097593026003e-06 
0.0831919312477112 8.18084663478658e-06 -4.4185121623741e-06 -1.42359044730256e-06 
0.0813953429460526 8.56163842399837e-06 -4.30296086051385e-06 -1.58641967118456e-06 
0.0792366787791252 8.93507512955694e-06 -3.48319622389681e-06 -1.58742216171959e-06 
0.0772586539387703 8.41376095195301e-06 -4.39501764049055e-06 -1.6788704897408e-06 
0.0750462561845779 8.98699090612354e-06 -4.06366507377243e-06 -1.62318383445381e-06 
0.0725905820727348 8.26926861918764e-06 -3.82374400942354e-06 -1.57126328304003e-06 
0.0703384503722191 8.21607409307035e-06 -3.76913385480293e-06 -1.43695035603741e-06 
0.0682416185736656 7.75424814491998e-06 -3.77345372726268e-06 -1.08047333924333e-06 
0.0660873576998711 7.07738854544004e-06 -2.744137418631e-06 -9.52658581354626e-07 
0.0639669820666313 5.89654746363522e-06 -2.79040636996797e-06 -9.93897060652671e-07 
0.0618378147482872 5.46036835658015e-06 -3.03250635624863e-06 -1.36672633743729e-06 
0.0597990192472935 4.64222057416919e-06 -3.21513493872772e-06 -1.69028407981386e-06 
0.0577394589781761 3.92822539652116e-06 -3.87204863727675e-06 -1.79724543158954e-06 
0.0557564422488213 2.9881916816521e-06 -3.8641983337584e-06 -1.35535947265453e-06 
0.0539580546319485 2.55446843766549e-06 -4.30812679041992e-06 -9.85273118203622e-07 
0.0522773489356041 1.19934838949121e-06 -4.87560237161233e-06 -8.59869714986417e-07 
0.0505625084042549 1.21268294606125e-06 -6.0262482293183e-06 -5.74948046505597e-07 
0.0489310398697853 1.6546542838114e-06 -6.31371767667588e-06 -4.16328958863232e-07 
0.0472621843218803 1.71984970620542e-06 -7.19716126695857e-06 -6.09019423336576e-07 
0.0455203056335449 1.86021929948765e-06 -7.16070599082741e-06 -4.65810103378317e-07 
0.0438754372298717 1.90633340935165e-06 -6.9074908424227e-06 -4.37498357541699e-07 
0.0421836525201797 9.90862872640719e-07 -6.83929329170496e-06 -7.67685264690954e-07 
0.0404755175113678 8.05561398919963e-07 -6.13416204942041e-06 -8.64678497691784e-07 
0.038631621748209 1.62522962909861e-06 -5.68712357562617e-06 -1.12082227587962e-06 
0.036790132522583 3.10301766148768e-06 -5.35148865310475e-06 -1.48992319282115e-06 
0.0347633920609951 5.67542292628787e-06 -4.42255168309202e-06 -1.32296167976165e-06 
0.0326810628175735 9.44622843235265e-06 -3.07471464111586e-06 -8.10312769772281e-07 
0.0303420219570398 1.33405719680013e-05 -1.84856025953195e-06 -2.57259443969815e-07 
0.0278609450906515 1.7571464923094e-05 -4.12479920441911e-07 5.38407618932979e-07 
0.025075601413846 2.10811922443099e-05 1.2616811773114e-06 1.23002325835841e-06 
0.0220512729138136 2.49305085162632e-05 2.3764509933244e-06 1.61971740908484e-06 
0.0187912825495005 2.7464182494441e-05 3.14172075377428e-06 1.72493116679107e-06 
0.0155420126393437 2.85558580799261e-05 3.38633253704756e-06 1.51049221130961e-06 
0.0123802805319428 2.76645023404853e-05 3.17027547680482e-06 1.07741516330861e-06 
0.00950417667627335 2.55737195402617e-05 2.50718312599929e-06 6.81087556131388e-07 
0.00698981294408441 2.15140553336823e-05 1.71541239524231e-06 3.1629002705813e-07 
0.00493806041777134 1.75109944393625e-05 8.27987037155253e-07 -1.91554203610167e-08 
0.00333722308278084 1.33895709950593e-05 8.38322122831414e-08 -2.45801317078076e-07 
0.00214167963713408 9.88576084637316e-06 -6.21944934664498e-07 -3.43788428835978e-07 
0.00128005852457136 7.01566341376747e-06 -1.13183591565758e-06 -3.77643289084517e-07 
0.000694721878971905 4.9880582082551e-06 -1.4907473087078e-06 -4.10794939398329e-07 
0.000301988358842209 3.54399094248947e-06 -1.69418342466088e-06 -4.11929505617081e-07 
4.61868003185373e-05 2.61956620306592e-06 -1.79387996013247e-06 -4.09841021564716e-07 
-0.000120080549095292 1.96472092284239e-06 -1.84762825483631e-06 -3.99008939666601e-07 
-0.00022435825667344 1.52491952576383e-06 -1.81017651357251e-06 -3.86970384624874e-07 
-0.00029504339909181 1.20148183668789e-06 -1.77494780473353e-06 -3.6390420632415e-07 
-0.000341220176778734 9.6499320534349e-07 -1.73114153767528e-06 -3.48870145217006e-07 
-0.00037422202876769 7.75141586473183e-07 -1.68328767813364e-06 -3.34649911337692e-07 
-0.000397915835492313 6.41036365323089e-07 -1.62933827141387e-06 -3.25346007912231e-07 
-0.000414593756431714 5.37591802185489e-07 -1.59360274665232e-06 -3.22615306913576e-07 
-0.000426330720074475 4.73647673970845e-07 -1.56173769028101e-06 -3.15156569286046e-07 
0 0 0 0 
0 0 0 0 
0 0 0 0 
0 0 0 0 
0 0 0 0 
0 0 0 0 
0 0 0 0 
0 0 0 0 
0 0 0 0 
0 0 0 0 
0 0 0 0 
0 0 0 0 
0 0 0 0 
0 0 0 0 
99.9828109741211 0.00910374615341425 0.00454330537468195 0.00134350662119687 
