﻿{
	"centerX" : 0.5,
	"centerY" : 0.5,
	"angle" : 0,
	"scale" : 1,
	"width" : 194,
	"height" : 110,
	"contents" : [
        {
			"type" : "image",
			"resource" : {
				"type" : "static",
				"path" : "res/imperial_crown.png"
			},
			"centerX" : 0.5,
			"centerY" : 0.191,
			"width" : 57,
			"height" : 42,
			"angle" : 0,
			"zorder" : 1
        },
        {
			"type" : "image",
			"resource" : {
				"type" : "static",
				"path" : "res/imperial_left.png"
			},
			"centerX" : 0.25,
			"centerY" : 0.5,
			"width" : 27,
			"height" : 27,
			"angle" : 0,
			"zorder" : 1
		},
		{
            "type": "text",
            "centerX": 0.5,
            "centerY": 0.5,
            "width": 80,
            "height": 27,
            "angle": 0,
            "color": "#ffffffff",
            "isVertical": 0,
            "alignment": 0,
            "text": "{MEAL}",
            "zorder": 2
        },
        {
			"type" : "image",
			"resource" : {
				"type" : "static",
				"path" : "res/imperial_right.png"
			},
			"centerX" : 0.75,
			"centerY" : 0.5,
			"width" : 27,
			"height" : 27,
			"angle" : 0,
			"zorder" : 1
		}, {
			"type" : "image",
			"resource" : {
				"type" : "static",
				"path" : "res/water_mark_line.png"
			},
			"centerX" : 0.12,
			"centerY" : 0.72,
			"width" : 48,
			"height" : 1,
			"angle" : 0,
			"zorder" : 1
		},
		{
            "type": "text",
            "centerX": 0.5,
            "centerY": 0.72,
            "width": 100,
            "height": 18,
            "angle": 0,
            "color": "#ffffffff",
            "isVertical": 0,
            "alignment": 0,
            "text": "敢不敢再好吃一点",
            "textEn": "More Delicious",
            "zorder": 2
        },
        {
			"type" : "image",
			"resource" : {
				"type" : "static",
				"path" : "res/water_mark_line.png"
			},
			"centerX" : 0.88,
			"centerY" : 0.72,
			"width" : 48,
			"height" : 1,
			"angle" : 0,
			"zorder" : 1
        },
        {
            "type": "text",
            "centerX": 0.5,
            "centerY": 0.88,
            "width": 100,
            "height": 14,
            "angle": 0,
            "color": "#ffffffff",
            "isVertical": 0,
            "alignment": 0,
            "text": "{yyyy-MM-dd}",
            "zorder": 2
        }
	]
}
