0 0 0 0 
0 0 0 0 
0 0 0 0 
0 0 0 0 
0 0 0 0 
0 0 0 0 
0 0 0 0 
0 0 0 0 
0 0 0 0 
0 0 0 0 
0.0113058472052217 6.79631830280414e-06 -6.56368914775385e-09 1.54161250431883e-09 
0.0133489081636071 6.25230859441217e-06 1.93561717765078e-07 -3.53439624234397e-08 
0.0149266999214888 5.01869271829491e-06 3.70169708219237e-08 2.65452371195352e-09 
0.0164179541170597 3.88446824217681e-06 -1.8652302458122e-07 1.40854998775808e-08 
0.0176589861512184 2.62981825471797e-06 5.32837738376202e-08 6.49625420123812e-08 
0.0185892507433891 1.44640819144115e-06 -3.03622194053332e-08 -1.29040572005579e-07 
0.0192233324050903 5.9444352018545e-07 1.37481377393556e-08 1.69285755191595e-07 
0.019583024084568 1.30047254742749e-07 -5.14194420375702e-09 -1.07111524982884e-07 
0.0196621846407652 -2.89298309752439e-08 -2.44071207688989e-10 2.43696902657575e-08 
0.0193682499229908 1.98646983307071e-08 -1.62262725478257e-09 -3.49373019403743e-09 
0.0188057664781809 1.46218226859673e-07 -5.37641930975497e-10 5.31915123058724e-10 
0.0180053040385246 1.04727064353938e-07 8.51536563484245e-10 -2.56044102586728e-10 
0.0170497130602598 -1.59881608396972e-07 -1.34117017491775e-09 -9.92342208405717e-10 
0.0159853380173445 -5.5609990567973e-07 -2.95919330706162e-11 8.53274742529386e-11 
0.0149075295776129 -1.02344563401857e-06 1.81875481342075e-09 -2.22701565522065e-10 
0.0138530815020204 -1.39779206165258e-06 2.28641017230302e-09 -4.00516647625082e-10 
0.0128737175837159 -1.57346789819712e-06 1.9900749936852e-09 -9.83939596466143e-10 
0.0119533920660615 -1.58448676756962e-06 3.09640180162774e-09 -4.03883343436107e-10 
0.0110473670065403 -1.53839403083111e-06 2.7741964281347e-09 -1.04547238921615e-10 
0.0102325333282351 -1.33934133828006e-06 1.18409737570602e-09 -9.77603109575398e-10 
0.0094750439748168 -1.17962622425694e-06 1.6473442610021e-09 -4.06701089472605e-10 
0.00877652782946825 -1.09310826701403e-06 1.56157597963613e-09 -3.01239255762198e-10 
0.00815183576196432 -1.10890960058896e-06 4.27315405282513e-10 -8.36536617754291e-10 
0.00760669726878405 -1.13642101950973e-06 1.63973679079277e-09 -2.4226939898675e-10 
0.00703439675271511 -1.24193400097283e-06 1.62071944753706e-09 2.08445635752064e-10 
0.00644187210127711 -1.32959098664287e-06 1.92907489982019e-09 -3.53090390259325e-10 
0.00588985718786716 -1.30707633161364e-06 1.59557389523002e-09 -2.73594258359822e-10 
0.0053874715231359 -1.24672487800126e-06 1.51596590836078e-09 -5.77591252604037e-10 
0.0049532325938344 -1.10440862499672e-06 1.51729384612054e-09 -2.85256845922177e-10 
0.00463733542710543 -9.56986355049594e-07 8.54587400844764e-10 -7.05122488176002e-11 
0.00442758435383439 -8.31062891393231e-07 1.15765208530405e-09 -6.69809832598567e-11 
0.00426716916263103 -8.50480660119501e-07 1.3328811387936e-09 -1.32199723390514e-10 
0.00415031379088759 -8.46742523208377e-07 1.12109210803624e-09 -4.44410702682418e-10 
0.00408005248755217 -8.86611246642133e-07 8.5883467004777e-10 -1.78333320333124e-10 
0.00406793411821127 -9.82918095360219e-07 1.55302093407528e-09 -2.72589090188902e-10 
0.00413129338994622 -1.07481946542975e-06 1.10052333912591e-09 -4.75181616277354e-10 
0.00427772803232074 -1.15149953217042e-06 1.82460868636269e-09 -4.00058347560517e-10 
0.00447205686941743 -1.33862840812071e-06 1.68001601519308e-09 -1.275457656158e-10 
0.00470394967123866 -1.46986076288158e-06 2.23271823251991e-09 -4.01576077946331e-10 
0.00497347209602594 -1.64346226938505e-06 2.10884354423513e-09 -3.09380715490803e-10 
0.00523329386487603 -1.72772718087799e-06 2.22660512250172e-09 -1.4447244789384e-10 
0.00544991530478001 -1.80495874246844e-06 2.65183364156485e-09 -2.8798549656095e-10 
0.00564232328906655 -1.84222881216556e-06 2.55164267493058e-09 -5.43411315945264e-10 
0.00577814131975174 -1.92257175513078e-06 2.2933615007048e-09 -4.95346375029015e-10 
0.0058806911110878 -1.87878640645067e-06 2.55424770223556e-09 -6.934239848988e-10 
0.00593119999393821 -1.92352831618336e-06 2.87755974603954e-09 -4.89080886900695e-10 
0.00596763053908944 -1.89622949164914e-06 2.86720447384425e-09 -3.86110476924273e-10 
0.00598562741652131 -1.87181831279304e-06 2.74531219979224e-09 -7.02998076418382e-11 
0.00601111259311438 -1.82401322490477e-06 2.60474442015379e-09 -5.11651276902114e-10 
0.0060187135823071 -1.8458404156263e-06 2.47498954664138e-09 -3.71521591269186e-10 
0.00606327597051859 -1.8788986153595e-06 2.3356871992064e-09 -3.78748976626042e-11 
0.00612307293340564 -1.93839014173136e-06 2.7517803591337e-09 -3.38912259367774e-10 
0.00620946148410439 -1.99061832972802e-06 2.54444665337417e-09 -8.85810647055507e-10 
0.00634625786915421 -2.05595938496117e-06 3.21332715991218e-09 -6.55237697433364e-10 
0.00654370198026299 -2.00860995391849e-06 2.93149815533411e-09 -8.02591382242923e-10 
0.00680830935016274 -1.90340995231963e-06 2.59599652885356e-09 -2.77194628361954e-10 
0.0071496763266623 -1.88675915069325e-06 2.68938471492675e-09 -6.64773625036474e-10 
0.00756151461973786 -1.72211662174959e-06 2.68892086374706e-09 -2.54740673000242e-10 
0.00802016537636518 -1.53851772211056e-06 2.55316123798366e-09 -9.13227993226684e-10 
0.00850731879472733 -1.48019330481475e-06 2.12263562282544e-09 -7.36499264353263e-11 
0.00899612810462713 -1.43992258472281e-06 1.98588900879315e-09 -1.92397583975712e-10 
0.00945471320301294 -1.36940582251555e-06 1.80924009107741e-09 -7.00191571390008e-10 
0.00983934476971626 -1.47711580211762e-06 1.7135332042173e-09 -5.39491229467615e-10 
0.0101317195221782 -1.73239186551655e-06 2.36936470443538e-09 -1.08220161998407e-10 
0.0102099990472198 -1.87235832527222e-06 1.6046982631579e-09 -9.66850710604206e-10 
0.0101218828931451 -1.94273297893233e-06 1.43717415745925e-09 -8.45847614172612e-10 
0.00988224800676107 -1.91851177078206e-06 2.81853340666771e-09 -1.04089636909777e-09 
0.00949618872255087 -1.81088091721904e-06 2.35643926593809e-09 -5.33757760212694e-10 
0.00904996041208506 -1.50538062371197e-06 2.13941553361963e-09 -5.21779786044618e-10 
0.00864149630069733 -1.34991751110647e-06 1.42150424764509e-09 -5.82840331553314e-10 
0.00830657593905926 -1.36725236643542e-06 1.96541338759459e-09 -2.88877394227782e-10 
0.00802026130259037 -1.46101649534103e-06 2.00293670538088e-09 -6.51273590612789e-10 
0.00784916616976261 -1.45485273606027e-06 2.25599716685565e-09 -2.09979020282525e-10 
0.00773862516507506 -1.47655850923911e-06 2.082246597368e-09 -6.18974649313486e-10 
0.00775139732286334 -1.6075642861324e-06 1.97996596895678e-09 -4.45903092227695e-10 
0.00779541721567512 -1.4619537296312e-06 2.57890953037077e-09 -8.83282003094621e-10 
0.00788459368050098 -1.37533629640529e-06 1.45336054302447e-09 -2.63504801312209e-10 
0.00803816691040993 -1.52085203808383e-06 1.95749749742902e-09 -2.74957445700608e-10 
0.00820951536297798 -1.54013957853749e-06 1.78896863989308e-09 -5.35930855249944e-10 
0.00840752385556698 -1.51457595620741e-06 2.60674348773193e-09 1.47643063139885e-12 
0.00861034076660872 -1.50041773849807e-06 2.16078999137892e-09 -2.07939360175047e-10 
0.00888324342668056 -1.39466237669694e-06 1.74980352429799e-09 2.29131671969363e-10 
0.00924097932875156 -1.18587206543452e-06 2.06356842724631e-09 -6.83673562207332e-10 
0.00985200237482786 -1.05112917481165e-06 1.48680912026578e-09 -3.20513865448291e-10 
0.0110075855627656 -9.92619789030869e-07 2.00132399541531e-09 -2.56072635318461e-10 
0.0134392706677318 -9.2639459126076e-09 7.95081611659754e-10 3.91002341615376e-10 
0.0180710963904858 -4.61609886315273e-09 1.74152336995803e-09 7.18467119131816e-10 
0.0261231008917093 1.56393156203194e-09 -7.75405628594683e-10 -1.43763501103678e-09 
0.0390559583902359 1.0038512527899e-08 -2.58744714543013e-09 -3.20780024765099e-09 
0.0578482262790203 3.93602249459946e-09 7.45066564000751e-10 2.89888424376272e-09 
0.0816130042076111 -3.17145577355404e-08 8.02068544913936e-09 -3.36451444482577e-09 
0.107912801206112 -4.4205621634319e-08 -3.6202643105554e-09 -7.82004061505859e-09 
0.134751006960869 -4.74452644994017e-08 6.52413723045697e-09 1.78949133289308e-09 
0.159954369068146 -6.31997272648732e-08 8.81434303323658e-09 2.24451457420116e-09 
0.179957196116447 -3.51122230313194e-08 -1.15573657311074e-08 6.71922739670094e-09 
0.194013819098473 -1.27828215568115e-09 1.23868977297548e-08 -9.77124692269626e-09 
0.203818753361702 1.54236659000162e-08 -4.40316760830228e-09 3.60279339695069e-09 
0.209573298692703 2.90044908979326e-08 -1.8862516881768e-08 1.31036355099923e-08 
0.212212890386581 3.58645252163115e-08 1.23623034031795e-09 4.61244653582327e-10 
0.212910890579224 2.90444290840242e-08 1.85535564689587e-09 -2.14728013148147e-09 
0.212493702769279 4.24795598519268e-08 1.10134452668831e-08 4.51538095802562e-09 
0.210614681243896 6.50094716547756e-08 1.11385487500115e-08 -1.4349230248456e-08 
0.207695364952087 4.54969767815783e-08 -7.84615128424093e-09 -9.46992972927774e-09 
0.204506322741508 3.38581730829901e-08 -8.21813284090922e-09 -6.72265976220388e-09 
0.200573474168777 3.12007045977225e-08 -1.33457733753062e-08 -3.15392378880119e-09 
0.196674704551697 8.78576088325644e-09 -9.12850697809553e-12 5.23767029747546e-10 
0.192956581711769 -4.67211521026911e-08 -9.43591538238309e-10 7.90434739883494e-09 
0.188988104462624 -3.974059382017e-08 4.84959716828826e-09 1.83218074045755e-09 
0.184408560395241 -3.92534684579005e-08 4.91781459999174e-09 -9.15210929264276e-09 
0.179559513926506 -2.81319898931542e-08 -4.93411134172561e-09 -4.44088588125169e-09 
0.174649834632874 6.99574115969881e-09 1.7567066690205e-09 7.87739917740282e-09 
0.16919356584549 4.82002133139758e-08 -1.7161580601055e-08 1.19455734193252e-08 
0.163846999406815 3.88645548810018e-08 -1.44880718533358e-09 5.82115511349457e-09 
0.157266154885292 5.82883694733027e-08 -1.011197081624e-08 7.62168461676538e-09 
0.151149183511734 1.98377210836043e-08 -4.79358774896355e-09 -4.80781237044425e-09 
0.144101038575172 -3.80869573746168e-08 2.70051803141769e-09 6.27288088139721e-09 
0.137637421488762 -5.43189344170969e-08 8.54138537675908e-09 -1.51770973566556e-09 
0.130526468157768 -2.43018052970001e-08 2.38438047084344e-09 1.62310609397309e-08 
0.123540543019772 -3.21625770993705e-08 3.96274346670111e-09 2.29215579850006e-09 
0.11656853556633 -3.56670443579787e-08 1.3027761980311e-08 -1.31386217461227e-08 
0.109580233693123 -9.24530283441527e-10 4.49311247929796e-11 -7.52502327117099e-09 
0.101534999907017 -3.67691910696522e-09 9.75173608530611e-10 -3.39684746997193e-09 
0.0939016789197922 -3.24814527630224e-08 4.64067939631718e-09 -6.16077133752668e-10 
0.0864317491650581 -3.54284520653891e-08 1.27702215468872e-09 -8.4149365253694e-10 
0.0785722136497498 -8.39388064832747e-09 1.61943702892131e-09 3.23666937696032e-09 
0.070976048707962 -1.22544747682696e-08 2.44511033642425e-09 -2.10982564752271e-09 
0.0637424364686012 -1.31560216232174e-08 5.65542102037853e-09 -4.24609813975962e-09 
0.0564157143235207 -3.17680303396628e-09 1.04216402174728e-09 -1.09825848415568e-09 
0.0494352206587791 1.42941507519367e-10 5.81553138978563e-10 -1.58048552023615e-09 
0.0429638996720314 -6.24877372956689e-09 4.30319217759045e-11 -6.18113199513104e-11 
0.037022277712822 -5.77076150420908e-09 -1.0953693507787e-09 2.016251166026e-09 
0.0313175246119499 -2.83613132978644e-10 7.04779345994666e-10 -8.66724469972269e-10 
0.026155598461628 -5.09360063460917e-09 1.03585551247676e-09 -1.20321841379223e-09 
0.0213844142854214 -6.75561295793159e-09 1.80300163687974e-09 -7.09472647297815e-10 
0.0171185340732336 -8.89008333615493e-09 1.2430453333323e-09 -1.40922884472872e-09 
0.0133511954918504 -7.82845575031388e-09 1.17472187532996e-09 -7.61883667266261e-10 
0.0103870090097189 -1.17511626740452e-08 2.52361997965522e-09 -7.65439100991472e-10 
0.00803743116557598 -1.22122128232149e-08 1.81982495739419e-09 -1.04635711206669e-09 
0.00617760187014937 -1.17012552891538e-08 1.6151624482319e-09 -5.39545463862368e-10 
0.00472917640581727 -1.10254245555552e-08 1.61868096704154e-09 -5.0358045511345e-10 
0.00361635396257043 -1.24147538826946e-08 1.65377112004705e-09 -4.10706225972834e-11 
0.00272347894497216 -1.34579943278368e-08 1.82750514721164e-09 -3.5833827571885e-10 
0.0020642951130867 -1.5979010186129e-08 2.25326801661652e-09 -5.7674198750135e-10 
0.00155542802531272 -1.78960829089192e-08 2.44666420456952e-09 -4.50141784957836e-10 
0.00116667314432561 -1.91529557014292e-08 2.6854556356426e-09 -5.43110334483288e-10 
0.000881699845194817 -1.88934222933312e-08 2.56692955780125e-09 -4.87462847864606e-10 
0.000690551067236811 -1.81228767814901e-08 2.50322029771155e-09 -5.0058951428511e-10 
0.000542927416972816 -1.76445075794618e-08 2.44417130979002e-09 -4.9072806929118e-10 
0.000431131455115974 -1.71022986705793e-08 2.34759434114551e-09 -4.46765596739951e-10 
0.00034356044488959 -1.64195932939037e-08 2.27982566158857e-09 -4.43197617494562e-10 
0.000275669211987406 -1.58437455866078e-08 2.20478102441746e-09 -4.39391467654815e-10 
0.000212436891160905 -1.53727239649015e-08 2.14558437683365e-09 -4.05517619483931e-10 
0.000163569158758037 -1.47144237416796e-08 2.06614458875265e-09 -3.88902798853508e-10 
0.000114317415864207 -1.38527946091926e-08 1.93770399725679e-09 -3.64621166593082e-10 
8.24574017315172e-05 -1.3276911658977e-08 1.86203241714367e-09 -3.53163470689921e-10 
5.06920805491973e-05 -1.26149927837105e-08 1.76526238071517e-09 -3.40734662707121e-10 
3.04673139908118e-05 -1.20860840979731e-08 1.68933111943659e-09 -3.23173543481658e-10 
1.27298226288985e-05 -1.14338399725966e-08 1.59880841898996e-09 -3.05820452295436e-10 
1.12228883608623e-06 -1.10762414351484e-08 1.54939405749843e-09 -2.9627145181621e-10 
-1.31071610667277e-05 -1.06768743535213e-08 1.49372980651208e-09 -2.8651933603463e-10 
-2.15900618059095e-05 -1.02043361493998e-08 1.42481693110597e-09 -2.74271855227326e-10 
0 0 0 0 
0 0 0 0 
0 0 0 0 
0 0 0 0 
0 0 0 0 
0 0 0 0 
0 0 0 0 
0 0 0 0 
0 0 0 0 
0 0 0 0 
0 0 0 0 
0 0 0 0 
0 0 0 0 
0 0 0 0 
99.9959411621094 0.00288920779712498 2.83454774034908e-05 2.54910955845844e-05 
