0 0 0 0 
0 0 0 0 
0 0 0 0 
0 0 0 0 
0 0 0 0 
0 0 0 0 
0 0 0 0 
0 0 0 0 
0 0 0 0 
0 0 0 0 
0.00757540808990598 -0.000278363702818751 2.7692938601831e-05 -3.4141057767556e-06 
0.00861428026109934 -0.000300208484986797 3.14822245854884e-05 -4.69179076389992e-06 
0.00922638364136219 -0.000317357305902988 3.37121346092317e-05 -6.46856142338947e-06 
0.00985518377274275 -0.000339254562277347 3.5634424421005e-05 -7.17620832801913e-06 
0.010296143591404 -0.000356999924406409 3.72589820472058e-05 -8.41552173369564e-06 
0.0106381708756089 -0.000367374974302948 3.86249557777774e-05 -9.82488018053118e-06 
0.0110155623406172 -0.000372034788597375 3.92141519114375e-05 -1.00415954875643e-05 
0.0113706039264798 -0.000369818182662129 3.88727057725191e-05 -9.93345929600764e-06 
0.0116545092314482 -0.000358124991180375 3.72611975762993e-05 -1.01762361737201e-05 
0.0118930600583553 -0.000343267456628382 3.33834832417779e-05 -8.86257475940511e-06 
0.011986437253654 -0.000328610854921862 2.78928564512171e-05 -6.92466528562363e-06 
0.0119016859680414 -0.000313226424623281 2.13165712921182e-05 -5.20075946042198e-06 
0.0117386197671294 -0.000298009254038334 1.39059247885598e-05 -3.14432963932632e-06 
0.0114660505205393 -0.00028103799559176 7.04424655850744e-06 -1.13749149477371e-06 
0.0111257983371615 -0.000262953661149368 1.04472962902946e-06 4.68571272449481e-07 
0.0107394894585013 -0.000244538416154683 -3.72392992176174e-06 1.78999096078769e-06 
0.0103277303278446 -0.000227337775868364 -7.16201429895591e-06 2.88506362267071e-06 
0.00987519044429064 -0.000209139732760377 -9.57078464125516e-06 3.4749418773572e-06 
0.00941421091556549 -0.000192756153410301 -1.10523042167188e-05 4.0653940232005e-06 
0.00893611740320921 -0.000177026158780791 -1.19506385090062e-05 4.45702426077332e-06 
0.00845021661370993 -0.00016248898464255 -1.26432169054169e-05 4.62225443698117e-06 
0.00797306187450886 -0.000149529150803573 -1.31546794364112e-05 4.68568850919837e-06 
0.0075075295753777 -0.000140101576107554 -1.32780796775478e-05 4.93340803586761e-06 
0.00704308412969112 -0.000133395253214985 -1.36696789923008e-05 5.09119763592025e-06 
0.00655347108840942 -0.000129765539895743 -1.39828416649834e-05 5.3622370614903e-06 
0.00606587063521147 -0.000124455458717421 -1.41068858283688e-05 5.63289040655945e-06 
0.00562465004622936 -0.000116460367280524 -1.3982736163598e-05 5.73488841837388e-06 
0.00524783181026578 -0.000105784252809826 -1.36470271172584e-05 5.56749682800728e-06 
0.00495346495881677 -9.24049672903493e-05 -1.30435528262751e-05 5.32649755768944e-06 
0.0047746947966516 -7.73204228607938e-05 -1.21851453513955e-05 4.95288941237959e-06 
0.0046824817545712 -6.45987238385715e-05 -1.15794364319299e-05 4.62682010038407e-06 
0.00463132793083787 -5.38061758561525e-05 -1.11663157440489e-05 4.39170162280789e-06 
0.00461638392880559 -4.50435254606418e-05 -1.08488211481017e-05 4.29586953032413e-06 
0.00465108547359705 -3.75422932847869e-05 -1.06870456875185e-05 4.24744666815968e-06 
0.00474785640835762 -3.08893431792967e-05 -1.06154584500473e-05 4.166556209384e-06 
0.00492806499823928 -2.46487034019083e-05 -1.06655634226627e-05 4.08764799431083e-06 
0.00517971022054553 -1.98023408302106e-05 -1.06695051727002e-05 4.00750013795914e-06 
0.00547845987603068 -1.58652874233667e-05 -1.07516643765848e-05 3.93181244362495e-06 
0.00580796971917152 -1.25481301438413e-05 -1.08854264908587e-05 3.7997197068762e-06 
0.00617190590128303 -9.55566065385938e-06 -1.1013847142749e-05 3.68222436009091e-06 
0.00650896178558469 -7.60284092393704e-06 -1.11704357550479e-05 3.52191841557215e-06 
0.00680864928290248 -5.56250961381011e-06 -1.11380131784244e-05 3.44749832947855e-06 
0.00706730643287301 -2.91742480840185e-06 -1.11664239739184e-05 3.26160579788848e-06 
0.00730269914492965 1.72557577116095e-06 -1.09566881292267e-05 3.06996366816747e-06 
0.00748321646824479 7.21533251635265e-06 -1.07067717181053e-05 2.84024667962512e-06 
0.00764752458781004 1.51846197695704e-05 -1.04974969872274e-05 2.64943878391932e-06 
0.00779494550079107 2.38814718613867e-05 -1.04053178802133e-05 2.38564462051727e-06 
0.00794641766697168 3.44458021572791e-05 -1.01707846624777e-05 2.1259829736664e-06 
0.00809404533356428 4.48756363766734e-05 -1.01233699751901e-05 1.96480982594949e-06 
0.00826278235763311 5.59345244255383e-05 -1.01877385532134e-05 1.81425821210723e-06 
0.00845501385629177 6.72560418024659e-05 -1.00009247034905e-05 1.65825997555658e-06 
0.00868201069533825 7.86707896622829e-05 -9.95082245935919e-06 1.55543546043191e-06 
0.0089513948187232 9.03801483218558e-05 -1.00305824162206e-05 1.51255983382725e-06 
0.0092808585613966 0.000103051861515269 -1.02070052889758e-05 1.34884521685308e-06 
0.00969912949949503 0.000116618022730108 -1.03699558167136e-05 1.33632170218334e-06 
0.0102176908403635 0.000132034605485387 -1.05925419120467e-05 1.28524493447912e-06 
0.0108431344851851 0.000150172287249006 -1.07517298602033e-05 1.21702385058597e-06 
0.0115641755983233 0.000169828039361164 -1.09716929728165e-05 1.09650397916994e-06 
0.0123420273885131 0.000188740188605152 -1.12399384306627e-05 1.12936891127902e-06 
0.0131345503032207 0.000207563629373908 -1.13398282337585e-05 1.07776975255547e-06 
0.0139417238533497 0.000226603558985516 -1.14521162686287e-05 1.15468287731346e-06 
0.0146635007113218 0.000241088404436596 -1.18320413093898e-05 1.12942700525309e-06 
0.0152755826711655 0.000253307225648314 -1.20159475045511e-05 1.15753869067703e-06 
0.0156808979809284 0.000259069027379155 -1.16778228402836e-05 1.21939422115247e-06 
0.0158295687288046 0.000259294611169025 -1.16359751700656e-05 1.41295527100738e-06 
0.0156794004142284 0.000252003403147683 -1.15309258035268e-05 1.34136371343629e-06 
0.0153139363974333 0.000240887384279631 -1.11356812340091e-05 1.34063270706974e-06 
0.0147379236295819 0.00022366079792846 -1.09146885733935e-05 1.45164176501567e-06 
0.0141027104109526 0.000207724122446962 -1.10254586616065e-05 1.25435667541751e-06 
0.0134791024029255 0.000191689978237264 -1.10189075712697e-05 1.01389059636858e-06 
0.0129210138693452 0.000177061912836507 -1.04834198282333e-05 7.93762922057795e-07 
0.0124685820192099 0.00016501203936059 -1.02239819170791e-05 7.1115897526397e-07 
0.0121475094929338 0.000155591362272389 -9.98971881926991e-06 5.03560613651644e-07 
0.0119427433237433 0.000148680948768742 -9.75639613898238e-06 5.38767665148043e-07 
0.0118671348318458 0.000144884004839696 -9.29864017962245e-06 3.12438487526379e-07 
0.0118885403499007 0.000142359771416523 -9.5157638497767e-06 2.88266051029495e-07 
0.0119587108492851 0.000140997668495402 -9.66421157500008e-06 2.07782974825932e-07 
0.0120961349457502 0.000140975651447661 -9.68348012975184e-06 4.86417306433395e-08 
0.0122876605018973 0.000142685385071672 -9.93465073406696e-06 -1.21227216709485e-07 
0.0125189088284969 0.000144641016959213 -1.00377237686189e-05 -1.13244837507409e-07 
0.0128048658370972 0.000149116371176206 -1.04671016742941e-05 -2.4429269274151e-07 
0.0132197393104434 0.000159034127136692 -1.08347821878851e-05 -5.16549050644244e-07 
0.0138106774538755 0.000174598884768784 -1.09486936707981e-05 -5.55013173197949e-07 
0.0147843966260552 0.00020223758474458 -1.06257757579442e-05 -7.7300359180299e-07 
0.0165725201368332 0.000249713019002229 -1.11313056549989e-05 -1.53958455939573e-06 
0.020019393414259 0.000330653769196942 -1.09158982013469e-05 -2.80086692328041e-06 
0.0262304581701756 0.000451235420769081 -1.1334773262206e-05 -4.63295282315812e-06 
0.0364158824086189 0.000595362565945834 -1.50411660797545e-05 -6.29717806077679e-06 
0.0515495911240578 0.000732150627300143 -2.19216963159852e-05 -8.36098115541972e-06 
0.0720826908946037 0.000843125570099801 -2.55380527960369e-05 -1.00562774605351e-05 
0.0969651564955711 0.000888418639078736 -3.01966538245324e-05 -9.79190099315019e-06 
0.12357260286808 0.000845178728923202 -3.83272927138023e-05 -8.46078364702407e-06 
0.149761959910393 0.00072948943125084 -4.3504416680662e-05 -5.36230345460353e-06 
0.173228487372398 0.00057932164054364 -4.05662030971143e-05 -2.65002199739683e-06 
0.191868111491203 0.000391065084841102 -4.90446291223634e-05 2.35595075537276e-06 
0.204489931464195 0.000215897875023074 -5.60774715268053e-05 5.74458272240008e-06 
0.212707310914993 5.64791989745572e-05 -5.72093449591193e-05 1.05268045444973e-05 
0.21709318459034 -6.44874744466506e-05 -6.43950625089929e-05 9.50720550463302e-06 
0.218412086367607 -0.00015298867947422 -6.66528794681653e-05 6.75288765705773e-06 
0.217807158827782 -0.000191205443115905 -5.98701808485202e-05 3.40574092660972e-06 
0.216297045350075 -0.000237940068473108 -5.83962500968482e-05 5.62656396141392e-07 
0.213518545031548 -0.000271003867965192 -5.57673774892464e-05 -2.00174758901994e-06 
0.209745168685913 -0.000283294590190053 -4.78859947179444e-05 -2.89927652374899e-06 
0.20556852221489 -0.000323013082379475 -3.97281582991127e-05 4.78825370464619e-07 
0.200817063450813 -0.000351089838659391 -3.45035368809476e-05 1.68712278991734e-06 
0.195960775017738 -0.000348397443303838 -2.62672965618549e-05 8.83729171619052e-07 
0.191177159547806 -0.000332275812979788 -1.72654908965342e-05 -6.93953495556343e-07 
0.186204135417938 -0.000313882250338793 -4.0150985114451e-06 2.88771417444877e-07 
0.181036323308945 -0.000275047786999494 1.16166177122068e-06 -1.88411149792955e-06 
0.175217092037201 -0.00024814810603857 1.01580735645257e-05 -2.65793437392858e-06 
0.169044718146324 -0.000226656935410574 2.50419361691456e-05 -2.21984782911022e-06 
0.162606835365295 -0.000207116201636381 3.40593032888137e-05 -2.34321873904264e-06 
0.155944630503654 -0.000191205239389092 4.56156594736967e-05 -2.57197007158538e-06 
0.148664340376854 -0.000160314550157636 5.29690623807255e-05 -2.49747472480522e-06 
0.141668975353241 -0.000131097505800426 6.12546791671775e-05 -3.0168966986821e-06 
0.134531289339066 -8.89397852006368e-05 6.66534469928592e-05 -4.68988855573116e-06 
0.127222076058388 -4.48978971689939e-05 7.55527944420464e-05 -5.77138007429312e-06 
0.119662962853909 -3.93268055631779e-06 7.94695515651256e-05 -6.81862456985982e-06 
0.112120538949966 3.93962618545629e-05 8.62547603901476e-05 -6.78439164403244e-06 
0.104598008096218 8.48260970087722e-05 9.5308234449476e-05 -5.18233309776406e-06 
0.0968590080738068 0.000124517056974582 0.000101190882560331 -1.77681761215354e-06 
0.0886874422430992 0.000164885859703645 0.000107730025774799 8.43946281747776e-07 
0.0808448493480682 0.000206409822567366 0.000113991627586074 2.91290712084447e-06 
0.0729769170284271 0.000227975746383891 0.000120008880912792 4.84406928080716e-06 
0.0651282370090485 0.000248335069045424 0.000119847310998011 5.21663287145202e-06 
0.0574579238891602 0.000255805673077703 0.000122284196550027 6.60489286019583e-06 
0.0503768548369408 0.000262782879872248 0.000121131095511373 7.0830878939887e-06 
0.0434634499251842 0.000255821738392115 0.000117519521154463 7.56024701331626e-06 
0.037208866328001 0.000252468365943059 0.000111810702946968 7.97687425801996e-06 
0.0314438082277775 0.00023831553698983 0.000105298517155461 8.41260680317646e-06 
0.0262802969664335 0.000218667104491033 9.60112665779889e-05 7.56450754124671e-06 
0.0215284656733274 0.000190274877240881 8.51578952278942e-05 6.99318889019196e-06 
0.0173260010778904 0.000154709428898059 7.34811255824752e-05 6.44860119791701e-06 
0.0135778421536088 0.000112673042167444 6.1522368923761e-05 6.14314694757923e-06 
0.010303302668035 6.77690186421387e-05 5.02054244861938e-05 5.6447101997037e-06 
0.00757197989150882 2.76033188129077e-05 3.93373193219304e-05 5.04088848174433e-06 
0.00542145688086748 -8.43683210405288e-06 3.08644157485105e-05 4.36836808148655e-06 
0.00377594656310976 -3.82763209927361e-05 2.38973952946253e-05 3.79108382730919e-06 
0.00251450249925256 -6.14496821071953e-05 1.81346877070609e-05 3.29362524098542e-06 
0.00158088107127696 -7.63352873036638e-05 1.35749387482065e-05 2.74933813670941e-06 
0.00091180915478617 -8.47116607474163e-05 1.0072181794385e-05 2.4694336389075e-06 
0.000467129924800247 -8.67127382662147e-05 7.02942224961589e-06 2.43341082750703e-06 
0.00014828352141194 -8.61634980537929e-05 4.74069975098246e-06 2.37378958445333e-06 
-6.35531687294133e-05 -8.445971616311e-05 2.759811195574e-06 2.46108334067685e-06 
-0.000225186100578867 -8.30982171464711e-05 1.3006796280024e-06 2.57756869359582e-06 
-0.000337733887135983 -8.24245435069315e-05 -1.32240813854878e-07 2.79154482996091e-06 
-0.00043916204595007 -8.2379745435901e-05 -1.10728615254629e-06 2.86642671198933e-06 
-0.000514368992298841 -8.24744493002072e-05 -1.97476992980228e-06 3.00000078823359e-06 
-0.000566762057133019 -8.18718035588972e-05 -2.60310025623767e-06 3.06139054373489e-06 
-0.000593240722082555 -8.01639616838656e-05 -3.08948028759914e-06 3.09879010274017e-06 
-0.000604598666541278 -7.76562228566036e-05 -3.17012222694757e-06 3.03793012790265e-06 
-0.000594765646383166 -7.45414654375054e-05 -3.49167726199084e-06 2.95534255201346e-06 
-0.000577990256715566 -7.04244375810958e-05 -3.41261011271854e-06 2.81218331110722e-06 
-0.000555584498215467 -6.61225858493708e-05 -3.39888333655836e-06 2.67178279500513e-06 
-0.000525139970704913 -6.22999286861159e-05 -3.37494020641316e-06 2.53239409175876e-06 
-0.00049657397903502 -5.86963396926876e-05 -3.36511720888666e-06 2.44203374677454e-06 
-0.000476973073091358 -5.57057537662331e-05 -3.22304458677536e-06 2.34318849834381e-06 
-0.000447710248408839 -5.29286189703271e-05 -3.10845462081488e-06 2.30208388529718e-06 
-0.000429288018494844 -5.07428558194079e-05 -3.04409468299127e-06 2.22296853280568e-06 
-0.000417549745179713 -4.92128856421914e-05 -3.03048386740556e-06 2.14539454646001e-06 
-0.000412766763474792 -4.74146399938036e-05 -2.94023607239069e-06 2.04667207981402e-06 
0 0 0 0 
0 0 0 0 
0 0 0 0 
0 0 0 0 
0 0 0 0 
0 0 0 0 
0 0 0 0 
0 0 0 0 
0 0 0 0 
0 0 0 0 
0 0 0 0 
0 0 0 0 
0 0 0 0 
0 0 0 0 
99.6293640136719 0.309768617153168 0.0519300326704979 0.00563250901177526 
