0 0 0 0 
0 0 0 0 
0 0 0 0 
0 0 0 0 
0 0 0 0 
0 0 0 0 
0 0 0 0 
0 0 0 0 
0 0 0 0 
0 0 0 0 
0.00117278040852398 8.24696599011077e-06 -2.90697585114685e-06 2.00550562112767e-06 
0.00207095104269683 9.20432830753271e-06 -2.1299986201484e-06 3.88938315154519e-06 
0.00385068380273879 1.46582397064776e-05 -1.4232340390663e-06 7.0836749728187e-06 
0.00713567063212395 3.17613994411658e-05 -7.86151133524982e-07 1.1102501048299e-05 
0.0137405646964908 7.82593051553704e-05 5.6216600796688e-07 1.58599450514885e-05 
0.0231203883886337 0.000152335283928551 2.34252047448535e-06 1.87296500371303e-05 
0.0341200120747089 0.000240555382333696 3.80205642613873e-06 1.86547003977466e-05 
0.0460651144385338 0.000334708951413631 5.35305889570736e-06 1.56653277372243e-05 
0.0579120069742203 0.000420083932112902 6.6751558733813e-06 1.01109144452494e-05 
0.0679314583539963 0.000469803111627698 6.55876328892191e-06 3.42279281539959e-06 
0.0765787735581398 0.000485870317788795 4.84830616187537e-06 -1.71994406628073e-06 
0.0848393440246582 0.000473397638415918 3.5984833175462e-06 -4.28640259997337e-06 
0.0930869728326797 0.000439359893789515 1.64828543347539e-06 -3.83309998142067e-06 
0.100966230034828 0.000392183836083859 2.36960786992313e-07 -2.43095132645976e-06 
0.10856881737709 0.000338801648467779 -4.16339474895722e-07 -1.00656814083777e-06 
0.115917153656483 0.000283538684016094 -1.86662691703532e-06 -1.0377230097447e-07 
0.122965730726719 0.0002348079578951 -3.86127931051305e-06 1.96908743532731e-07 
0.129732355475426 0.000189738799235784 -2.99235716738622e-06 -5.72979104163096e-07 
0.136234268546104 0.000149763087392785 -5.00810483572423e-06 -1.61136608767265e-06 
0.142302945256233 0.000114998496428598 -6.77945445204386e-06 -3.40607880389143e-06 
0.147813439369202 8.84280598256737e-05 -6.47411525278585e-06 -5.09403616888449e-06 
0.152732968330383 6.68926004436798e-05 -5.81415679334896e-06 -6.40454163658433e-06 
0.15680243074894 5.18652159371413e-05 -6.9811526373087e-06 -7.30726878828136e-06 
0.159915462136269 4.62836105725728e-05 -2.31256512961409e-06 -7.66086668591015e-06 
0.162415713071823 4.4750289816875e-05 4.62671914647217e-06 -6.22466586719383e-06 
0.164633467793465 3.84276354452595e-05 1.02522180895903e-05 -4.04515321861254e-06 
0.166809320449829 2.68171770585468e-05 1.26281602206291e-05 -1.80146673756099e-06 
0.169030502438545 8.68378174345708e-06 1.25700653370586e-05 -3.73303691958426e-07 
0.171537011861801 -1.97071458387654e-05 7.75598527980037e-06 1.01683190223412e-06 
0.173927843570709 -4.28465937147848e-05 -4.24497159201565e-07 5.3179456926955e-07 
0.175887823104858 -6.72970563755371e-05 -9.11790357349673e-06 -1.15265265776543e-06 
0.177156418561935 -8.74377219588496e-05 -1.25592159747612e-05 -3.36981202053721e-06 
0.177854672074318 -9.34175041038543e-05 -1.48615890793735e-05 -3.9307619772444e-06 
0.177760228514671 -9.89039544947445e-05 -1.75405511981808e-05 -4.66760275230627e-06 
0.176978766918182 -0.000108332162199076 -1.79294875124469e-05 -5.54953066966846e-06 
0.175617575645447 -0.000114658789243549 -1.59264236572199e-05 -4.41293741459958e-06 
0.173846289515495 -0.000114379465230741 -1.64344783115666e-05 -3.43069177688449e-06 
0.171277344226837 -0.000123262798297219 -1.65060155268293e-05 -3.03133583656745e-06 
0.168091297149658 -0.000128396990476176 -1.28538167700754e-05 -1.30963883293589e-06 
0.164957255125046 -0.000132854838739149 -1.01607956821681e-05 -3.29513142105498e-07 
0.161422342061996 -0.000132432323880494 -8.79416347743245e-06 1.73316743712348e-06 
0.157430723309517 -0.000141777272801846 -9.05108208826277e-06 3.44448449141055e-06 
0.153234794735909 -0.000139199066325091 -6.61773447063752e-06 4.89814374304842e-06 
0.148564487695694 -0.000138467046781443 -6.54198038319009e-06 5.21193624081207e-06 
0.143326327204704 -0.000130721702589653 -7.34721334083588e-06 6.73979684506776e-06 
0.137731745839119 -0.000131033448269591 -6.65106426822604e-06 6.11887708146241e-06 
0.131934896111488 -0.000121568606118672 -4.1350344872626e-06 6.64774506731192e-06 
0.126002103090286 -0.000117406962090172 -2.40282861341257e-06 6.55331768939504e-06 
0.1203453540802 -0.000112667439680081 -5.73083354993287e-07 6.28688894721563e-06 
0.114586770534515 -0.000112616929982323 1.90198397831409e-06 6.29173291599727e-06 
0.10885825753212 -0.000105680861452129 3.89905153497239e-06 5.59346926820581e-06 
0.103002212941647 -0.000100720026239287 5.62126024306053e-06 5.09123810843448e-06 
0.0969303250312805 -9.7073927463498e-05 7.24229039406055e-06 4.78423362437752e-06 
0.0906098037958145 -9.0637244284153e-05 1.03665070128045e-05 4.3155287130503e-06 
0.0840769559144974 -8.42771769384854e-05 1.21483135444578e-05 4.06727576773847e-06 
0.0774672403931618 -7.72319835959934e-05 1.43366269185208e-05 4.62300249637337e-06 
0.0709665864706039 -7.17296643415466e-05 1.67799389600987e-05 4.05016726290341e-06 
0.0648498684167862 -6.47630076855421e-05 1.85597709787544e-05 4.00382350562722e-06 
0.0592595338821411 -5.79049155930988e-05 1.88672656804556e-05 4.29422698289272e-06 
0.05422168597579 -5.1147992053302e-05 2.00571594177745e-05 4.46395733888494e-06 
0.0498054400086403 -4.64801341877319e-05 2.09558875212679e-05 4.06752951676026e-06 
0.0459181629121304 -4.0171726141125e-05 2.23009210458258e-05 4.69735186925391e-06 
0.0425403863191605 -3.66874228348024e-05 2.34162198466947e-05 4.53408028988633e-06 
0.0395770557224751 -3.2577823731117e-05 2.38530210481258e-05 3.72988233721117e-06 
0.0369427017867565 -3.15697106998414e-05 2.42272835748736e-05 3.33134084939957e-06 
0.0345860049128532 -2.8354696041788e-05 2.43016947933938e-05 3.23954168379714e-06 
0.0325327999889851 -2.6194622478215e-05 2.39588080148678e-05 2.7535363642528e-06 
0.0306375455111265 -2.54364495049231e-05 2.27439577429323e-05 2.60004571828176e-06 
0.0288825239986181 -2.42829773924313e-05 2.27721066039521e-05 2.98037548418506e-06 
0.0272342897951603 -2.27336058742367e-05 2.23368133447366e-05 2.93342418444809e-06 
0.0256242118775845 -2.08694691536948e-05 2.17518227145774e-05 2.52067661676847e-06 
0.0240569747984409 -2.16447297134437e-05 2.0833247617702e-05 2.12258214560279e-06 
0.0225397758185863 -2.06311888177879e-05 2.01642487809295e-05 1.76931860096374e-06 
0.0210275519639254 -2.14240280911326e-05 1.91108338185586e-05 1.2838012253269e-06 
0.0195771008729935 -1.98025809368119e-05 1.88030571734998e-05 7.21960191185644e-07 
0.0181830022484064 -1.99603073269827e-05 1.81963805516716e-05 5.64345782549935e-07 
0.0168097224086523 -1.89782731467858e-05 1.77403289853828e-05 3.18178081215592e-07 
0.0155516657978296 -1.7996104361373e-05 1.73772295966046e-05 -1.30792813024527e-07 
0.0144213894382119 -1.71274587046355e-05 1.7085045328713e-05 -4.28443911459908e-07 
0.0134311439469457 -1.67244907061104e-05 1.64091998158256e-05 -6.23562868895533e-07 
0.0125865237787366 -1.6737114492571e-05 1.59938845172292e-05 -7.36487493213644e-07 
0.0119049120694399 -1.62719898071373e-05 1.589943349245e-05 -8.59184069668117e-07 
0.0113408584147692 -1.64941811817698e-05 1.55961242853664e-05 -9.65922254181351e-07 
0.0108916172757745 -1.63788645295426e-05 1.52189841173822e-05 -1.2816475418731e-06 
0.0105385007336736 -1.66307854669867e-05 1.51138547153096e-05 -1.45469618928473e-06 
0.0102825509384274 -1.65385736181634e-05 1.50183113873936e-05 -1.88193541816872e-06 
0.010094235651195 -1.66748286574148e-05 1.50934292832972e-05 -2.1974974515615e-06 
0.00997088197618723 -1.75310378836002e-05 1.53117271111114e-05 -2.35786478697264e-06 
0.00990891922265291 -1.82665771717438e-05 1.56738315126859e-05 -2.41291718339198e-06 
0.00988393649458885 -1.86050801858073e-05 1.61162388394587e-05 -2.63447941506456e-06 
0.00989274308085442 -1.94715939869639e-05 1.64528973982669e-05 -2.90948446490802e-06 
0.00991096533834934 -1.99345959117636e-05 1.66338359122165e-05 -3.01725617646298e-06 
0.00994523707777262 -1.97303288587136e-05 1.68655005836627e-05 -3.21276252179814e-06 
0.00998152792453766 -1.90683913388057e-05 1.71057072293479e-05 -3.5696671147889e-06 
0.0100075881928205 -1.9276951206848e-05 1.69410614034859e-05 -3.55314841726795e-06 
0.00997805688530207 -1.9151646483806e-05 1.67243360920111e-05 -3.44093359672115e-06 
0.00994077604264021 -1.89760903595015e-05 1.62590258696582e-05 -3.51290987055108e-06 
0.00988108944147825 -1.85570952453418e-05 1.60945073730545e-05 -3.48178105014085e-06 
0.00979690998792648 -1.80806582648074e-05 1.59260853251908e-05 -3.413589183765e-06 
0.00970990397036076 -1.73167754837777e-05 1.60137587954523e-05 -3.55296970155905e-06 
0.00966390408575535 -1.66248992172768e-05 1.59668998094276e-05 -3.55422253051074e-06 
0.00962507445365191 -1.60810268425848e-05 1.59310475282837e-05 -3.46064621226105e-06 
0.00958045851439238 -1.5676883776905e-05 1.59600112965563e-05 -3.49906531482702e-06 
0.00956452544778585 -1.53493019752204e-05 1.55414127220865e-05 -3.55415454578178e-06 
0.00955941807478666 -1.51681797433412e-05 1.52801567310235e-05 -3.44256523021613e-06 
0.0095721036195755 -1.4771747373743e-05 1.53855471580755e-05 -3.43638703270699e-06 
0.00960809458047152 -1.42232065627468e-05 1.55222915054765e-05 -3.57561998498568e-06 
0.00966464914381504 -1.37702763822745e-05 1.53893688548123e-05 -3.66379958904872e-06 
0.00973202381283045 -1.32575869429274e-05 1.56387068273034e-05 -3.61712818630622e-06 
0.00978679116815329 -1.24636326290783e-05 1.54853732965421e-05 -3.59188038601133e-06 
0.00984738953411579 -1.1491224540805e-05 1.50398554978892e-05 -3.60239982910571e-06 
0.00991483777761459 -1.06642219179776e-05 1.46070897244499e-05 -3.48400271832361e-06 
0.00997577328234911 -9.48837714531692e-06 1.40970569191268e-05 -3.57282510776713e-06 
0.0100137293338776 -8.88147133082384e-06 1.3595702512248e-05 -3.54033318217262e-06 
0.010076493024826 -8.15207567939069e-06 1.31508240883704e-05 -3.67725783689821e-06 
0.0101257283240557 -7.46135856388719e-06 1.29407171698404e-05 -3.82731377612799e-06 
0.0101826060563326 -6.4123528318305e-06 1.25948663480813e-05 -3.96863924834179e-06 
0.0102266110479832 -5.51543780602515e-06 1.22184746942366e-05 -3.7526881442318e-06 
0.0102655049413443 -4.6062923502177e-06 1.18439165817108e-05 -3.70046996067686e-06 
0.0103138945996761 -3.76764955944964e-06 1.12948446258088e-05 -3.83033193429583e-06 
0.0103552937507629 -3.14731164507975e-06 1.05069784694933e-05 -3.73256375496567e-06 
0.0103450156748295 -2.39625683207123e-06 9.78498428594321e-06 -3.67216807717341e-06 
0.0103645771741867 -1.3873814168619e-06 9.3296494014794e-06 -3.85941211789032e-06 
0.0103783048689365 6.81278891079273e-07 8.69541872816626e-06 -3.93946629628772e-06 
0.0103776538744569 2.75168304142426e-06 8.55066264193738e-06 -3.65437654181733e-06 
0.0103601729497313 4.89132389702718e-06 7.96911717770854e-06 -3.82869620807469e-06 
0.010373598895967 7.14893621989177e-06 7.73058854974806e-06 -4.01029410568299e-06 
0.0103312460705638 9.64573791861767e-06 7.31182899471605e-06 -3.98690417569014e-06 
0.010286170989275 1.2006478755211e-05 7.10561789674102e-06 -4.11677228839835e-06 
0.010199474170804 1.46730353662861e-05 6.64412755213561e-06 -4.47455158791854e-06 
0.0100820362567902 1.86454872164177e-05 6.45660838927142e-06 -4.64308504888322e-06 
0.00985341984778643 2.27080108743394e-05 6.00219664192991e-06 -4.70151462650392e-06 
0.00956969428807497 2.69736719928915e-05 5.52212759430404e-06 -4.95653375764959e-06 
0.00920575857162476 3.15326433337759e-05 4.73209092888283e-06 -5.29901080881245e-06 
0.00876140873879194 3.65850683010649e-05 3.74598766939016e-06 -5.69036546949064e-06 
0.00824113376438618 4.15073263866361e-05 2.87526086140133e-06 -5.93507274970762e-06 
0.00768528506159782 4.77104586025234e-05 1.71738361132157e-06 -6.4620066950738e-06 
0.00706875929608941 5.34372848051134e-05 3.20111809060108e-07 -6.75129058436141e-06 
0.00638339901342988 5.91174211876933e-05 -1.20326149044558e-06 -6.91368495608913e-06 
0.00565511593595147 6.35399992461316e-05 -2.68917415269243e-06 -6.89699481881689e-06 
0.00489109382033348 6.61182566545904e-05 -4.37447943113511e-06 -6.82004338159459e-06 
0.00412269262596965 6.51033187750727e-05 -5.84249028179329e-06 -6.39365089227795e-06 
0.00338183925487101 6.236151966732e-05 -7.09625328454422e-06 -5.94605671722093e-06 
0.00270726252347231 5.68710456718691e-05 -7.98778455646243e-06 -5.28269720234675e-06 
0.00210029189474881 4.99357120133936e-05 -8.55968391988426e-06 -4.43571616415284e-06 
0.00159239827189595 4.21814220317174e-05 -8.73787485033972e-06 -3.50890263689507e-06 
0.00117473886348307 3.49861002177931e-05 -8.58069597597932e-06 -2.61657146438665e-06 
0.000845318660140038 2.82132168649696e-05 -8.2392898548278e-06 -1.76847709099093e-06 
0.000587674498092383 2.21209920709953e-05 -7.78510275267763e-06 -1.021094931275e-06 
0.000397908297600225 1.72177715285216e-05 -7.24535084373201e-06 -4.12635188240529e-07 
0.000255808146903291 1.32167042465881e-05 -6.6961370066565e-06 3.74162247851473e-08 
0.000156790905748494 1.00192401077948e-05 -6.15091948930058e-06 3.61543811777665e-07 
8.61669104779139e-05 7.6339601946529e-06 -5.61935030418681e-06 5.54171094790945e-07 
3.66339445463382e-05 5.88921375310747e-06 -5.1595256991277e-06 6.83784151078726e-07 
5.48286243429175e-06 4.60512683275738e-06 -4.7694497880002e-06 7.40382347430568e-07 
-1.56278892973205e-05 3.64166612598638e-06 -4.41908150605741e-06 7.66566643051192e-07 
-2.93808188871481e-05 2.95252630166942e-06 -4.12426606999361e-06 7.53564620481484e-07 
-3.70257075701375e-05 2.3785296434653e-06 -3.89789693144849e-06 7.38023800295196e-07 
-4.23885503550991e-05 1.98822908714646e-06 -3.71002556676103e-06 7.29234159280168e-07 
-4.63670730823651e-05 1.70355838235992e-06 -3.55281190422829e-06 7.27870713035372e-07 
-5.31276782567147e-05 1.57552562995988e-06 -3.40946780852391e-06 7.09586629454861e-07 
0 0 0 0 
0 0 0 0 
0 0 0 0 
0 0 0 0 
0 0 0 0 
0 0 0 0 
0 0 0 0 
0 0 0 0 
0 0 0 0 
0 0 0 0 
0 0 0 0 
0 0 0 0 
0 0 0 0 
0 0 0 0 
99.8263778686523 0.147127747535706 0.0159283094108105 0.0060822400264442 
