0 0 0 0 
0 0 0 0 
0 0 0 0 
0 0 0 0 
0 0 0 0 
0 0 0 0 
0 0 0 0 
0 0 0 0 
0 0 0 0 
0 0 0 0 
0.0249303933233023 6.87574574840255e-05 2.93255084216071e-06 3.74259980162606e-06 
0.0335910841822624 7.64346841606312e-05 5.60171702090884e-06 3.76082175534975e-06 
0.042076263576746 7.33369524823502e-05 8.54439622344216e-06 2.39867290474649e-06 
0.0505522191524506 7.13228146196343e-05 1.02779140433995e-05 1.49008235439396e-06 
0.0597367808222771 6.63965547573753e-05 1.06568259070627e-05 3.88606991919005e-07 
0.0695820674300194 5.75137637497392e-05 1.06150173451169e-05 -8.41277085328329e-07 
0.0792685300111771 4.77289031550754e-05 9.34587933443254e-06 -1.8669821884032e-06 
0.0885856151580811 3.96378309233114e-05 7.16897784514003e-06 -2.3040965970722e-06 
0.0972212925553322 3.20997132803313e-05 4.88827799927094e-06 -2.38337361224694e-06 
0.104542583227158 2.51333003689069e-05 3.06769516100758e-06 -2.26616521104006e-06 
0.110348835587502 1.96069140656618e-05 8.35228831874701e-07 -2.02099408852519e-06 
0.115369535982609 1.59806149895303e-05 -9.25285121411434e-07 -1.65963569997984e-06 
0.119894057512283 1.03724814835005e-05 -2.46324202635151e-06 -1.23548807096086e-06 
0.12388476729393 5.75981039219187e-06 -3.58203624273301e-06 -9.74578256318637e-07 
0.127504840493202 2.94765118269424e-06 -4.24116842623334e-06 -9.41201051318785e-07 
0.130873933434486 1.85289411547274e-06 -4.85836335428758e-06 -7.94291509009781e-07 
0.134195476770401 2.92730987894174e-06 -5.58654255655711e-06 -3.72659371805639e-07 
0.137693524360657 4.35873516835272e-06 -5.77587388761458e-06 -6.76949866829091e-07 
0.141055747866631 6.26927476332639e-06 -6.17341493125423e-06 -6.00570615461038e-07 
0.144370391964912 7.18230785423657e-06 -6.16790703134029e-06 -8.23838490759954e-07 
0.147500813007355 7.57698262532358e-06 -6.36134200249217e-06 -6.28519273959682e-07 
0.150230944156647 6.03921444053412e-06 -5.40456994713168e-06 -3.36152623958696e-07 
0.152506202459335 5.42316411156207e-06 -4.91137689095922e-06 2.87353458361395e-07 
0.154704585671425 5.10726113134297e-06 -4.14744363297359e-06 2.8385233008521e-07 
0.15662570297718 4.71211387775838e-06 -3.67995744454674e-06 6.25916243279789e-07 
0.15858356654644 4.53499933428247e-06 -2.74845160674886e-06 7.42502777484333e-07 
0.160570055246353 5.13977465743665e-06 -2.89270656139706e-06 4.98226597756002e-07 
0.162508577108383 5.7714960348676e-06 -2.51209849011502e-06 4.91793628043524e-07 
0.164368197321892 5.86178202865995e-06 -2.9593504677905e-06 5.62839602480381e-07 
0.165946528315544 5.40241262569907e-06 -2.94000597023114e-06 4.06527703944448e-07 
0.166936263442039 5.66591279493878e-06 -2.86500085167063e-06 3.6060248476133e-07 
0.167363464832306 4.81511597172357e-06 -2.59291709880927e-06 5.50214508621139e-07 
0.167346805334091 5.09343453813926e-06 -2.3383988718706e-06 1.11079060616248e-07 
0.166764229536057 4.80542439618148e-06 -1.12366922166984e-06 1.02794537326645e-07 
0.165791973471642 3.08430708173546e-06 -6.49961691578937e-07 -3.14793197730978e-07 
0.164527297019958 1.65580922839581e-06 2.74368005648284e-07 -7.85579004514148e-07 
0.162927731871605 1.87636686632686e-07 -1.64023859383633e-07 -1.39911276164639e-06 
0.160824716091156 -1.81871473614592e-06 1.23274628549552e-06 -9.80186428023444e-07 
0.158638343214989 -3.11673056785366e-06 8.48630122618488e-07 -1.29406578253111e-06 
0.155922174453735 -2.58527370533557e-06 8.77629076967423e-07 -1.19748324323155e-06 
0.152897596359253 -2.60713272837165e-06 -2.1212844103502e-07 -8.76548597261717e-07 
0.149787023663521 -4.12677854910726e-06 1.06253344256402e-06 -8.50333492508071e-07 
0.14633184671402 -5.22002756042639e-06 -5.21488878746368e-08 -1.01692489806737e-06 
0.142137318849564 -8.91784384293715e-06 9.45047304412583e-07 -8.48451293222752e-07 
0.137600794434547 -1.54666049638763e-05 1.26081442886061e-06 2.04856647201268e-07 
0.132570251822472 -1.88615376828238e-05 2.54737005889183e-06 5.69242502024281e-07 
0.127078056335449 -2.38352567976108e-05 2.75588968179363e-06 1.14989074972982e-06 
0.121355809271336 -2.75378733931575e-05 3.64260904461844e-06 1.09599034203711e-06 
0.115771770477295 -3.01419058814645e-05 3.84907707484672e-06 1.08951007860014e-06 
0.110140308737755 -3.01315376418643e-05 4.58774184153299e-06 8.28478619041562e-07 
0.104532979428768 -3.32142553816084e-05 5.38483709533466e-06 5.14480007041129e-07 
0.0987728536128998 -3.2776253647171e-05 5.7723718782654e-06 5.87914144034585e-07 
0.0930380076169968 -3.40679653163534e-05 6.08456048212247e-06 1.21406219477649e-06 
0.0870814695954323 -3.47040295309853e-05 6.86788007442374e-06 1.1900347089977e-06 
0.0809762105345726 -3.44915388268419e-05 6.9677907958976e-06 9.90135845313489e-07 
0.0748191475868225 -3.41050836141221e-05 7.05291495251004e-06 1.27688861084607e-06 
0.0688253790140152 -3.27172492688987e-05 7.06373975845054e-06 1.31536626213347e-06 
0.0631116926670074 -3.11513285851106e-05 6.89125818098546e-06 9.69355369306868e-07 
0.057840283960104 -2.90389798465185e-05 6.19216598352068e-06 1.33332048335433e-06 
0.0532867349684238 -2.78894858638523e-05 5.63585490453988e-06 1.52400264141761e-06 
0.0493012964725494 -2.53765301749809e-05 4.86397675558692e-06 1.52756774696172e-06 
0.0458638854324818 -2.46230447373819e-05 4.08635060011875e-06 1.5896072227406e-06 
0.042871255427599 -2.26765205297852e-05 3.43881765729748e-06 1.48008052747173e-06 
0.0402348414063454 -2.08440578717273e-05 3.05079424833821e-06 1.38330312893231e-06 
0.0378030985593796 -1.84173477464356e-05 2.76604305327055e-06 1.35226230213448e-06 
0.0356966219842434 -1.71031315403525e-05 2.3250379399542e-06 1.36112589643744e-06 
0.0338598787784576 -1.4551719687006e-05 2.09514860216586e-06 1.23629047266149e-06 
0.0321778394281864 -1.36847584144562e-05 1.92400375453872e-06 1.09913173673704e-06 
0.0306715294718742 -1.27377143144258e-05 1.51781944168761e-06 9.07980449937895e-07 
0.0293244328349829 -1.23455292850849e-05 1.38283485284774e-06 6.93597826284531e-07 
0.0279795248061419 -1.16896808322053e-05 1.22438882499409e-06 5.87502086091263e-07 
0.0265946816653013 -1.12253828774556e-05 8.59003364439559e-07 5.27435190633696e-07 
0.0252926405519247 -1.03428537840955e-05 5.11578093664866e-07 6.38855794932169e-07 
0.0239533185958862 -9.47632634051843e-06 3.05766889141523e-07 7.07330173099763e-07 
0.022641571238637 -8.21411049400922e-06 3.79708637865406e-08 7.89407124557329e-07 
0.0213417299091816 -6.94837081027799e-06 -8.50132764185219e-08 7.38900666874542e-07 
0.0201045554131269 -5.55832912141341e-06 -2.86954474404411e-07 6.56345491734101e-07 
0.018916817381978 -4.0384138628724e-06 -3.87138499036155e-07 6.60629154936032e-07 
0.0178341958671808 -2.54531641985523e-06 -6.73389081384812e-07 6.38203403013904e-07 
0.0168268457055092 -1.07924131498294e-06 -1.03460433820146e-06 6.54957773349452e-07 
0.0159728322178125 1.36171664166795e-07 -1.53008102188323e-06 7.18653211606579e-07 
0.0152194825932384 1.38551047257351e-06 -1.79215112439124e-06 6.84914255089097e-07 
0.0145486798137426 2.56082216765208e-06 -2.12013219424989e-06 8.02545173428371e-07 
0.0140180923044682 3.27076259054593e-06 -2.25112398766214e-06 7.50178344333108e-07 
0.013557412661612 3.92010952054989e-06 -2.32633078667277e-06 8.76556725870614e-07 
0.0131776882335544 4.52848826171248e-06 -2.35005586546322e-06 8.56105430102616e-07 
0.0128779215738177 4.86548560729716e-06 -2.35622565014637e-06 9.32240027395892e-07 
0.0126399975270033 5.34528635398601e-06 -2.51512778959295e-06 8.95144751211774e-07 
0.0124311046674848 5.9919811974396e-06 -2.59521311818389e-06 1.05440233255649e-06 
0.0122889913618565 6.23983942205086e-06 -2.73838872999477e-06 1.00882982678741e-06 
0.0121522322297096 6.25213942839764e-06 -2.78818970400607e-06 1.05529602478782e-06 
0.0120253283530474 6.51685923003242e-06 -2.83578356174985e-06 1.1169720437465e-06 
0.011909456923604 6.98539770382922e-06 -2.73935870609421e-06 1.11448071038467e-06 
0.0117363817989826 6.94679738444393e-06 -2.7713674626284e-06 1.16464048005582e-06 
0.0115217538550496 7.13904864824144e-06 -2.54058500104293e-06 1.25604356071563e-06 
0.0112414984032512 7.35758840164635e-06 -2.6016546144092e-06 1.3337730706553e-06 
0.0108892824500799 7.38731705496321e-06 -2.53008579420566e-06 1.32968716570758e-06 
0.0104652503505349 6.90649540047161e-06 -2.54373480856884e-06 1.40814347560081e-06 
0.010014827363193 6.96816277923062e-06 -2.44300622398441e-06 1.4168193729347e-06 
0.00953652802854776 6.72404667056981e-06 -2.49057507062389e-06 1.36807966555352e-06 
0.00904917251318693 6.59068291497533e-06 -2.32038496505993e-06 1.39790233788517e-06 
0.00856514368206263 6.39018617221154e-06 -2.24108202928619e-06 1.44221735354222e-06 
0.00809697341173887 6.38012670606258e-06 -2.18718696487485e-06 1.41804616760055e-06 
0.00766966585069895 6.2635331232741e-06 -2.08985125027539e-06 1.40786289648531e-06 
0.00726226018741727 6.16216038906714e-06 -2.06459526452818e-06 1.44354896747245e-06 
0.00689448928460479 5.94569610257167e-06 -1.96643486560788e-06 1.37080860440619e-06 
0.00658415863290429 5.94304583501071e-06 -1.86435045179678e-06 1.3592180039268e-06 
0.00631244014948606 5.80819778406294e-06 -1.8648354398465e-06 1.36934761485463e-06 
0.00607010256499052 5.77879154661787e-06 -1.92250104191771e-06 1.36205994749616e-06 
0.00585440592840314 5.62648892810103e-06 -2.00602903532854e-06 1.337767912446e-06 
0.00567736243829131 5.75406056668726e-06 -2.12159170587256e-06 1.3742871942668e-06 
0.0055207940749824 5.86863689022721e-06 -2.20396941585932e-06 1.41606631132163e-06 
0.00538620259612799 5.80975438424502e-06 -2.1463779376063e-06 1.39731605486304e-06 
0.00525658205151558 5.64321635465603e-06 -2.19381990973488e-06 1.39737642257387e-06 
0.00515260733664036 5.57306020709802e-06 -2.16096577787539e-06 1.38691871143237e-06 
0.00505841011181474 5.29939916305011e-06 -2.10786220122827e-06 1.34563208575855e-06 
0.00497621856629848 4.99619864058332e-06 -2.02057799469912e-06 1.29097111312149e-06 
0.00489121442660689 4.96342227052082e-06 -2.01209240913158e-06 1.27469968447258e-06 
0.00481529580429196 4.77354433314758e-06 -1.93282767213532e-06 1.22822495995933e-06 
0.00471889087930322 4.43101862401818e-06 -1.94402400666149e-06 1.20869378861244e-06 
0.00461681885644794 4.14228907175129e-06 -1.94524159269349e-06 1.22110986922053e-06 
0.00448730122298002 3.63861840924073e-06 -2.00050362764159e-06 1.21733489777398e-06 
0.00434968108311296 3.29442241309152e-06 -2.08413280233799e-06 1.25943540751905e-06 
0.00418268004432321 3.07841060021019e-06 -2.10381381293701e-06 1.31612216591748e-06 
0.00399455288425088 2.91779474537179e-06 -2.07609036806389e-06 1.32817785924999e-06 
0.00378056685440242 3.09078541249619e-06 -2.08735946216621e-06 1.31841977690783e-06 
0.00354565191082656 2.96689063361555e-06 -2.03170543500164e-06 1.31362492084008e-06 
0.00328969769179821 2.67469295067713e-06 -1.91345475286653e-06 1.2374260904835e-06 
0.00302123604342341 2.36135929299053e-06 -1.76514618033252e-06 1.17214460715331e-06 
0.00274607422761619 2.15215618482034e-06 -1.66885649832693e-06 1.13435692128405e-06 
0.00244916905649006 1.59897922458185e-06 -1.63521394824784e-06 1.09886605059728e-06 
0.00214751646853983 1.57991962623782e-06 -1.68136398315255e-06 1.05662422811292e-06 
0.00181747099850327 1.49923550907261e-06 -1.64058724294591e-06 9.97196707430703e-07 
0.00149865075945854 1.56877842982794e-06 -1.72326440406323e-06 9.19224589779333e-07 
0.00119649083353579 1.76584273958724e-06 -1.67092696301552e-06 7.99726535660739e-07 
0.000938602373935282 2.08209735319542e-06 -1.63057063673477e-06 6.73748672852525e-07 
0.000734868226572871 2.37304539041361e-06 -1.67869154665823e-06 5.52792585040152e-07 
0.000580499297939241 2.47732737079787e-06 -1.58834109242889e-06 4.50917667649264e-07 
0.000467181031126529 2.56641055784712e-06 -1.56548185259453e-06 3.58229669927823e-07 
0.000386113591957837 2.52060726779746e-06 -1.48235153574205e-06 3.03701710890891e-07 
0.000324952852679417 2.45250180341827e-06 -1.42033093197824e-06 2.71326342726752e-07 
0.000272851844783872 2.31876447287505e-06 -1.31300646444288e-06 2.30852194249564e-07 
0.000245332485064864 2.3767972834321e-06 -1.40918621127639e-06 2.31124047900266e-07 
0.000217394102946855 2.32196907745674e-06 -1.37201038796775e-06 2.24707150664472e-07 
0.0001947327691596 2.27694749810325e-06 -1.40059114528412e-06 2.18366977833284e-07 
0.000165989316883497 1.96912969840923e-06 -1.32947889142088e-06 1.79036305780755e-07 
0.000149560757563449 1.84765065114334e-06 -1.24356176911533e-06 1.61446351398808e-07 
0.000139064446557313 1.85742737812689e-06 -1.24686596336687e-06 1.48161774404798e-07 
0.000136384318466298 2.04818366000836e-06 -1.28116187170235e-06 1.49442840324809e-07 
0.000128819636302069 1.92429070011713e-06 -1.34407241603185e-06 1.37629371010917e-07 
0.00013462349306792 2.35334618992056e-06 -1.41185182656045e-06 1.8109884081241e-07 
0.000125338876387104 2.33764171753137e-06 -1.46462161865202e-06 1.84961024274344e-07 
0.000117975971079431 2.33369951274653e-06 -1.38163568408345e-06 1.95048883711024e-07 
9.27829314605333e-05 1.73548619386565e-06 -1.21425568977429e-06 1.61488330263637e-07 
8.80555235198699e-05 1.74812407749414e-06 -1.11351050691155e-06 1.69590990140023e-07 
6.91302411723882e-05 1.23318625355751e-06 -9.74696604316705e-07 1.24246838595354e-07 
6.54484902042896e-05 1.19511491902813e-06 -8.29777491162531e-07 1.25378306847779e-07 
5.765313107986e-05 9.52629420680751e-07 -7.85525173796486e-07 1.02098304921583e-07 
6.68856373522431e-05 1.24548955682258e-06 -8.03372813606984e-07 1.19967580758384e-07 
7.53819113015197e-05 1.50846631186141e-06 -8.01061617039522e-07 1.35658552835594e-07 
8.1099511589855e-05 1.73138016634766e-06 -8.58932196479145e-07 1.41542827236663e-07 
0 0 0 0 
0 0 0 0 
0 0 0 0 
0 0 0 0 
0 0 0 0 
0 0 0 0 
0 0 0 0 
0 0 0 0 
0 0 0 0 
0 0 0 0 
0 0 0 0 
0 0 0 0 
0 0 0 0 
0 0 0 0 
99.9684448242188 0.0236116554588079 0.00433924095705152 0.00142737594433129 
