{
    "install_list": [
        {
            "bundleName": "ohos.global.systemres",
            "app_signature" : ["F7F2BE3346D03F293BD8A1DCB39DB2F55E3EFAF7B6915BC8F16E2BFCC98EBA79"],
            "singleton": true
        },
        {
            "bundleName": "com.ohos.formrenderservice",
            "app_signature": ["8E93863FC32EE238060BF69A9B37E2608FFFB21F93C862DD511CBAC9F30024B5", "92D81CD46B6891EE50607D5984B60BEBD13C9111F06E865D4EB4462F47B155F3"],
            "singleton": true,
            "allowAppUsePrivilegeExtension": true,
            "allowAppDesktopIconHide": true
        }
    ]
}
