0 0 0 0 
0 0 0 0 
0 0 0 0 
0 0 0 0 
0 0 0 0 
0 0 0 0 
0 0 0 0 
0 0 0 0 
0 0 0 0 
0 0 0 0 
0.00532902590930462 -0.000126585262478329 5.53288191440515e-06 3.5480684346112e-06 
0.00668275123462081 -0.000148978448123671 1.197049550683e-05 3.86797819373896e-06 
0.00779011705890298 -0.000169053702848032 1.92607185454108e-05 3.15599049827142e-06 
0.00889008957892656 -0.000190336999366991 2.54823862633202e-05 2.82176688415348e-06 
0.00987665634602308 -0.000208143348572776 3.28849382640328e-05 1.63453955792647e-06 
0.0107238739728928 -0.000220644767978229 4.03201884182636e-05 7.68977770349011e-08 
0.0114572588354349 -0.000228118165978231 4.47633174189832e-05 -8.22471236006095e-07 
0.0120695196092129 -0.000229904631851241 4.68942780571524e-05 -1.58415434725612e-06 
0.0125252231955528 -0.000226111442316324 4.68937323603313e-05 -2.48729566010297e-06 
0.012823048979044 -0.000219841458601877 4.19203533965629e-05 -2.34126537179691e-06 
0.0129529135301709 -0.000213021237868816 3.38288118655328e-05 -1.86893203135696e-06 
0.0129384882748127 -0.000204945332370698 2.48393607762409e-05 -1.62616515808622e-06 
0.0128280455246568 -0.000196675144252367 1.45664216688601e-05 -1.18204877708195e-06 
0.0125829093158245 -0.000186473480425775 4.79119216834079e-06 -6.38104609151924e-07 
0.0122374901548028 -0.000174755288753659 -3.62092873729125e-06 -2.53434734531766e-07 
0.0118190022185445 -0.000162517608259805 -1.06006373243872e-05 1.41454307822642e-07 
0.0113590741530061 -0.000150652718730271 -1.59426672325935e-05 5.46829141967464e-07 
0.0108517166227102 -0.000138401475851424 -1.94563308468787e-05 6.92968455950904e-07 
0.0103307301178575 -0.000127046499983408 -2.22146427404368e-05 9.99977146420861e-07 
0.00980316009372473 -0.000116579351015389 -2.38740230997792e-05 1.21291043342353e-06 
0.00927155278623104 -0.000106696970760822 -2.47908756136894e-05 1.27540238281654e-06 
0.00875589996576309 -9.80479235295206e-05 -2.52853969868738e-05 1.29135889892495e-06 
0.00826464965939522 -9.10116577870212e-05 -2.55093109444715e-05 1.49438301377813e-06 
0.0077837472781539 -8.57799386722036e-05 -2.5556966647855e-05 1.48763456309098e-06 
0.00728147896006703 -8.16918909549713e-05 -2.58661420957651e-05 1.54607300828502e-06 
0.00676188804209232 -7.68186509958468e-05 -2.61501754721394e-05 1.62354331223469e-06 
0.00627638772130013 -7.04334379406646e-05 -2.59589414781658e-05 1.67380835591757e-06 
0.00583885097876191 -6.29138448857702e-05 -2.52259069384309e-05 1.59521414389019e-06 
0.00547407520934939 -5.41826666449197e-05 -2.42264704866102e-05 1.55856162109558e-06 
0.00521484017372131 -4.51176565547939e-05 -2.27894724957878e-05 1.53785015299945e-06 
0.00506163109093904 -3.7201007216936e-05 -2.16057469515363e-05 1.53210623921041e-06 
0.00495431199669838 -3.0364579288289e-05 -2.06886415980989e-05 1.4755503343622e-06 
0.00488694431260228 -2.45248920691665e-05 -2.00627855519997e-05 1.46498700814846e-06 
0.00487253302708268 -1.88506219274132e-05 -1.96535602299264e-05 1.45475519275351e-06 
0.00492226658388972 -1.33114190248307e-05 -1.92806583072525e-05 1.40723955155408e-06 
0.00504957046359777 -7.93543404142838e-06 -1.91174531209981e-05 1.33020273551665e-06 
0.00524778151884675 -3.0891631013219e-06 -1.89675556612201e-05 1.2666311022258e-06 
0.00549244415014982 1.14183580990357e-06 -1.89702768693678e-05 1.17752836104046e-06 
0.00576435448601842 5.10252266394673e-06 -1.90048740478233e-05 1.03361821857106e-06 
0.00606484897434711 8.81239247974008e-06 -1.91276376426686e-05 9.00904808531777e-07 
0.00633979775011539 1.14787681013695e-05 -1.92899969988503e-05 7.3215659313064e-07 
0.00657884264364839 1.37081151478924e-05 -1.95573702512775e-05 6.93738797963306e-07 
0.0067768907174468 1.5922583770589e-05 -1.97216031665448e-05 5.33175068540004e-07 
0.00694622192531824 1.8863449440687e-05 -1.97286935872398e-05 4.41158107378214e-07 
0.00706662656739354 2.19166322494857e-05 -1.95099346456118e-05 2.90326767071747e-07 
0.00716726761311293 2.65692833636422e-05 -1.92393690667814e-05 1.86290279202694e-07 
0.00725433509796858 3.18609672831371e-05 -1.87024088518228e-05 -1.3683604471737e-08 
0.00734522845596075 3.87334439437836e-05 -1.79295802809065e-05 -1.61660011599452e-07 
0.00743903964757919 4.58734211861156e-05 -1.72266027220758e-05 -2.94527865207783e-07 
0.00755186006426811 5.38957756361924e-05 -1.66821628226899e-05 -4.14594410358404e-07 
0.00769145041704178 6.24322856310755e-05 -1.57952381414361e-05 -5.45812383734301e-07 
0.00786374323070049 7.12207329343073e-05 -1.51975355038303e-05 -6.863392059131e-07 
0.00807786080986261 8.02562353783287e-05 -1.4815263057244e-05 -8.24266976451327e-07 
0.00834964402019978 8.99261358426884e-05 -1.445852467441e-05 -1.05871117739298e-06 
0.00870450399816036 0.000100209865195211 -1.43514726005378e-05 -1.12378802441526e-06 
0.00915477611124516 0.000111760979052633 -1.4389086572919e-05 -1.22877497688023e-06 
0.00970237050205469 0.000124985017464496 -1.44061204991885e-05 -1.2969032923138e-06 
0.01033949945122 0.000139073934406042 -1.45624435390346e-05 -1.34133756546362e-06 
0.0110359312966466 0.000152590699144639 -1.50339319588966e-05 -1.28610577121435e-06 
0.0117524787783623 0.000165927136549726 -1.53388427861501e-05 -1.29800594095286e-06 
0.0124806556850672 0.000179429916897789 -1.57997801579768e-05 -1.18962555006874e-06 
0.0131402984261513 0.000189892845810391 -1.64304092322709e-05 -1.27825535400916e-06 
0.0136957941576838 0.00019886894733645 -1.68543301697355e-05 -1.35902087095019e-06 
0.0140633955597878 0.000203281888389029 -1.66784011526033e-05 -1.33436992655334e-06 
0.0141901168972254 0.000203749688807875 -1.7024198314175e-05 -1.24420262181957e-06 
0.0140415970236063 0.000198431065655313 -1.68650622072164e-05 -1.35504706122447e-06 
0.013687145896256 0.000190142149222083 -1.63826534844702e-05 -1.29037221086037e-06 
0.0131451357156038 0.000177325084223412 -1.62897576956311e-05 -1.12428529064346e-06 
0.0125406766310334 0.000164846424013376 -1.60809813678497e-05 -1.2990838058613e-06 
0.0119460914283991 0.000151733693201095 -1.55395118781598e-05 -1.48610865835508e-06 
0.0114162573590875 0.00013957369083073 -1.44581927088439e-05 -1.67298617270717e-06 
0.0109932785853744 0.000128879371914081 -1.40219681270537e-05 -1.77024332970177e-06 
0.010694831609726 0.000119897769764066 -1.33600569824921e-05 -1.94121776075917e-06 
0.0105120735242963 0.000112751855340321 -1.31448805404943e-05 -1.86857732842327e-06 
0.0104569010436535 0.000107702035165858 -1.23376321425894e-05 -2.06679260372766e-06 
0.0104978075250983 0.000103577323898207 -1.26097174870665e-05 -2.06691015591787e-06 
0.0105858910828829 0.000100229401141405 -1.27137518575182e-05 -2.12065810956119e-06 
0.0107421269640326 9.77219024207443e-05 -1.25914621094125e-05 -2.27402165364765e-06 
0.0109434211626649 9.64540231507272e-05 -1.27423954836559e-05 -2.42748569689866e-06 
0.0111814960837364 9.58159871515818e-05 -1.29232957988279e-05 -2.40026861320075e-06 
0.0114611303433776 9.72566922428086e-05 -1.33434450617642e-05 -2.59101011579332e-06 
0.0118396738544106 0.000102680714917369 -1.33767525767325e-05 -2.83232407127798e-06 
0.012363295070827 0.000112730944238137 -1.33224702949519e-05 -2.81656571132771e-06 
0.0132157308980823 0.000131788750877604 -1.23694399007945e-05 -2.87310876956326e-06 
0.0147857423871756 0.000165445177117363 -1.15070661195205e-05 -3.53677660314133e-06 
0.017820943146944 0.000223193754209206 -9.07639241631841e-06 -4.44197712567984e-06 
0.0233643893152475 0.000309446797473356 -6.88320824338007e-06 -5.84424242333625e-06 
0.0326538048684597 0.000411796238040552 -8.99824590305798e-06 -7.40977702662349e-06 
0.0467283949255943 0.000509430596139282 -1.53941655298695e-05 -9.353810128232e-06 
0.0660811588168144 0.000589070376008749 -1.89688325917814e-05 -1.02177264125203e-05 
0.0898271426558495 0.000622952007688582 -2.85990190604934e-05 -9.06349305296317e-06 
0.115513741970062 0.00059535528998822 -4.65560879092664e-05 -6.46778653390356e-06 
0.140964597463608 0.000518558139447123 -6.50911897537299e-05 -8.84848134319327e-07 
0.163802251219749 0.000419067597249523 -7.11570974090137e-05 5.34924129169667e-06 
0.182097882032394 0.00029461388476193 -9.50004978221841e-05 1.26188160720631e-05 
0.194582030177116 0.000180936680408195 -0.000112333073047921 1.66543795785401e-05 
0.202777147293091 7.95434534666128e-05 -0.000121146207675338 2.23726419790182e-05 
0.207225173711777 5.0842427299358e-06 -0.000126407234347425 2.01177681447007e-05 
0.20869617164135 -4.85223354189657e-05 -0.000123487945529632 1.56030419020681e-05 
0.208193808794022 -6.84946862747893e-05 -0.000107782318082172 1.18160496640485e-05 
0.206935346126556 -9.67274900176562e-05 -0.000100038298114669 8.34832280816045e-06 
0.204560905694962 -0.000118262738396879 -9.31263857637532e-05 4.62418802271714e-06 
0.201275929808617 -0.000128495375975035 -8.30076314741746e-05 1.5818221754671e-06 
0.197802230715752 -0.000159586488734931 -7.95421001384966e-05 3.63086996912898e-06 
0.193921312689781 -0.000186626188224182 -7.83007053541951e-05 1.70348516803642e-06 
0.189976587891579 -0.000195622953469865 -6.97208524798043e-05 -2.45576120505575e-06 
0.18620502948761 -0.000198157096747309 -5.73378783883527e-05 -7.50057279219618e-06 
0.182419255375862 -0.000199042784515768 -4.3087678932352e-05 -7.2322104642808e-06 
0.178643822669983 -0.000187848519999534 -3.31746632582508e-05 -1.19891956273932e-05 
0.174400106072426 -0.000184125397936441 -1.91216404346051e-05 -1.30139187604073e-05 
0.169952943921089 -0.000183580705197528 1.52925599650189e-06 -1.04097489384003e-05 
0.165351584553719 -0.000184015967533924 1.568058905832e-05 -8.74256602401147e-06 
0.160580858588219 -0.00018594489665702 3.52201168425381e-05 -7.0356868491217e-06 
0.155141457915306 -0.000174246888491325 4.89153826492839e-05 -5.00371834277757e-06 
0.149974808096886 -0.000161474585183896 6.61049853079021e-05 -5.69697931496194e-06 
0.144465357065201 -0.000135149719426408 7.88465040386654e-05 -8.09870380180655e-06 
0.138768345117569 -0.000109838998469058 9.78463722276501e-05 -9.8320206234348e-06 
0.132750853896141 -8.84331238921732e-05 0.000107587948150467 -1.19544847621e-05 
0.126665741205215 -6.47693304927088e-05 0.000119839351100381 -1.40141492011026e-05 
0.120590530335903 -4.00198441639077e-05 0.000133844368974678 -1.32722889247816e-05 
0.114423453807831 -2.05673859454691e-05 0.000142980803502724 -1.09938282548683e-05 
0.107667230069637 4.57586202173843e-06 0.000153008426423185 -9.47371518122964e-06 
0.101222939789295 3.38449026457965e-05 0.000166874189744703 -8.78027276485227e-06 
0.0946837440133095 4.79735645058099e-05 0.000182489195140079 -6.51275377094862e-06 
0.0879817381501198 6.57073833281174e-05 0.000191392246051691 -5.82799430048908e-06 
0.0811950117349625 7.73365827626549e-05 0.000204677649890073 -2.33342620958865e-06 
0.0747706517577171 9.30681562749669e-05 0.000215092513826676 3.55752462155579e-07 
0.0680871456861496 0.0001020577547024 0.000221104841330089 3.74818455384229e-06 
0.061661671847105 0.00011683347838698 0.000225167328608222 6.71174211674952e-06 
0.0552813783288002 0.00012341991532594 0.000228595628868788 9.99011990643339e-06 
0.0491101406514645 0.000125138627481647 0.000228928605793044 1.07448495327844e-05 
0.0428675189614296 0.000120876211440191 0.000222733462578617 1.21743951240205e-05 
0.0369294174015522 0.00011288979294477 0.000213139690458775 1.28839647004497e-05 
0.0312548242509365 0.000102420228358824 0.000198634748812765 1.39385938382475e-05 
0.0259202402085066 8.75500845722854e-05 0.00018191100389231 1.4041838767298e-05 
0.0210863314568996 7.34501300030388e-05 0.000161112082423642 1.34627262013964e-05 
0.0169486086815596 5.66084818274248e-05 0.000143089942866936 1.21556286103441e-05 
0.0134136807173491 3.7828791391803e-05 0.00012405937013682 1.08578888102784e-05 
0.0103764357045293 1.70582134160213e-05 0.00010460404882906 9.27651853999123e-06 
0.00785401929169893 -6.48881609777163e-07 8.61380322021432e-05 7.54785060053109e-06 
0.00580493034794927 -1.56824735313421e-05 6.95011331117712e-05 6.10205688644783e-06 
0.004192388150841 -2.57421124842949e-05 5.34886930836365e-05 4.95566655445145e-06 
0.00294896867126226 -3.36449593305588e-05 4.07743427786045e-05 3.7915253869869e-06 
0.00203835754655302 -3.81773461413104e-05 2.98214672511676e-05 2.94159826808027e-06 
0.00136312830727547 -4.13771194871515e-05 2.11830574698979e-05 2.24557379624457e-06 
0.000887727364897728 -4.26315855293069e-05 1.42875423989608e-05 1.70802832144545e-06 
0.000544668757356703 -4.3573683797149e-05 9.37011918722419e-06 1.22390486012591e-06 
0.000306071538943797 -4.35216425103135e-05 5.51462653675117e-06 9.26219456687249e-07 
0.000140227944939397 -4.29979045293294e-05 2.54521955866949e-06 7.19228808065964e-07 
3.39158577844501e-05 -4.1421597416047e-05 4.04920228902483e-07 5.80574692321534e-07 
-3.9106762415031e-05 -3.97413241444156e-05 -9.75240709522041e-07 5.07533115978731e-07 
-7.89263431215659e-05 -3.76344032702036e-05 -2.11493920687644e-06 4.57879480109114e-07 
-0.000102008947578724 -3.52823117282242e-05 -2.72211445917492e-06 4.14062100162482e-07 
-0.000115231479867361 -3.28323367284611e-05 -3.10775317302614e-06 3.83963310923718e-07 
-0.000121097858936992 -3.10240720864385e-05 -3.37657502313959e-06 3.74078013010148e-07 
-0.00011830338917207 -2.9040496883681e-05 -3.57179806087515e-06 3.87600948670297e-07 
-0.00011875934433192 -2.73879268206656e-05 -3.60300987267692e-06 3.79107092385311e-07 
-0.000115328766696621 -2.59979060501792e-05 -3.67774418918998e-06 4.07455132744872e-07 
-0.00011720105248969 -2.49551903834799e-05 -3.67599841410993e-06 4.06145062470387e-07 
-0.000114885850052815 -2.39675591728883e-05 -3.73518673768558e-06 4.15113873941664e-07 
-0.00012135696306359 -2.31145295401802e-05 -3.66874610335799e-06 3.72542217519367e-07 
0 0 0 0 
0 0 0 0 
0 0 0 0 
0 0 0 0 
0 0 0 0 
0 0 0 0 
0 0 0 0 
0 0 0 0 
0 0 0 0 
0 0 0 0 
0 0 0 0 
0 0 0 0 
0 0 0 0 
0 0 0 0 
99.684326171875 0.208086311817169 0.0968367233872414 0.00770940445363522 
