爽	shuang3
疤	ba1
灎	ba5
太	tai4
但	dan4
齃	pao3
袍	pao2
砗	che1
疽	ju1
蹭	ceng4
我	wo3
跟	gen1
进	jin4
口	kou3
龙	long2
球	qiu2
鞋	xie2
蟀	shuai4
虑	lv4
虐	nve4
而	er2
非	fei1
秓	zhi1
纸	zhi3
禾	he2
鹤	he4
活	huo2
藿	huo4
弧	hu2
麻	ma2
码	ma3
爩	ma5
亚	ya4
灪	za3
啧	ze2
渣	zha1