<eps>	0
(ni3)^(hao3)^(you1)^(you1)	1
(ni3)^(hao4)^(you1)^(you1)	2
(wei1)^(xin4)^(zhi1)^(fu4)	3
(wei1)^(shen1)^(zhi1)^(fu4)	4
(zhi1)^(fu4)^(bao3)^(zhi1)^(fu4)	5
(wei1)^(xin4)^(sao3)^(yi1)^(sao3)	6
(wei1)^(xin4)^(sao3)^(yi1)^(sao4)	7
(wei1)^(xin4)^(sao3)^(yi2)^(sao3)	8
(wei1)^(xin4)^(sao3)^(yi2)^(sao4)	9
(wei1)^(xin4)^(sao4)^(yi1)^(sao3)	10
(wei1)^(xin4)^(sao4)^(yi1)^(sao4)	11
(wei1)^(xin4)^(sao4)^(yi2)^(sao3)	12
(wei1)^(xin4)^(sao4)^(yi2)^(sao4)	13
(wei1)^(shen1)^(sao3)^(yi1)^(sao3)	14
(wei1)^(shen1)^(sao3)^(yi1)^(sao4)	15
(wei1)^(shen1)^(sao3)^(yi2)^(sao3)	16
(wei1)^(shen1)^(sao3)^(yi2)^(sao4)	17
(wei1)^(shen1)^(sao4)^(yi1)^(sao3)	18
(wei1)^(shen1)^(sao4)^(yi1)^(sao4)	19
(wei1)^(shen1)^(sao4)^(yi2)^(sao3)	20
(wei1)^(shen1)^(sao4)^(yi2)^(sao4)	21
(zhi1)^(fu4)^(bao3)^(sao3)^(yi1)^(sao3)	22
(zhi1)^(fu4)^(bao3)^(sao3)^(yi1)^(sao4)	23
(zhi1)^(fu4)^(bao3)^(sao3)^(yi2)^(sao3)	24
(zhi1)^(fu4)^(bao3)^(sao3)^(yi2)^(sao4)	25
(zhi1)^(fu4)^(bao3)^(sao4)^(yi1)^(sao3)	26
(zhi1)^(fu4)^(bao3)^(sao4)^(yi1)^(sao4)	27
(zhi1)^(fu4)^(bao3)^(sao4)^(yi2)^(sao3)	28
(zhi1)^(fu4)^(bao3)^(sao4)^(yi2)^(sao4)	29
(ao3)^(yi4)^(xiao3)^(yi4)	30
(yao3)^(yi4)^(xiao3)^(yi4)	31
(yi3)^(hao3)^(you1)^(you1)	32
(yi3)^(hao4)^(you1)^(you1)	33
(ei1)^(xin4)^(zhi1)^(fu4)	34
(ei1)^(shen1)^(zhi1)^(fu4)	35
(ei2)^(xin4)^(zhi1)^(fu4)	36
(ei2)^(shen1)^(zhi1)^(fu4)	37
(ei3)^(xin4)^(zhi1)^(fu4)	38
(ei3)^(shen1)^(zhi1)^(fu4)	39
(ei4)^(xin4)^(zhi1)^(fu4)	40
(ei4)^(shen1)^(zhi1)^(fu4)	41
(xi1)^(xin4)^(zhi1)^(fu4)	42
(xi1)^(shen1)^(zhi1)^(fu4)	43
(ri4)^(fu4)^(bao3)^(zhi1)^(fu4)	44
(ei1)^(xin4)^(sao3)^(yi1)^(sao3)	45
(ei1)^(xin4)^(sao3)^(yi2)^(sao3)	46
(ei1)^(xin4)^(sao4)^(yi1)^(sao3)	47
(ei1)^(xin4)^(sao4)^(yi2)^(sao3)	48
(ei1)^(shen1)^(sao3)^(yi1)^(sao3)	49
(ei1)^(shen1)^(sao3)^(yi2)^(sao3)	50
(ei1)^(shen1)^(sao4)^(yi1)^(sao3)	51
(ei1)^(shen1)^(sao4)^(yi2)^(sao3)	52
(ei2)^(xin4)^(sao3)^(yi1)^(sao3)	53
(ei2)^(xin4)^(sao3)^(yi2)^(sao3)	54
(ei2)^(xin4)^(sao4)^(yi1)^(sao3)	55
(ei2)^(xin4)^(sao4)^(yi2)^(sao3)	56
(ei2)^(shen1)^(sao3)^(yi1)^(sao3)	57
(ei2)^(shen1)^(sao3)^(yi2)^(sao3)	58
(ei2)^(shen1)^(sao4)^(yi1)^(sao3)	59
(ei2)^(shen1)^(sao4)^(yi2)^(sao3)	60
(ei3)^(xin4)^(sao3)^(yi1)^(sao3)	61
(ei3)^(xin4)^(sao3)^(yi2)^(sao3)	62
(ei3)^(xin4)^(sao4)^(yi1)^(sao3)	63
(ei3)^(xin4)^(sao4)^(yi2)^(sao3)	64
(ei3)^(shen1)^(sao3)^(yi1)^(sao3)	65
(ei3)^(shen1)^(sao3)^(yi2)^(sao3)	66
(ei3)^(shen1)^(sao4)^(yi1)^(sao3)	67
(ei3)^(shen1)^(sao4)^(yi2)^(sao3)	68
(ei4)^(xin4)^(sao3)^(yi1)^(sao3)	69
(ei4)^(xin4)^(sao3)^(yi2)^(sao3)	70
(ei4)^(xin4)^(sao4)^(yi1)^(sao3)	71
(ei4)^(xin4)^(sao4)^(yi2)^(sao3)	72
(ei4)^(shen1)^(sao3)^(yi1)^(sao3)	73
(ei4)^(shen1)^(sao3)^(yi2)^(sao3)	74
(ei4)^(shen1)^(sao4)^(yi1)^(sao3)	75
(ei4)^(shen1)^(sao4)^(yi2)^(sao3)	76
(xi1)^(xin4)^(sao3)^(yi1)^(sao3)	77
(xi1)^(xin4)^(sao3)^(yi2)^(sao3)	78
(xi1)^(xin4)^(sao4)^(yi1)^(sao3)	79
(xi1)^(xin4)^(sao4)^(yi2)^(sao3)	80
(xi1)^(shen1)^(sao3)^(yi1)^(sao3)	81
(xi1)^(shen1)^(sao3)^(yi2)^(sao3)	82
(xi1)^(shen1)^(sao4)^(yi1)^(sao3)	83
(xi1)^(shen1)^(sao4)^(yi2)^(sao3)	84
(ri4)^(fu4)^(bao3)^(sao3)^(yi1)^(sao3)	85
(ri4)^(fu4)^(bao3)^(sao3)^(yi1)^(sao4)	86
(ri4)^(fu4)^(bao3)^(sao3)^(yi2)^(sao3)	87
(ri4)^(fu4)^(bao3)^(sao3)^(yi2)^(sao4)	88
(ri4)^(fu4)^(bao3)^(sao4)^(yi1)^(sao3)	89
(ri4)^(fu4)^(bao3)^(sao4)^(yi1)^(sao4)	90
(ri4)^(fu4)^(bao3)^(sao4)^(yi2)^(sao3)	91
(ri4)^(fu4)^(bao3)^(sao4)^(yi2)^(sao4)	92
(yi4)^(xiao3)^(yi4)	93
(hao3)^(you1)^(you1)	94
(hao4)^(you1)^(you1)	95
(xin4)^(zhi1)^(fu4)	96
(shen1)^(zhi1)^(fu4)	97
(fu4)^(bao3)^(zhi1)^(fu4)	98
(xin4)^(sao3)^(yi1)^(sao3)	99
(xin4)^(sao3)^(yi1)^(sao4)	100
(xin4)^(sao3)^(yi2)^(sao3)	101
(xin4)^(sao3)^(yi2)^(sao4)	102
(xin4)^(sao4)^(yi1)^(sao3)	103
(xin4)^(sao4)^(yi1)^(sao4)	104
(xin4)^(sao4)^(yi2)^(sao3)	105
(xin4)^(sao4)^(yi2)^(sao4)	106
(shen1)^(sao3)^(yi1)^(sao3)	107
(shen1)^(sao3)^(yi1)^(sao4)	108
(shen1)^(sao3)^(yi2)^(sao3)	109
(shen1)^(sao3)^(yi2)^(sao4)	110
(shen1)^(sao4)^(yi1)^(sao3)	111
(shen1)^(sao4)^(yi1)^(sao4)	112
(shen1)^(sao4)^(yi2)^(sao3)	113
(shen1)^(sao4)^(yi2)^(sao4)	114
(fu4)^(bao3)^(sao3)^(yi1)^(sao3)	115
(fu4)^(bao3)^(sao3)^(yi1)^(sao4)	116
(fu4)^(bao3)^(sao3)^(yi2)^(sao3)	117
(fu4)^(bao3)^(sao3)^(yi2)^(sao4)	118
(fu4)^(bao3)^(sao4)^(yi1)^(sao3)	119
(fu4)^(bao3)^(sao4)^(yi1)^(sao4)	120
(fu4)^(bao3)^(sao4)^(yi2)^(sao3)	121
(fu4)^(bao3)^(sao4)^(yi2)^(sao4)	122
(xiao3)^(yi4)^(xiao3)^(yi4)	123
有过	124
我到	125
他说	126
山市	127
清除	128
诺	129
那就	130
那个	131
冷	132
会不	133
公交	134
刚从	135
冬季	136
春节	137
新的	138
他看	139
你那	140
现在	141
后就	142
大	143
那	144
的	145
样的	146
打成	147
而	148
哈	149
啥	150
家	151
灯	152
新	153
乌	154
一几	155
啊	156
大概	157
还有	158
能	159
类型	160
你觉得	161
在	162
女朋友	163
一起	164
时间	165
一个	166
你又	167
穿哪套	168
衣服	169
你这	170
机好	171
工厂	172
激动	173
不愿	174
确实	175
住宿	176
初三	177
节奏	178
利用	179
实力	180
科比	181
第十	182
替我	183
柳	184
自助	185
练习	186
龚	187
猛烈	188
胸罩	189
蘑菇	190
助理	191
之类	192
金牛	193
三级	194
欠费	195
惠	196
本事	197
广元	198
虹桥	199
自	200
瞎	201
前台	202
乔	203
熟	204
阅兵	205
承德	206
会让	207
脱掉	208
兆	209
狗狗	210
长期	211
山区	212
验证	213
鄙视	214
说不	215
份	216
体会	217
步骤	218
欣	219
厘米	220
迷茫	221
组	222
沈	223
源	224
面子	225
问道	226
你比	227
人间	228
哇	229
商品	230
夜班	231
枪	232
就够	233
接到	234
男友	235
纽约	236
箱	237
西路	238
野	239
瓜	240
来吃	241
坑	242
宇	243
奇	244
鞍山	245
自知	246
蜜	247
威	248
情绪	249
现场	250
燕子	251
几度	252
觉觉	253
冰	254
民兵	255
霆锋	256
暖	257
断	258
水平	259
西南	260
风流	261
桌	262
也快	263
之际	264
侦探	265
足彩	266
就得	267
魔女	268
售价	269
古诗	270
总会	271
珠	272
订购	273
四分	274
心都	275
喝醉	276
恐龙	277
立	278
屋	279
六分	280
苍井	281
平方	282
盛	283
良心	284
伞	285
国语	286
湘潭	287
海阔	288
滚蛋	289
搬	290
切糕	291
快捷	292
订票	293
伦敦	294
己	295
会玩	296
工具	297
复活	298
红柿	299
呆	300
太冷	301
汽油	302
送到	303
谁能	304
天河	305
灵	306
九百	307
原则	308
关键	309
西班	310
位于	311
凌晨	312
你一个	313
呃	314
骑士	315
以后	316
户口	317
四百	318
拜托	319
你啊	320
四日	321
冰冰	322
精	323
魅力	324
秋天	325
也好	326
用手	327
条路	328
会来	329
设	330
混蛋	331
请假	332
零三	333
交流	334
敏	335
就来	336
眼里	337
排骨	338
厚	339
蛮	340
会很	341
骂人	342
五七	343
那也	344
巴马	345
当前	346
竟然	347
型	348
等级	349
心如	350
千里	351
刺激	352
人人	353
和谁	354
京	355
存	356
带来	357
周日	358
像我	359
很忙	360
你看	361
共产	362
季节	363
前面	364
土	365
得多	366
集合	367
何处	368
文章	369
驰	370
烦恼	371
句	372
步	373
敷衍	374
无论	375
俄	376
松	377
盐城	378
我的爱	379
忙吗	380
耳机	381
人们	382
完全	383
致	384
懒	385
蓝色	386
毛球	387
长城	388
邮	389
情侣	390
火星	391
牡丹	392
明日	393
教学	394
系列	395
战士	396
追求	397
体重	398
轻松	399
平洋	400
字母	401
友谊	402
拒绝	403
温暖	404
负责	405
糊涂	406
修改	407
香蕉	408
不听	409
女士	410
为啥	411
扣	412
猪猪	413
旅行	414
说错	415
川	416
张翰	417
我从	418
国荣	419
摸	420
球队	421
千年	422
设定	423
资格	424
毕竟	425
朝阳	426
见识	427
同样	428
后台	429
冻	430
根	431
最贵	432
说些	433
路由	434
我得	435
永恒	436
顾问	437
准时	438
讨论	439
盘	440
邓丽	441
股份	442
堵车	443
鼻子	444
第几	445
新加	446
外星	447
提高	448
书店	449
改成	450
三围	451
汤圆	452
十日	453
陕西	454
快速	455
使	456
看一下	457
饭馆	458
子都	459
新婚	460
复习	461
叔	462
人说	463
贵州	464
眼光	465
叫他	466
剧	467
周边	468
寝室	469
四年	470
晴天	471
试	472
讨厌	473
集团	474
悟空	475
产品	476
事成	477
培训	478
杨幂	479
看书	480
城	481
梁静	482
评论	483
比我	484
补偿	485
舍	486
得	487
浪漫	488
零零	489
浪费	490
卖	491
存在	492
义乌	493
天涯	494
最爱	495
我们就	496
山西	497
五三	498
最快	499
篮球	500
破	501
牛肉	502
把他	503
门票	504
窗	505
不爱	506
记忆	507
海口	508
精灵	509
减	510
奇迹	511
识别	512
趟	513
企业	514
更新	515
见到	516
站到	517
说明	518
非常	519
军	520
摩托	521
活	522
轩	523
他们	524
万	525
股票	526
不及	527
学校	528
蓝	529
岳阳	530
植物	531
躺在	532
宽带	533
乱	534
成年	535
愉快	536
今天	537
催眠	538
南昌	539
邮编	540
看来	541
地	542
西安	543
穿梭	544
决定	545
功能	546
事我	547
四四	548
码	549
网吧	550
日来	551
题	552
女孩	553
预防	554
另	555
纸	556
早起	557
爸	558
客运	559
欺负	560
习近平	561
浙江	562
人不	563
飞车	564
故	565
南	566
只在	567
学习	568
相关	569
小^V^小^V	570
肚子	571
酒吧	572
科技	573
头	574
元	575
几日	576
密码	577
机里	578
日语	579
赶紧	580
太不	581
明星	582
关掉	583
客气	584
商丘	585
周围	586
阳	587
胡	588
含	589
不对	590
耽误	591
道为	592
送	593
期末	594
木	595
普通	596
我用	597
鸡鸡	598
朱	599
想睡	600
昨	601
不得	602
不该	603
寄	604
痛	605
面	606
怕	607
过我	608
左右	609
我干	610
国	611
她在	612
九七	613
数字	614
教	615
都睡	616
观看	617
按	618
社	619
有些	620
国庆	621
名称	622
解决	623
就像	624
嫉妒	625
实在	626
政局	627
似	628
浏览	629
宇宙	630
日前	631
肺	632
婚前	633
诚	634
里来	635
厕所	636
身材	637
计算	638
中央	639
们	640
厉害	641
失眠	642
停止播放	643
着	644
钢琴	645
滋味	646
约会	647
杰	648
只要	649
主席	650
香烟	651
骗人	652
性	653
六十	654
未来	655
浩特	656
旅游	657
有看	658
会在	659
浪	660
骗我	661
学会	662
我买	663
室	664
见面	665
几时	666
也要	667
秀	668
不够	669
四级	670
摄像	671
三九	672
元旦	673
杰克	674
不	675
运会	676
新闻	677
我请	678
都市	679
百度	680
然后	681
此	682
空间	683
局	684
咋办	685
我看	686
如此	687
全球	688
当兵	689
女生	690
笑	691
香港	692
也会	693
武汉	694
联播	695
司机	696
其实	697
忍	698
太累	699
预报	700
我很	701
分	702
年级	703
有种	704
平平	705
全部	706
唱吧	707
希	708
同学	709
飞	710
联通	711
领导	712
就算	713
提前	714
针	715
有没	716
途	717
要到	718
虽然	719
几年	720
吗	721
关闭	722
机会	723
做呢	724
十二	725
单位	726
拯救	727
琴	728
推荐	729
滚	730
听听	731
柯南	732
理我	733
最火	734
快递	735
要我	736
升起	737
新娘	738
三年	739
往	740
居然	741
直接	742
正常	743
亦菲	744
张雨	745
蛋	746
总	747
粉	748
精神	749
圆	750
感冒	751
周星	752
体育	753
何必	754
有害	755
登陆	756
我写	757
莫	758
滨	759
至	760
有空	761
光棍	762
可怕	763
公	764
半	765
变成	766
眼睛	767
每天	768
完美	769
网	770
专业	771
牛奶	772
之	773
子座	774
能否	775
还在	776
工资	777
地铁	778
祝您	779
寂寞	780
会用	781
瓶子	782
价格	783
表白	784
并不	785
派	786
思考	787
生气	788
远	789
主流	790
扫描	791
刚刚	792
错过	793
美国	794
乖	795
长得	796
乡	797
县	798
有	799
人睡	800
人多	801
样子	802
关心	803
懂	804
蓝牙	805
发言	806
富	807
熟悉	808
部分	809
十元	810
春	811
你开	812
长流	813
百科	814
期间	815
减肥	816
所谓	817
节目	818
雅人	819
主持	820
起	821
车站	822
板	823
光	824
郁闷	825
我	826
环境	827
沙	828
姓名	829
脑	830
酒	831
主人	832
没事	833
允许	834
零四	835
问	836
芜湖	837
节日	838
地震	839
视频	840
算	841
经历	842
性格	843
公共	844
火影	845
时	846
离	847
七日	848
对我	849
赚钱	850
坐	851
美	852
饿	853
泰州	854
挂	855
爱我	856
凡	857
分数	858
天水	859
唐诗	860
八五	861
美容	862
生	863
成	864
编码	865
女友	866
农历	867
最后	868
距离	869
再过	870
不同	871
治疗	872
反正	873
既然	874
五十	875
认真	876
园	877
消息	878
窝里	879
疼	880
期中	881
运	882
每	883
人都	884
本来	885
移动	886
恭喜	887
常州	888
深圳	889
从	890
为我	891
就没	892
还要	893
陪我	894
毕业	895
东北	896
我妈	897
周	898
邮局	899
鬼	900
我没	901
不许	902
有人	903
人心	904
鼻涕	905
父亲	906
管理	907
批发	908
安全	909
也很	910
河南	911
酒泉	912
地址	913
日元	914
两	915
实验	916
泉州	917
有多	918
心	919
表	920
严	921
颜色	922
油性皮肤	923
公园	924
气冷	925
死	926
惹	927
怪	928
工程	929
自私	930
峰	931
购买	932
称呼	933
来自	934
汽	935
聪明	936
就能	937
晓得	938
成都	939
福利	940
加入	941
重庆	942
的心	943
事吧	944
考	945
用我	946
属于	947
要买	948
龙岗	949
金	950
错	951
时就	952
先	953
相	954
关于	955
坏人	956
市区	957
胜利	958
全	959
让你	960
种人	961
柳州	962
喝	963
姨妈	964
洋	965
面积	966
戴	967
买票	968
卓	969
着呢	970
人呢	971
违章	972
玩吧	973
襄樊	974
控制	975
食品	976
办公	977
五四	978
尽快	979
用卡	980
缘分	981
日	982
合适	983
丑	984
穷	985
服装	986
粥	987
交	988
我心	989
东	990
舞	991
长途	992
责任	993
周年	994
特	995
突然	996
男女	997
二百	998
死人	999
赢	1000
从事	1001
合肥	1002
汽车	1003
日期	1004
西	1005
重要	1006
餐馆	1007
结果	1008
今儿	1009
组织	1010
睡吧	1011
徐州	1012
比赛	1013
维修	1014
进来	1015
跳舞	1016
跟着	1017
认	1018
香	1019
取消	1020
章	1021
我一会	1022
活动	1023
有缘	1024
内容	1025
洗完	1026
早晨	1027
公司	1028
装备	1029
宠物	1030
没吃	1031
规则	1032
药	1033
共	1034
很久	1035
输入	1036
装	1037
温度	1038
疯	1039
原	1040
演唱	1041
笨	1042
某	1043
高跟	1044
如	1045
甲	1046
其	1047
块	1048
购物	1049
李	1050
游记	1051
石	1052
值	1053
食物	1054
真的很	1055
原来	1056
预	1057
服务	1058
都听	1059
前	1060
说他	1061
文学	1062
主义	1063
不睡	1064
形成	1065
孤单	1066
明明	1067
杀	1068
生人	1069
事件	1070
晕	1071
天天	1072
请我	1073
僵尸	1074
别说	1075
删除	1076
这个	1077
有关	1078
精彩	1079
想买	1080
市场	1081
真心	1082
色球	1083
快快	1084
四川	1085
特曼	1086
江南	1087
五六	1088
直	1089
蹲	1090
次	1091
力	1092
炒	1093
索尼	1094
我生	1095
草	1096
贵阳	1097
经验	1098
他在	1099
茶	1100
勇气	1101
感动	1102
空	1103
星级	1104
史	1105
夫妻	1106
寺	1107
智商	1108
不如	1109
你们	1110
骗	1111
病	1112
泽东	1113
待	1114
怕我	1115
收	1116
太笨	1117
机票	1118
睡着	1119
人类	1120
据说	1121
西游	1122
属	1123
尾巴	1124
动漫	1125
米	1126
油	1127
寻找	1128
互	1129
媛	1130
忍者	1131
叫做	1132
委屈	1133
价钱	1134
未	1135
名叫	1136
面对	1137
聊聊	1138
货	1139
后面	1140
彩	1141
骂	1142
玉	1143
无敌	1144
操作	1145
能不	1146
零五	1147
陌	1148
李白	1149
五百	1150
文明	1151
想吃	1152
心疼	1153
自动	1154
校区	1155
谈过	1156
幽默	1157
身	1158
日文	1159
他不	1160
不接	1161
相片	1162
十年	1163
长江	1164
科学	1165
才不	1166
瑞	1167
今日	1168
二五	1169
早睡	1170
名单	1171
套	1172
各种	1173
作用	1174
古代	1175
愚人	1176
随时	1177
傻子	1178
羽	1179
秦	1180
没到	1181
自由	1182
费	1183
狮	1184
很不	1185
中心	1186
康	1187
员工	1188
姓	1189
检查	1190
汇	1191
又没	1192
炫	1193
巧	1194
也没	1195
物流	1196
期待	1197
温	1198
躺	1199
吧	1200
觉	1201
陪着	1202
数	1203
危害	1204
梅	1205
郭	1206
卫生	1207
最炫	1208
可惜	1209
就想	1210
失败	1211
喜不	1212
场	1213
专卖	1214
能让	1215
网游	1216
几次	1217
军训	1218
有雨	1219
牙	1220
商务	1221
商城	1222
郑	1223
永远	1224
书	1225
猪头	1226
几条	1227
任	1228
喝多	1229
主	1230
脱	1231
租	1232
作品	1233
领	1234
龙江	1235
对面	1236
招	1237
南站	1238
节课	1239
光明	1240
假期	1241
很多	1242
五日	1243
真正	1244
满	1245
想过	1246
让人	1247
决不	1248
相遇	1249
利亚	1250
到来	1251
添加	1252
专用	1253
说呢	1254
也就	1255
云	1256
丢	1257
指	1258
流氓	1259
并	1260
要跟	1261
初中	1262
要再	1263
女子	1264
气象	1265
要听	1266
启动	1267
送我	1268
脚	1269
校园	1270
章节	1271
骗子	1272
切都	1273
太多	1274
经过	1275
房产	1276
有在	1277
哦	1278
一条	1279
二七	1280
频道	1281
枝花	1282
决赛	1283
四五	1284
代表	1285
羊	1286
最新	1287
时尚	1288
勇士	1289
兔子	1290
养	1291
西站	1292
抢	1293
谁在	1294
洋洋	1295
作业	1296
生病	1297
客	1298
糟	1299
终极	1300
理	1301
生产	1302
做过	1303
轻	1304
六日	1305
爱人	1306
人民	1307
舍得	1308
状况	1309
新年	1310
克	1311
有无	1312
笨蛋	1313
离我	1314
避孕	1315
桌面	1316
去做	1317
祝福	1318
各位	1319
火线	1320
梦想	1321
清理	1322
双节	1323
收入	1324
入	1325
材料	1326
人体	1327
葡萄	1328
过节	1329
白痴	1330
漫游	1331
抽烟	1332
早饭	1333
优惠	1334
付款	1335
孕妇	1336
式	1337
亲亲	1338
也想	1339
第四	1340
色情	1341
动听	1342
六九	1343
二六	1344
结	1345
美元	1346
姑娘	1347
吉林	1348
绝对	1349
要对	1350
翅膀	1351
混	1352
扣扣	1353
我拿	1354
能干	1355
翻	1356
喂	1357
湖人	1358
副	1359
麦当劳	1360
耍	1361
九五	1362
周六	1363
门市	1364
地理	1365
介意	1366
丽	1367
总统	1368
租车	1369
交通	1370
不清	1371
特产	1372
承认	1373
俊杰	1374
做到	1375
曾	1376
单机	1377
团	1378
猪	1379
会吗	1380
能吃	1381
亚	1382
日记	1383
平顶	1384
成语	1385
人要	1386
谱	1387
吹	1388
姐姐	1389
叔叔	1390
邓	1391
业	1392
心中	1393
公安	1394
铁	1395
哈喽	1396
子书	1397
绵阳	1398
天可	1399
发来	1400
伤感	1401
嘻嘻	1402
项目	1403
日程	1404
说对	1405
身高	1406
屁	1407
有流	1408
同事	1409
驾驶	1410
额	1411
午夜	1412
俩	1413
古	1414
佳	1415
来着	1416
暖文	1417
父母	1418
不靠	1419
仙	1420
真实	1421
天来	1422
利	1423
有病	1424
秋	1425
宋词	1426
人也	1427
升	1428
脾气	1429
公主	1430
主演	1431
腾	1432
遵义	1433
跟他	1434
表示	1435
这样	1436
天然	1437
喽	1438
基金	1439
克力	1440
欠	1441
七七	1442
假如	1443
周五	1444
妹子	1445
假日	1446
纠结	1447
军事	1448
评价	1449
就在	1450
泡	1451
机能	1452
随	1453
足球	1454
着急	1455
输	1456
我怕	1457
事都	1458
桥	1459
五天	1460
想干	1461
要带	1462
机器	1463
泪	1464
情	1465
聚会	1466
喊我	1467
粤语	1468
丝	1469
羽绒	1470
求	1471
初	1472
店里	1473
顺便	1474
要脸	1475
政策	1476
准确	1477
中考	1478
十天	1479
闯	1480
几种	1481
书记	1482
没来	1483
病毒	1484
命	1485
一组	1486
金刚	1487
素	1488
柴油	1489
胸部	1490
果	1491
人员	1492
容易	1493
总理	1494
美图	1495
酱油	1496
面试	1497
许嵩	1498
言	1499
那不	1500
肯德	1501
珠海	1502
反	1503
会儿	1504
黑色	1505
辽宁	1506
格式	1507
敏感	1508
一定	1509
动力	1510
扬州	1511
真诚	1512
<UNK>	1513
#0	1514
<s>	1515
</s>	1516
<Version>	Kirin_Net_1.1_20180516