#,aft_version,
5,1,63
#,aft_filter_param,
1665, 10, 15, 2480, 2200, 32, 36, 41, 14065, 27, 8224, 15420, 0, 1092, 50026, 358, 17535, 0, 0, 0, 0, 0, 0, 0, 0, 0, 0, 0, 0, 0, 0, 0, 0, 0, 0, 0, 0, 0, 1147, 1308

