{
    "tag": "3DScene_lzy",
    "version": "1.2",
	"needblend": false,
    "requirement": {},
    "content": {
        "light": [
                  {
                  "type": "point",
                  "pos": [
                          -30,
                          -330,
                          -500
                          ],
                  "direction": [
                                0,
                                0,
                                -1
                                ],
                  "color": [
                            1,
                            1,
                            1,
                            1
                            ],
                  "intensity": 0.5,
                  "attenuation_range": 0.5,
                  "attenuation_range_inverse": 2.3,
                  "shadow_enabled": true,
                  "shadow_resolution": [
                                        0.7,
                                        1.8
                                        ],
                  "shadow_bias": 1.7,
                  "shadow_strength": 1.8,
                  "shadow_softness": 1.9,
                  "use_soft_shadow": false
                  },
                  {
                  "type": "dir",
                  "pos": [
                          20,
                          20,
                          20
                          ],
                  "direction": [
                                0,
                                1,
                                1
                                ],
                  "color": [
                            1,
                            1,
                            1,
                            1
                            ],
                  "intensity": 0,
                  "attenuation_range": 0.5,
                  "attenuation_range_inverse": 2.3,
                  "shadow_enabled": true,
                  "shadow_resolution": [
                                        0.7,
                                        1.8
                                        ],
                  "shadow_bias": 1.7,
                  "shadow_strength": 1.8,
                  "shadow_softness": 1.9,
                  "use_soft_shadow": false,
                  "shadow_cascade_level_scale": [
                                                 3.1,
                                                 3.2,
                                                 3.3,
                                                 3.4
                                                 ],
                  "shadow_cascade_count": 100
                  },
                  {
                  "type": "spot",
                  "pos": [
                          20,
                          20,
                          20
                          ],
                  "direction": [
                                0,
                                0,
                                1
                                ],
                  "color": [
                            1,
                            1,
                            1,
                            1
                            ],
                  "intensity": 0,
                  "attenuation_range": 0.5,
                  "attenuation_range_inverse": 2.3,
                  "shadow_enabled": true,
                  "shadow_resolution": [
                                        0.7,
                                        1.8
                                        ],
                  "shadow_bias": 1.7,
                  "shadow_strength": 1.8,
                  "shadow_softness": 1.9,
                  "use_soft_shadow": false,
                  "inner_angle": 5,
                  "outer_angle": 10
                  }
                  ],
        "models": [
                   {
                   "id": 1,
                   "name": "sky",
                   "type": 2,
                   "attachType": 1,
                   "modelPath": "E12_3D_Scene_01/Headwear_wuyun/model.fbx",
                   "material": "E12_3D_Scene_01/Headwear_wuyun/material.mtl",
                   "modelType": 1,
                   "animations": [
                                  {
                                  "name": "UV-test",
                                  "type": "uv",
                                  "triggerDelay": 0,
                                  "count": 1,
                                  "columnNum": 1,
                                  "rowNum": 1,
                                  "duration": 5000,
                                  "triggerLoop": true,
                                  "triggerStop": true,
                                  "triggerType": 0,
                                  "textureInfo": {
                                    "textureSamplerName": "diffuseMap",
                                    "texturePathFormat": "E12_3D_Scene_01/Headwear_wuyun/sky%d.png",
                                    "textureNum": 1
                                  }

                                  }
                                ]
                   },
                   {
                   "id": 2,
                   "name": "skypart1",
                   "type": 2,
                   "attachType": 1,
                   "modelPath": "E12_3D_Scene_01/skypart1/model.fbx",
                   "material": "E12_3D_Scene_01/skypart1/material.mtl",
                   "modelType": 1,
                   "animations": [
                                  {
                                  "name": "UV-test",
                                  "type": "uv",
                                  "triggerDelay": 0,
                                  "count": 36,
                                  "columnNum": 6,
                                  "rowNum": 6,
                                  "duration": 5000,
                                  "triggerLoop": true,
                                  "triggerStop": true,
                                  "triggerType": 0
                                  },
            {
				"triggerDelay": 0,
				"triggerLoop": false,
				"triggerStop": true,
				"name": "Take 001",
				"type": "bone",
				"triggerType": 0
			}
                                  ]
                   },
                   {
                   "id": 3,
                   "name": "skypart2",
                   "type": 2,
                   "attachType": 1,
                   "modelPath": "E12_3D_Scene_01/skypart2/model.fbx",
                   "material": "E12_3D_Scene_01/skypart2/material.mtl",
                   "modelType": 1,
                   "animations": [{
                                  "name": "UV-test",
                                  "type": "uv",
                                  "triggerDelay": 0,
                                  "count": 16,
                                  "columnNum": 4,
                                  "rowNum": 4,
                                  "duration": 3000,
                                  "triggerLoop": true,
                                  "triggerStop": true,
                                  "triggerType": 0
                                  },
            {
				"triggerDelay": 0,
				"triggerLoop": false,
				"triggerStop": true,
				"name": "Take 001",
				"type": "bone",
				"triggerType": 0
			}
                                  ]
                   },
                   {
                   "id": 4,
                   "name": "skypart3",
                   "type": 2,
                   "attachType": 1,
                   "modelPath": "E12_3D_Scene_01/skypart3/model.fbx",
                   "material": "E12_3D_Scene_01/skypart3/material.mtl",
                   "modelType": 1,
                   "animations": [
                                  {
                                  "name": "UV-test",
                                  "type": "uv",
                                  "triggerDelay": 0,
                                  "count": 16,
                                  "columnNum": 4,
                                  "rowNum": 4,
                                  "duration": 1000,
                                  "triggerLoop": true,
                                  "triggerStop": true,
                                  "triggerType": 0
                                  },
            {
				"triggerDelay": 0,
				"triggerLoop": false,
				"triggerStop": true,
				"name": "Take 001",
				"type": "bone",
				"triggerType": 0
			}
                   ]
                   },
                   {
                   "id": 4,
                   "name": "skypart4",
                   "type": 2,
                   "attachType": 1,
                   "modelPath": "E12_3D_Scene_01/skypart4/model.fbx",
                   "material": "E12_3D_Scene_01/skypart4/material.mtl",
                   "modelType": 1,
                   "animations": [
                                  {
                                  "name": "UV-test",
                                  "type": "uv",
                                  "triggerDelay": 0,
                                  "count": 20,
                                  "columnNum": 4,
                                  "rowNum": 5,
                                  "duration": 3000,
                                  "triggerLoop": true,
                                  "triggerStop": true,
                                  "triggerType": 0
                                  },
            {
				"triggerDelay": 0,
				"triggerLoop": false,
				"triggerStop": true,
				"name": "Take 001",
				"type": "bone",
				"triggerType": 0
			}
                   ]
                   }
                   ],
        "particles": [
                      
                      ]
    }
}
