{
	"centerX" : 0.5,
	"centerY" : 0.5,
	"angle" : 0,
	"scale" : 1,
	"width" : 140,
	"height" : 80,
	"contents" : [{
			"type" : "image",
			"resource" : {
				"type" : "static",
				"path" : "res/city_type_icon.png"
			},
			"centerX" : 0.714,
			"centerY" : 0.236,
			"width" : 60,
			"height" : 34,
			"zorder" : 1
		},
		{
            "type": "text",
            "centerX": 0.5,
            "centerY": 0.6,
            "width": 120,
            "height": 30,
            "color": "#ffffffff",
            "isVertical": 0,
			"alignment": 2,
			"editable":true,
            "text": "{LOCATION}",
            "zorder": 2
        },
		{
            "type": "text",
            "centerX": 0.5,
            "centerY": 0.88,
			"width": 120,
            "height": 12,
            "color": "#ffffffff",
            "isVertical": 0,
			"alignment": 2,
            "text": "{yyyy-MM-dd}",
            "zorder": 2
        }
	]
}
