#,version,,,,,,,,,,,,,,,,,,,,,,,,,,,,,,,,,,,,,,,,,,,,,,,,
2019,1,8,1,,,,,,,,,,,,,,,,,,,,,,,,,,,,,,,,,,,,,,,,,,,,,,
#,row_col_num,,,,,,,,,,,,,,,,,,,,,,,,,,,,,,,,,,,,,,,,,,,,,,,,
36,18,,,,,,,,,,,,,,,,,,,,,,,,,,,,,,,,,,,,,,,,,,,,,,,,
#,noise,,,,,,,,,,,,,,,,,,,,,,,,,,,,,,,,,,,,,,,,,,,,,,,,
-150,150,,,,,,,,,,,,,,,,,,,,,,,,,,,,,,,,,,,,,,,,,,,,,,,,
#,raw_max,,,,,,,,,,,,,,,,,,,,,,,,,,,,,,,,,,,,,,,,,,,,,,,,
0,7462,7244,7484,7487,7279,7282,7415,7345,7235,7243,7480,7391,7161,7333,7458,7448,7464,,,,,,,,,,,,,,,,,,,,,,,,,,,,,,,,,,
7574,7374,7364,7294,7423,7440,7306,7331,7280,7214,7236,7392,7595,7506,7359,7324,7361,7342,,,,,,,,,,,,,,,,,,,,,,,,,,,,,,,,,,
7416,7341,7329,7440,7491,7337,7375,7372,7372,7305,7390,7595,7534,7362,7342,7277,7459,7553,,,,,,,,,,,,,,,,,,,,,,,,,,,,,,,,,,
7216,7366,7266,7410,7466,7250,7368,7501,7531,7341,7323,7363,7409,7380,7335,7366,7348,7271,,,,,,,,,,,,,,,,,,,,,,,,,,,,,,,,,,
7318,7433,7327,7358,7267,7465,7482,7393,7475,7280,7301,7526,7463,7405,7424,7361,7289,7441,,,,,,,,,,,,,,,,,,,,,,,,,,,,,,,,,,
7323,7388,7205,7442,7318,7345,7414,7371,7411,7446,7442,7445,7467,7358,7471,7362,7188,7366,,,,,,,,,,,,,,,,,,,,,,,,,,,,,,,,,,
7366,7407,7306,7289,7493,7413,7271,7335,7285,7301,7319,7479,7371,7302,7400,7368,7290,7322,,,,,,,,,,,,,,,,,,,,,,,,,,,,,,,,,,
7383,7211,7322,7418,7346,7420,7390,7289,7320,7359,7363,7234,7259,7411,7276,7475,7307,7323,,,,,,,,,,,,,,,,,,,,,,,,,,,,,,,,,,
7316,7346,7415,7342,7374,7526,7416,7326,7366,7326,7303,7326,7380,7344,7520,7363,7199,7327,,,,,,,,,,,,,,,,,,,,,,,,,,,,,,,,,,
7487,7322,7268,7405,7392,7205,7535,7456,7494,7471,7431,7462,7340,7471,7332,7444,7392,7419,,,,,,,,,,,,,,,,,,,,,,,,,,,,,,,,,,
7478,7326,7284,7431,7485,7314,7400,7488,7487,7354,7280,7290,7370,7504,7348,7415,7453,7404,,,,,,,,,,,,,,,,,,,,,,,,,,,,,,,,,,
7376,7414,7311,7310,7424,7423,7494,7415,7380,7305,7422,7227,7353,7541,7427,7383,7210,7274,,,,,,,,,,,,,,,,,,,,,,,,,,,,,,,,,,
7453,7341,7327,7311,7354,7384,7414,7406,7411,7553,7632,7211,7155,7398,7297,7388,7312,7349,,,,,,,,,,,,,,,,,,,,,,,,,,,,,,,,,,
7342,7301,7315,7452,7493,7396,7248,7322,7301,7491,7496,7272,7437,7329,7379,7393,7456,7371,,,,,,,,,,,,,,,,,,,,,,,,,,,,,,,,,,
7305,7489,7359,7431,7456,7331,7215,7267,7310,7302,7249,7433,7513,7344,7524,7385,7263,7264,,,,,,,,,,,,,,,,,,,,,,,,,,,,,,,,,,
7289,7497,7413,7320,7361,7410,7220,7406,7390,7302,7337,7271,7320,7458,7246,7410,7367,7375,,,,,,,,,,,,,,,,,,,,,,,,,,,,,,,,,,
7418,7249,7475,7506,7305,7310,7402,7441,7470,7289,7298,7257,7364,7392,7253,7413,7390,7433,,,,,,,,,,,,,,,,,,,,,,,,,,,,,,,,,,
7523,7322,7332,7383,7342,7374,7363,7338,7345,7442,7453,7314,7233,7194,7388,7392,7537,7433,,,,,,,,,,,,,,,,,,,,,,,,,,,,,,,,,,
7426,7293,7413,7442,7484,7354,7267,7257,7249,7478,7488,7462,7518,7241,7476,7419,7367,7320,,,,,,,,,,,,,,,,,,,,,,,,,,,,,,,,,,
7286,7233,7470,7424,7487,7397,7371,7267,7397,7323,7312,7267,7372,7318,7350,7423,7393,7398,,,,,,,,,,,,,,,,,,,,,,,,,,,,,,,,,,
7420,7415,7305,7448,7379,7449,7323,7414,7376,7193,7211,7206,7409,7413,7413,7337,7335,7309,,,,,,,,,,,,,,,,,,,,,,,,,,,,,,,,,,
7387,7546,7333,7283,7419,7372,7267,7237,7257,7396,7335,7329,7456,7439,7380,7185,7445,7480,,,,,,,,,,,,,,,,,,,,,,,,,,,,,,,,,,
7380,7298,7541,7604,7366,7297,7376,7397,7272,7264,7175,7268,7329,7470,7372,7389,7414,7329,,,,,,,,,,,,,,,,,,,,,,,,,,,,,,,,,,
7286,7285,7509,7478,7353,7354,7466,7428,7374,7441,7310,7371,7404,7279,7303,7298,7450,7290,,,,,,,,,,,,,,,,,,,,,,,,,,,,,,,,,,
7294,7389,7271,7337,7494,7318,7262,7322,7332,7392,7266,7407,7519,7353,7452,7331,7414,7350,,,,,,,,,,,,,,,,,,,,,,,,,,,,,,,,,,
7439,7423,7303,7422,7444,7298,7344,7374,7255,7328,7367,7358,7379,7448,7362,7251,7466,7428,,,,,,,,,,,,,,,,,,,,,,,,,,,,,,,,,,
7332,7452,7311,7349,7445,7449,7320,7358,7479,7389,7336,7416,7327,7182,7244,7322,7448,7352,,,,,,,,,,,,,,,,,,,,,,,,,,,,,,,,,,
7346,7463,7281,7342,7474,7380,7381,7323,7346,7344,7478,7489,7245,7144,7466,7430,7424,7253,,,,,,,,,,,,,,,,,,,,,,,,,,,,,,,,,,
7509,7345,7345,7326,7467,7311,7358,7413,7314,7357,7456,7302,7378,7342,7584,7462,7419,7407,,,,,,,,,,,,,,,,,,,,,,,,,,,,,,,,,,
7400,7378,7318,7244,7335,7310,7279,7448,7349,7303,7371,7361,7338,7342,7327,7329,7410,7441,,,,,,,,,,,,,,,,,,,,,,,,,,,,,,,,,,
7441,7309,7329,7327,7318,7372,7380,7370,7361,7392,7474,7335,7249,7275,7281,7292,7549,7380,,,,,,,,,,,,,,,,,,,,,,,,,,,,,,,,,,
7450,7340,7372,7318,7292,7483,7359,7303,7410,7332,7422,7372,7376,7418,7276,7341,7326,7397,,,,,,,,,,,,,,,,,,,,,,,,,,,,,,,,,,
7332,7381,7376,7415,7462,7318,7289,7346,7462,7378,7301,7354,7436,7328,7493,7427,7319,7384,,,,,,,,,,,,,,,,,,,,,,,,,,,,,,,,,,
7314,7375,7406,7372,7427,7332,7275,7545,7254,7480,7442,7431,7370,7297,7272,7201,7530,7341,,,,,,,,,,,,,,,,,,,,,,,,,,,,,,,,,,
7435,7319,7341,7435,7300,7251,7461,7575,7219,7472,7472,7601,7290,7268,7406,7511,7378,7307,,,,,,,,,,,,,,,,,,,,,,,,,,,,,,,,,,
7323,7406,7474,7431,7639,7362,7248,7212,7190,7420,7322,7248,7340,7540,7274,7397,71500,7323,,,,,,,,,,,,,,,,,,,,,,,,,,,,,,,,,,
#,raw_min,,,,,,,,,,,,,,,,,,,,,,,,,,,,,,,,,,,,,,,,,,,,,,,,
0,4018,3901,4030,4032,3919,3921,3992,3955,3896,3900,4028,3980,3856,3949,4016,4011,4019,,,,,,,,,,,,,,,,,,,,,,,,,,,,,,,,,,
4078,3970,3965,3928,3997,4006,3934,3947,3920,3884,3896,3980,4089,4042,3963,3944,3963,3954,,,,,,,,,,,,,,,,,,,,,,,,,,,,,,,,,,
3993,3953,3947,4006,4033,3951,3971,3970,3970,3933,3979,4089,4056,3964,3954,3919,4017,4067,,,,,,,,,,,,,,,,,,,,,,,,,,,,,,,,,,
3886,3966,3912,3990,4020,3904,3968,4039,4055,3953,3943,3965,3989,3974,3949,3966,3956,3915,,,,,,,,,,,,,,,,,,,,,,,,,,,,,,,,,,
3940,4003,3945,3962,3913,4019,4028,3981,4025,3920,3931,4052,4019,3987,3998,3963,3925,4007,,,,,,,,,,,,,,,,,,,,,,,,,,,,,,,,,,
3943,3978,3879,4007,3940,3955,3992,3969,3991,4010,4007,4009,4021,3962,4023,3964,3870,3966,,,,,,,,,,,,,,,,,,,,,,,,,,,,,,,,,,
3966,3989,3934,3925,4035,3991,3915,3949,3923,3931,3941,4027,3969,3932,3984,3968,3926,3942,,,,,,,,,,,,,,,,,,,,,,,,,,,,,,,,,,
3975,3883,3942,3994,3956,3996,3979,3925,3942,3963,3965,3895,3909,3991,3918,4025,3935,3943,,,,,,,,,,,,,,,,,,,,,,,,,,,,,,,,,,
3940,3956,3993,3954,3970,4052,3993,3944,3966,3944,3933,3944,3974,3954,4049,3965,3877,3945,,,,,,,,,,,,,,,,,,,,,,,,,,,,,,,,,,
4031,3942,3914,3987,3980,3879,4057,4014,4035,4023,4001,4018,3952,4023,3948,4008,3980,3995,,,,,,,,,,,,,,,,,,,,,,,,,,,,,,,,,,
4026,3944,3922,4001,4031,3938,3984,4032,4031,3960,3920,3926,3968,4040,3956,3993,4013,3986,,,,,,,,,,,,,,,,,,,,,,,,,,,,,,,,,,
3972,3992,3937,3936,3998,3997,4035,3993,3974,3933,3996,3891,3959,4061,3999,3975,3882,3916,,,,,,,,,,,,,,,,,,,,,,,,,,,,,,,,,,
4013,3953,3945,3937,3960,3976,3992,3988,3991,4067,4110,3883,3853,3984,3929,3978,3937,3957,,,,,,,,,,,,,,,,,,,,,,,,,,,,,,,,,,
3954,3931,3939,4012,4035,3982,3902,3942,3931,4033,4036,3916,4005,3947,3973,3981,4014,3969,,,,,,,,,,,,,,,,,,,,,,,,,,,,,,,,,,
3933,4033,3963,4001,4014,3947,3885,3913,3936,3932,3903,4003,4045,3954,4052,3977,3911,3912,,,,,,,,,,,,,,,,,,,,,,,,,,,,,,,,,,
3925,4037,3991,3942,3963,3990,3888,3988,3979,3932,3951,3915,3942,4016,3902,3990,3967,3971,,,,,,,,,,,,,,,,,,,,,,,,,,,,,,,,,,
3994,3903,4025,4042,3933,3936,3986,4007,4022,3925,3930,3907,3965,3980,3905,3991,3979,4003,,,,,,,,,,,,,,,,,,,,,,,,,,,,,,,,,,
4051,3942,3948,3975,3954,3970,3965,3951,3955,4007,4013,3938,3895,3874,3978,3980,4059,4003,,,,,,,,,,,,,,,,,,,,,,,,,,,,,,,,,,
3998,3927,3991,4007,4030,3960,3913,3907,3903,4026,4032,4018,4048,3899,4026,3995,3967,3942,,,,,,,,,,,,,,,,,,,,,,,,,,,,,,,,,,
3923,3895,4022,3998,4031,3983,3969,3913,3983,3943,3937,3913,3970,3940,3958,3997,3981,3984,,,,,,,,,,,,,,,,,,,,,,,,,,,,,,,,,,
3996,3993,3933,4010,3973,4011,3943,3992,3972,3873,3883,3880,3989,3991,3991,3951,3949,3935,,,,,,,,,,,,,,,,,,,,,,,,,,,,,,,,,,
3977,4063,3949,3921,3995,3970,3913,3897,3907,3982,3949,3947,4014,4005,3974,3869,4009,4028,,,,,,,,,,,,,,,,,,,,,,,,,,,,,,,,,,
3974,3930,4061,4094,3966,3929,3972,3983,3916,3912,3863,3914,3947,4022,3970,3979,3992,3947,,,,,,,,,,,,,,,,,,,,,,,,,,,,,,,,,,
3923,3923,4043,4026,3959,3960,4020,4000,3970,4007,3936,3969,3986,3919,3933,3930,4012,3926,,,,,,,,,,,,,,,,,,,,,,,,,,,,,,,,,,
3928,3979,3915,3951,4035,3940,3910,3942,3948,3980,3912,3989,4049,3959,4012,3947,3992,3958,,,,,,,,,,,,,,,,,,,,,,,,,,,,,,,,,,
4005,3997,3933,3996,4008,3930,3954,3970,3907,3946,3967,3962,3973,4010,3964,3905,4020,4000,,,,,,,,,,,,,,,,,,,,,,,,,,,,,,,,,,
3948,4012,3937,3957,4009,4011,3942,3962,4027,3979,3950,3993,3945,3867,3900,3942,4010,3958,,,,,,,,,,,,,,,,,,,,,,,,,,,,,,,,,,
3956,4019,3921,3954,4024,3974,3975,3943,3956,3954,4026,4033,3901,3846,4020,4000,3998,3905,,,,,,,,,,,,,,,,,,,,,,,,,,,,,,,,,,
4043,3955,3955,3944,4021,3937,3962,3991,3938,3961,4014,3932,3972,3954,4084,4018,3995,3989,,,,,,,,,,,,,,,,,,,,,,,,,,,,,,,,,,
3984,3972,3940,3900,3949,3936,3919,4010,3957,3933,3969,3963,3951,3954,3945,3947,3990,4007,,,,,,,,,,,,,,,,,,,,,,,,,,,,,,,,,,
4007,3935,3947,3945,3940,3970,3974,3968,3963,3980,4024,3949,3903,3917,3921,3926,4065,3974,,,,,,,,,,,,,,,,,,,,,,,,,,,,,,,,,,
4012,3952,3970,3940,3926,4029,3963,3933,3990,3948,3996,3970,3972,3994,3918,3953,3944,3983,,,,,,,,,,,,,,,,,,,,,,,,,,,,,,,,,,
3948,3975,3972,3993,4018,3940,3925,3956,4018,3972,3931,3960,4004,3946,4035,3999,3941,3976,,,,,,,,,,,,,,,,,,,,,,,,,,,,,,,,,,
3938,3971,3988,3970,3999,3948,3917,4063,3906,4028,4007,4001,3968,3929,3916,3877,4054,3953,,,,,,,,,,,,,,,,,,,,,,,,,,,,,,,,,,
4003,3941,3953,4003,3930,3905,4017,4079,3887,4024,4024,4093,3926,3914,3988,4045,3972,3935,,,,,,,,,,,,,,,,,,,,,,,,,,,,,,,,,,
3943,3988,4024,4001,4113,3964,3902,3884,3872,3996,3942,3902,3952,4060,3916,3983,4038,3943,,,,,,,,,,,,,,,,,,,,,,,,,,,,,,,,,,
#,raw_row_delta_max,,,,,,,,,,,,,,,,,,,,,,,,,,,,,,,,,,,,,,,,,,,,,,,,
99999,1500,1500,1500,1500,1500,1500,1500,1500,1500,1500,1500,1500,1500,1500,1500,1500,1500,,,,,,,,,,,,,,,,,,,,,,,,,,,,,,,,,,
1500,1500,1500,1500,1500,1500,1500,1500,1500,1500,1500,1500,1500,1500,1500,1500,1500,1500,,,,,,,,,,,,,,,,,,,,,,,,,,,,,,,,,,
1500,1500,1500,1500,1500,1500,1500,1500,1500,1500,1500,1500,1500,1500,1500,1500,1500,1500,,,,,,,,,,,,,,,,,,,,,,,,,,,,,,,,,,
1500,1500,1500,1500,1500,1500,1500,1500,1500,1500,1500,1500,1500,1500,1500,1500,1500,1500,,,,,,,,,,,,,,,,,,,,,,,,,,,,,,,,,,
1500,1500,1500,1500,1500,1500,1500,1500,1500,1500,1500,1500,1500,1500,1500,1500,1500,1500,,,,,,,,,,,,,,,,,,,,,,,,,,,,,,,,,,
1500,1500,1500,1500,1500,1500,1500,1500,1500,1500,1500,1500,1500,1500,1500,1500,1500,1500,,,,,,,,,,,,,,,,,,,,,,,,,,,,,,,,,,
1500,1500,1500,1500,1500,1500,1500,1500,1500,1500,1500,1500,1500,1500,1500,1500,1500,1500,,,,,,,,,,,,,,,,,,,,,,,,,,,,,,,,,,
1500,1500,1500,1500,1500,1500,1500,1500,1500,1500,1500,1500,1500,1500,1500,1500,1500,1500,,,,,,,,,,,,,,,,,,,,,,,,,,,,,,,,,,
1500,1500,1500,1500,1500,1500,1500,1500,1500,1500,1500,1500,1500,1500,1500,1500,1500,1500,,,,,,,,,,,,,,,,,,,,,,,,,,,,,,,,,,
1500,1500,1500,1500,1500,1500,1500,1500,1500,1500,1500,1500,1500,1500,1500,1500,1500,1500,,,,,,,,,,,,,,,,,,,,,,,,,,,,,,,,,,
1500,1500,1500,1500,1500,1500,1500,1500,1500,1500,1500,1500,1500,1500,1500,1500,1500,1500,,,,,,,,,,,,,,,,,,,,,,,,,,,,,,,,,,
1500,1500,1500,1500,1500,1500,1500,1500,1500,1500,1500,1500,1500,1500,1500,1500,1500,1500,,,,,,,,,,,,,,,,,,,,,,,,,,,,,,,,,,
1500,1500,1500,1500,1500,1500,1500,1500,1500,1500,1500,1500,1500,1500,1500,1500,1500,1500,,,,,,,,,,,,,,,,,,,,,,,,,,,,,,,,,,
1500,1500,1500,1500,1500,1500,1500,1500,1500,1500,1500,1500,1500,1500,1500,1500,1500,1500,,,,,,,,,,,,,,,,,,,,,,,,,,,,,,,,,,
1500,1500,1500,1500,1500,1500,1500,1500,1500,1500,1500,1500,1500,1500,1500,1500,1500,1500,,,,,,,,,,,,,,,,,,,,,,,,,,,,,,,,,,
1500,1500,1500,1500,1500,1500,1500,1500,1500,1500,1500,1500,1500,1500,1500,1500,1500,1500,,,,,,,,,,,,,,,,,,,,,,,,,,,,,,,,,,
1500,1500,1500,1500,1500,1500,1500,1500,1500,1500,1500,1500,1500,1500,1500,1500,1500,1500,,,,,,,,,,,,,,,,,,,,,,,,,,,,,,,,,,
1500,1500,1500,1500,1500,1500,1500,1500,1500,1500,1500,1500,1500,1500,1500,1500,1500,1500,,,,,,,,,,,,,,,,,,,,,,,,,,,,,,,,,,
1500,1500,1500,1500,1500,1500,1500,1500,1500,1500,1500,1500,1500,1500,1500,1500,1500,1500,,,,,,,,,,,,,,,,,,,,,,,,,,,,,,,,,,
1500,1500,1500,1500,1500,1500,1500,1500,1500,1500,1500,1500,1500,1500,1500,1500,1500,1500,,,,,,,,,,,,,,,,,,,,,,,,,,,,,,,,,,
1500,1500,1500,1500,1500,1500,1500,1500,1500,1500,1500,1500,1500,1500,1500,1500,1500,1500,,,,,,,,,,,,,,,,,,,,,,,,,,,,,,,,,,
1500,1500,1500,1500,1500,1500,1500,1500,1500,1500,1500,1500,1500,1500,1500,1500,1500,1500,,,,,,,,,,,,,,,,,,,,,,,,,,,,,,,,,,
1500,1500,1500,1500,1500,1500,1500,1500,1500,1500,1500,1500,1500,1500,1500,1500,1500,1500,,,,,,,,,,,,,,,,,,,,,,,,,,,,,,,,,,
1500,1500,1500,1500,1500,1500,1500,1500,1500,1500,1500,1500,1500,1500,1500,1500,1500,1500,,,,,,,,,,,,,,,,,,,,,,,,,,,,,,,,,,
1500,1500,1500,1500,1500,1500,1500,1500,1500,1500,1500,1500,1500,1500,1500,1500,1500,1500,,,,,,,,,,,,,,,,,,,,,,,,,,,,,,,,,,
1500,1500,1500,1500,1500,1500,1500,1500,1500,1500,1500,1500,1500,1500,1500,1500,1500,1500,,,,,,,,,,,,,,,,,,,,,,,,,,,,,,,,,,
1500,1500,1500,1500,1500,1500,1500,1500,1500,1500,1500,1500,1500,1500,1500,1500,1500,1500,,,,,,,,,,,,,,,,,,,,,,,,,,,,,,,,,,
1500,1500,1500,1500,1500,1500,1500,1500,1500,1500,1500,1500,1500,1500,1500,1500,1500,1500,,,,,,,,,,,,,,,,,,,,,,,,,,,,,,,,,,
1500,1500,1500,1500,1500,1500,1500,1500,1500,1500,1500,1500,1500,1500,1500,1500,1500,1500,,,,,,,,,,,,,,,,,,,,,,,,,,,,,,,,,,
1500,1500,1500,1500,1500,1500,1500,1500,1500,1500,1500,1500,1500,1500,1500,1500,1500,1500,,,,,,,,,,,,,,,,,,,,,,,,,,,,,,,,,,
1500,1500,1500,1500,1500,1500,1500,1500,1500,1500,1500,1500,1500,1500,1500,1500,1500,1500,,,,,,,,,,,,,,,,,,,,,,,,,,,,,,,,,,
1500,1500,1500,1500,1500,1500,1500,1500,1500,1500,1500,1500,1500,1500,1500,1500,1500,1500,,,,,,,,,,,,,,,,,,,,,,,,,,,,,,,,,,
1500,1500,1500,1500,1500,1500,1500,1500,1500,1500,1500,1500,1500,1500,1500,1500,1500,1500,,,,,,,,,,,,,,,,,,,,,,,,,,,,,,,,,,
1500,1500,1500,1500,1500,1500,1500,1500,1500,1500,1500,1500,1500,1500,1500,1500,1500,1500,,,,,,,,,,,,,,,,,,,,,,,,,,,,,,,,,,
1500,1500,1500,1500,1500,1500,1500,1500,1500,1500,1500,1500,1500,1500,1500,1500,1500,1500,,,,,,,,,,,,,,,,,,,,,,,,,,,,,,,,,,
#,raw_row_delta_min,,,,,,,,,,,,,,,,,,,,,,,,,,,,,,,,,,,,,,,,,,,,,,,,
-99999,-1500,-1500,-1500,-1500,-1500,-1500,-1500,-1500,-1500,-1500,-1500,-1500,-1500,-1500,-1500,-1500,-1500,,,,,,,,,,,,,,,,,,,,,,,,,,,,,,,,,,
-1500,-1500,-1500,-1500,-1500,-1500,-1500,-1500,-1500,-1500,-1500,-1500,-1500,-1500,-1500,-1500,-1500,-1500,,,,,,,,,,,,,,,,,,,,,,,,,,,,,,,,,,
-1500,-1500,-1500,-1500,-1500,-1500,-1500,-1500,-1500,-1500,-1500,-1500,-1500,-1500,-1500,-1500,-1500,-1500,,,,,,,,,,,,,,,,,,,,,,,,,,,,,,,,,,
-1500,-1500,-1500,-1500,-1500,-1500,-1500,-1500,-1500,-1500,-1500,-1500,-1500,-1500,-1500,-1500,-1500,-1500,,,,,,,,,,,,,,,,,,,,,,,,,,,,,,,,,,
-1500,-1500,-1500,-1500,-1500,-1500,-1500,-1500,-1500,-1500,-1500,-1500,-1500,-1500,-1500,-1500,-1500,-1500,,,,,,,,,,,,,,,,,,,,,,,,,,,,,,,,,,
-1500,-1500,-1500,-1500,-1500,-1500,-1500,-1500,-1500,-1500,-1500,-1500,-1500,-1500,-1500,-1500,-1500,-1500,,,,,,,,,,,,,,,,,,,,,,,,,,,,,,,,,,
-1500,-1500,-1500,-1500,-1500,-1500,-1500,-1500,-1500,-1500,-1500,-1500,-1500,-1500,-1500,-1500,-1500,-1500,,,,,,,,,,,,,,,,,,,,,,,,,,,,,,,,,,
-1500,-1500,-1500,-1500,-1500,-1500,-1500,-1500,-1500,-1500,-1500,-1500,-1500,-1500,-1500,-1500,-1500,-1500,,,,,,,,,,,,,,,,,,,,,,,,,,,,,,,,,,
-1500,-1500,-1500,-1500,-1500,-1500,-1500,-1500,-1500,-1500,-1500,-1500,-1500,-1500,-1500,-1500,-1500,-1500,,,,,,,,,,,,,,,,,,,,,,,,,,,,,,,,,,
-1500,-1500,-1500,-1500,-1500,-1500,-1500,-1500,-1500,-1500,-1500,-1500,-1500,-1500,-1500,-1500,-1500,-1500,,,,,,,,,,,,,,,,,,,,,,,,,,,,,,,,,,
-1500,-1500,-1500,-1500,-1500,-1500,-1500,-1500,-1500,-1500,-1500,-1500,-1500,-1500,-1500,-1500,-1500,-1500,,,,,,,,,,,,,,,,,,,,,,,,,,,,,,,,,,
-1500,-1500,-1500,-1500,-1500,-1500,-1500,-1500,-1500,-1500,-1500,-1500,-1500,-1500,-1500,-1500,-1500,-1500,,,,,,,,,,,,,,,,,,,,,,,,,,,,,,,,,,
-1500,-1500,-1500,-1500,-1500,-1500,-1500,-1500,-1500,-1500,-1500,-1500,-1500,-1500,-1500,-1500,-1500,-1500,,,,,,,,,,,,,,,,,,,,,,,,,,,,,,,,,,
-1500,-1500,-1500,-1500,-1500,-1500,-1500,-1500,-1500,-1500,-1500,-1500,-1500,-1500,-1500,-1500,-1500,-1500,,,,,,,,,,,,,,,,,,,,,,,,,,,,,,,,,,
-1500,-1500,-1500,-1500,-1500,-1500,-1500,-1500,-1500,-1500,-1500,-1500,-1500,-1500,-1500,-1500,-1500,-1500,,,,,,,,,,,,,,,,,,,,,,,,,,,,,,,,,,
-1500,-1500,-1500,-1500,-1500,-1500,-1500,-1500,-1500,-1500,-1500,-1500,-1500,-1500,-1500,-1500,-1500,-1500,,,,,,,,,,,,,,,,,,,,,,,,,,,,,,,,,,
-1500,-1500,-1500,-1500,-1500,-1500,-1500,-1500,-1500,-1500,-1500,-1500,-1500,-1500,-1500,-1500,-1500,-1500,,,,,,,,,,,,,,,,,,,,,,,,,,,,,,,,,,
-1500,-1500,-1500,-1500,-1500,-1500,-1500,-1500,-1500,-1500,-1500,-1500,-1500,-1500,-1500,-1500,-1500,-1500,,,,,,,,,,,,,,,,,,,,,,,,,,,,,,,,,,
-1500,-1500,-1500,-1500,-1500,-1500,-1500,-1500,-1500,-1500,-1500,-1500,-1500,-1500,-1500,-1500,-1500,-1500,,,,,,,,,,,,,,,,,,,,,,,,,,,,,,,,,,
-1500,-1500,-1500,-1500,-1500,-1500,-1500,-1500,-1500,-1500,-1500,-1500,-1500,-1500,-1500,-1500,-1500,-1500,,,,,,,,,,,,,,,,,,,,,,,,,,,,,,,,,,
-1500,-1500,-1500,-1500,-1500,-1500,-1500,-1500,-1500,-1500,-1500,-1500,-1500,-1500,-1500,-1500,-1500,-1500,,,,,,,,,,,,,,,,,,,,,,,,,,,,,,,,,,
-1500,-1500,-1500,-1500,-1500,-1500,-1500,-1500,-1500,-1500,-1500,-1500,-1500,-1500,-1500,-1500,-1500,-1500,,,,,,,,,,,,,,,,,,,,,,,,,,,,,,,,,,
-1500,-1500,-1500,-1500,-1500,-1500,-1500,-1500,-1500,-1500,-1500,-1500,-1500,-1500,-1500,-1500,-1500,-1500,,,,,,,,,,,,,,,,,,,,,,,,,,,,,,,,,,
-1500,-1500,-1500,-1500,-1500,-1500,-1500,-1500,-1500,-1500,-1500,-1500,-1500,-1500,-1500,-1500,-1500,-1500,,,,,,,,,,,,,,,,,,,,,,,,,,,,,,,,,,
-1500,-1500,-1500,-1500,-1500,-1500,-1500,-1500,-1500,-1500,-1500,-1500,-1500,-1500,-1500,-1500,-1500,-1500,,,,,,,,,,,,,,,,,,,,,,,,,,,,,,,,,,
-1500,-1500,-1500,-1500,-1500,-1500,-1500,-1500,-1500,-1500,-1500,-1500,-1500,-1500,-1500,-1500,-1500,-1500,,,,,,,,,,,,,,,,,,,,,,,,,,,,,,,,,,
-1500,-1500,-1500,-1500,-1500,-1500,-1500,-1500,-1500,-1500,-1500,-1500,-1500,-1500,-1500,-1500,-1500,-1500,,,,,,,,,,,,,,,,,,,,,,,,,,,,,,,,,,
-1500,-1500,-1500,-1500,-1500,-1500,-1500,-1500,-1500,-1500,-1500,-1500,-1500,-1500,-1500,-1500,-1500,-1500,,,,,,,,,,,,,,,,,,,,,,,,,,,,,,,,,,
-1500,-1500,-1500,-1500,-1500,-1500,-1500,-1500,-1500,-1500,-1500,-1500,-1500,-1500,-1500,-1500,-1500,-1500,,,,,,,,,,,,,,,,,,,,,,,,,,,,,,,,,,
-1500,-1500,-1500,-1500,-1500,-1500,-1500,-1500,-1500,-1500,-1500,-1500,-1500,-1500,-1500,-1500,-1500,-1500,,,,,,,,,,,,,,,,,,,,,,,,,,,,,,,,,,
-1500,-1500,-1500,-1500,-1500,-1500,-1500,-1500,-1500,-1500,-1500,-1500,-1500,-1500,-1500,-1500,-1500,-1500,,,,,,,,,,,,,,,,,,,,,,,,,,,,,,,,,,
-1500,-1500,-1500,-1500,-1500,-1500,-1500,-1500,-1500,-1500,-1500,-1500,-1500,-1500,-1500,-1500,-1500,-1500,,,,,,,,,,,,,,,,,,,,,,,,,,,,,,,,,,
-1500,-1500,-1500,-1500,-1500,-1500,-1500,-1500,-1500,-1500,-1500,-1500,-1500,-1500,-1500,-1500,-1500,-1500,,,,,,,,,,,,,,,,,,,,,,,,,,,,,,,,,,
-1500,-1500,-1500,-1500,-1500,-1500,-1500,-1500,-1500,-1500,-1500,-1500,-1500,-1500,-1500,-1500,-1500,-1500,,,,,,,,,,,,,,,,,,,,,,,,,,,,,,,,,,
-1500,-1500,-1500,-1500,-1500,-1500,-1500,-1500,-1500,-1500,-1500,-1500,-1500,-1500,-1500,-1500,-1500,-1500,,,,,,,,,,,,,,,,,,,,,,,,,,,,,,,,,,
#,raw_col_delta_max,,,,,,,,,,,,,,,,,,,,,,,,,,,,,,,,,,,,,,,,,,,,,,,,
99999,1500,1500,1500,1500,1500,1500,1500,1500,1500,1500,1500,1500,1500,1500,1500,1500,,,,,,,,,,,,,,,,,,,,,,,,,,,,,,,,,,
1500,1500,1500,1500,1500,1500,1500,1500,1500,1500,1500,1500,1500,1500,1500,1500,1500,,,,,,,,,,,,,,,,,,,,,,,,,,,,,,,,,,
1500,1500,1500,1500,1500,1500,1500,1500,1500,1500,1500,1500,1500,1500,1500,1500,1500,,,,,,,,,,,,,,,,,,,,,,,,,,,,,,,,,,
1500,1500,1500,1500,1500,1500,1500,1500,1500,1500,1500,1500,1500,1500,1500,1500,1500,,,,,,,,,,,,,,,,,,,,,,,,,,,,,,,,,,
1500,1500,1500,1500,1500,1500,1500,1500,1500,1500,1500,1500,1500,1500,1500,1500,1500,,,,,,,,,,,,,,,,,,,,,,,,,,,,,,,,,,
1500,1500,1500,1500,1500,1500,1500,1500,1500,1500,1500,1500,1500,1500,1500,1500,1500,,,,,,,,,,,,,,,,,,,,,,,,,,,,,,,,,,
1500,1500,1500,1500,1500,1500,1500,1500,1500,1500,1500,1500,1500,1500,1500,1500,1500,,,,,,,,,,,,,,,,,,,,,,,,,,,,,,,,,,
1500,1500,1500,1500,1500,1500,1500,1500,1500,1500,1500,1500,1500,1500,1500,1500,1500,,,,,,,,,,,,,,,,,,,,,,,,,,,,,,,,,,
1500,1500,1500,1500,1500,1500,1500,1500,1500,1500,1500,1500,1500,1500,1500,1500,1500,,,,,,,,,,,,,,,,,,,,,,,,,,,,,,,,,,
1500,1500,1500,1500,1500,1500,1500,1500,1500,1500,1500,1500,1500,1500,1500,1500,1500,,,,,,,,,,,,,,,,,,,,,,,,,,,,,,,,,,
1500,1500,1500,1500,1500,1500,1500,1500,1500,1500,1500,1500,1500,1500,1500,1500,1500,,,,,,,,,,,,,,,,,,,,,,,,,,,,,,,,,,
1500,1500,1500,1500,1500,1500,1500,1500,1500,1500,1500,1500,1500,1500,1500,1500,1500,,,,,,,,,,,,,,,,,,,,,,,,,,,,,,,,,,
1500,1500,1500,1500,1500,1500,1500,1500,1500,1500,1500,1500,1500,1500,1500,1500,1500,,,,,,,,,,,,,,,,,,,,,,,,,,,,,,,,,,
1500,1500,1500,1500,1500,1500,1500,1500,1500,1500,1500,1500,1500,1500,1500,1500,1500,,,,,,,,,,,,,,,,,,,,,,,,,,,,,,,,,,
1500,1500,1500,1500,1500,1500,1500,1500,1500,1500,1500,1500,1500,1500,1500,1500,1500,,,,,,,,,,,,,,,,,,,,,,,,,,,,,,,,,,
1500,1500,1500,1500,1500,1500,1500,1500,1500,1500,1500,1500,1500,1500,1500,1500,1500,,,,,,,,,,,,,,,,,,,,,,,,,,,,,,,,,,
1500,1500,1500,1500,1500,1500,1500,1500,1500,1500,1500,1500,1500,1500,1500,1500,1500,,,,,,,,,,,,,,,,,,,,,,,,,,,,,,,,,,
1500,1500,1500,1500,1500,1500,1500,1500,1500,1500,1500,1500,1500,1500,1500,1500,1500,,,,,,,,,,,,,,,,,,,,,,,,,,,,,,,,,,
1500,1500,1500,1500,1500,1500,1500,1500,1500,1500,1500,1500,1500,1500,1500,1500,1500,,,,,,,,,,,,,,,,,,,,,,,,,,,,,,,,,,
1500,1500,1500,1500,1500,1500,1500,1500,1500,1500,1500,1500,1500,1500,1500,1500,1500,,,,,,,,,,,,,,,,,,,,,,,,,,,,,,,,,,
1500,1500,1500,1500,1500,1500,1500,1500,1500,1500,1500,1500,1500,1500,1500,1500,1500,,,,,,,,,,,,,,,,,,,,,,,,,,,,,,,,,,
1500,1500,1500,1500,1500,1500,1500,1500,1500,1500,1500,1500,1500,1500,1500,1500,1500,,,,,,,,,,,,,,,,,,,,,,,,,,,,,,,,,,
1500,1500,1500,1500,1500,1500,1500,1500,1500,1500,1500,1500,1500,1500,1500,1500,1500,,,,,,,,,,,,,,,,,,,,,,,,,,,,,,,,,,
1500,1500,1500,1500,1500,1500,1500,1500,1500,1500,1500,1500,1500,1500,1500,1500,1500,,,,,,,,,,,,,,,,,,,,,,,,,,,,,,,,,,
1500,1500,1500,1500,1500,1500,1500,1500,1500,1500,1500,1500,1500,1500,1500,1500,1500,,,,,,,,,,,,,,,,,,,,,,,,,,,,,,,,,,
1500,1500,1500,1500,1500,1500,1500,1500,1500,1500,1500,1500,1500,1500,1500,1500,1500,,,,,,,,,,,,,,,,,,,,,,,,,,,,,,,,,,
1500,1500,1500,1500,1500,1500,1500,1500,1500,1500,1500,1500,1500,1500,1500,1500,1500,,,,,,,,,,,,,,,,,,,,,,,,,,,,,,,,,,
1500,1500,1500,1500,1500,1500,1500,1500,1500,1500,1500,1500,1500,1500,1500,1500,1500,,,,,,,,,,,,,,,,,,,,,,,,,,,,,,,,,,
1500,1500,1500,1500,1500,1500,1500,1500,1500,1500,1500,1500,1500,1500,1500,1500,1500,,,,,,,,,,,,,,,,,,,,,,,,,,,,,,,,,,
1500,1500,1500,1500,1500,1500,1500,1500,1500,1500,1500,1500,1500,1500,1500,1500,1500,,,,,,,,,,,,,,,,,,,,,,,,,,,,,,,,,,
1500,1500,1500,1500,1500,1500,1500,1500,1500,1500,1500,1500,1500,1500,1500,1500,1500,,,,,,,,,,,,,,,,,,,,,,,,,,,,,,,,,,
1500,1500,1500,1500,1500,1500,1500,1500,1500,1500,1500,1500,1500,1500,1500,1500,1500,,,,,,,,,,,,,,,,,,,,,,,,,,,,,,,,,,
1500,1500,1500,1500,1500,1500,1500,1500,1500,1500,1500,1500,1500,1500,1500,1500,1500,,,,,,,,,,,,,,,,,,,,,,,,,,,,,,,,,,
1500,1500,1500,1500,1500,1500,1500,1500,1500,1500,1500,1500,1500,1500,1500,1500,1500,,,,,,,,,,,,,,,,,,,,,,,,,,,,,,,,,,
1500,1500,1500,1500,1500,1500,1500,1500,1500,1500,1500,1500,1500,1500,1500,1500,1500,,,,,,,,,,,,,,,,,,,,,,,,,,,,,,,,,,
1500,1500,1500,1500,1500,1500,1500,1500,1500,1500,1500,1500,1500,1500,1500,1500,1500,,,,,,,,,,,,,,,,,,,,,,,,,,,,,,,,,,
#,raw_col_delta_min,,,,,,,,,,,,,,,,,,,,,,,,,,,,,,,,,,,,,,,,,,,,,,,,
-99999,-1500,-1500,-1500,-1500,-1500,-1500,-1500,-1500,-1500,-1500,-1500,-1500,-1500,-1500,-1500,-1500,,,,,,,,,,,,,,,,,,,,,,,,,,,,,,,,,,
-1500,-1500,-1500,-1500,-1500,-1500,-1500,-1500,-1500,-1500,-1500,-1500,-1500,-1500,-1500,-1500,-1500,,,,,,,,,,,,,,,,,,,,,,,,,,,,,,,,,,
-1500,-1500,-1500,-1500,-1500,-1500,-1500,-1500,-1500,-1500,-1500,-1500,-1500,-1500,-1500,-1500,-1500,,,,,,,,,,,,,,,,,,,,,,,,,,,,,,,,,,
-1500,-1500,-1500,-1500,-1500,-1500,-1500,-1500,-1500,-1500,-1500,-1500,-1500,-1500,-1500,-1500,-1500,,,,,,,,,,,,,,,,,,,,,,,,,,,,,,,,,,
-1500,-1500,-1500,-1500,-1500,-1500,-1500,-1500,-1500,-1500,-1500,-1500,-1500,-1500,-1500,-1500,-1500,,,,,,,,,,,,,,,,,,,,,,,,,,,,,,,,,,
-1500,-1500,-1500,-1500,-1500,-1500,-1500,-1500,-1500,-1500,-1500,-1500,-1500,-1500,-1500,-1500,-1500,,,,,,,,,,,,,,,,,,,,,,,,,,,,,,,,,,
-1500,-1500,-1500,-1500,-1500,-1500,-1500,-1500,-1500,-1500,-1500,-1500,-1500,-1500,-1500,-1500,-1500,,,,,,,,,,,,,,,,,,,,,,,,,,,,,,,,,,
-1500,-1500,-1500,-1500,-1500,-1500,-1500,-1500,-1500,-1500,-1500,-1500,-1500,-1500,-1500,-1500,-1500,,,,,,,,,,,,,,,,,,,,,,,,,,,,,,,,,,
-1500,-1500,-1500,-1500,-1500,-1500,-1500,-1500,-1500,-1500,-1500,-1500,-1500,-1500,-1500,-1500,-1500,,,,,,,,,,,,,,,,,,,,,,,,,,,,,,,,,,
-1500,-1500,-1500,-1500,-1500,-1500,-1500,-1500,-1500,-1500,-1500,-1500,-1500,-1500,-1500,-1500,-1500,,,,,,,,,,,,,,,,,,,,,,,,,,,,,,,,,,
-1500,-1500,-1500,-1500,-1500,-1500,-1500,-1500,-1500,-1500,-1500,-1500,-1500,-1500,-1500,-1500,-1500,,,,,,,,,,,,,,,,,,,,,,,,,,,,,,,,,,
-1500,-1500,-1500,-1500,-1500,-1500,-1500,-1500,-1500,-1500,-1500,-1500,-1500,-1500,-1500,-1500,-1500,,,,,,,,,,,,,,,,,,,,,,,,,,,,,,,,,,
-1500,-1500,-1500,-1500,-1500,-1500,-1500,-1500,-1500,-1500,-1500,-1500,-1500,-1500,-1500,-1500,-1500,,,,,,,,,,,,,,,,,,,,,,,,,,,,,,,,,,
-1500,-1500,-1500,-1500,-1500,-1500,-1500,-1500,-1500,-1500,-1500,-1500,-1500,-1500,-1500,-1500,-1500,,,,,,,,,,,,,,,,,,,,,,,,,,,,,,,,,,
-1500,-1500,-1500,-1500,-1500,-1500,-1500,-1500,-1500,-1500,-1500,-1500,-1500,-1500,-1500,-1500,-1500,,,,,,,,,,,,,,,,,,,,,,,,,,,,,,,,,,
-1500,-1500,-1500,-1500,-1500,-1500,-1500,-1500,-1500,-1500,-1500,-1500,-1500,-1500,-1500,-1500,-1500,,,,,,,,,,,,,,,,,,,,,,,,,,,,,,,,,,
-1500,-1500,-1500,-1500,-1500,-1500,-1500,-1500,-1500,-1500,-1500,-1500,-1500,-1500,-1500,-1500,-1500,,,,,,,,,,,,,,,,,,,,,,,,,,,,,,,,,,
-1500,-1500,-1500,-1500,-1500,-1500,-1500,-1500,-1500,-1500,-1500,-1500,-1500,-1500,-1500,-1500,-1500,,,,,,,,,,,,,,,,,,,,,,,,,,,,,,,,,,
-1500,-1500,-1500,-1500,-1500,-1500,-1500,-1500,-1500,-1500,-1500,-1500,-1500,-1500,-1500,-1500,-1500,,,,,,,,,,,,,,,,,,,,,,,,,,,,,,,,,,
-1500,-1500,-1500,-1500,-1500,-1500,-1500,-1500,-1500,-1500,-1500,-1500,-1500,-1500,-1500,-1500,-1500,,,,,,,,,,,,,,,,,,,,,,,,,,,,,,,,,,
-1500,-1500,-1500,-1500,-1500,-1500,-1500,-1500,-1500,-1500,-1500,-1500,-1500,-1500,-1500,-1500,-1500,,,,,,,,,,,,,,,,,,,,,,,,,,,,,,,,,,
-1500,-1500,-1500,-1500,-1500,-1500,-1500,-1500,-1500,-1500,-1500,-1500,-1500,-1500,-1500,-1500,-1500,,,,,,,,,,,,,,,,,,,,,,,,,,,,,,,,,,
-1500,-1500,-1500,-1500,-1500,-1500,-1500,-1500,-1500,-1500,-1500,-1500,-1500,-1500,-1500,-1500,-1500,,,,,,,,,,,,,,,,,,,,,,,,,,,,,,,,,,
-1500,-1500,-1500,-1500,-1500,-1500,-1500,-1500,-1500,-1500,-1500,-1500,-1500,-1500,-1500,-1500,-1500,,,,,,,,,,,,,,,,,,,,,,,,,,,,,,,,,,
-1500,-1500,-1500,-1500,-1500,-1500,-1500,-1500,-1500,-1500,-1500,-1500,-1500,-1500,-1500,-1500,-1500,,,,,,,,,,,,,,,,,,,,,,,,,,,,,,,,,,
-1500,-1500,-1500,-1500,-1500,-1500,-1500,-1500,-1500,-1500,-1500,-1500,-1500,-1500,-1500,-1500,-1500,,,,,,,,,,,,,,,,,,,,,,,,,,,,,,,,,,
-1500,-1500,-1500,-1500,-1500,-1500,-1500,-1500,-1500,-1500,-1500,-1500,-1500,-1500,-1500,-1500,-1500,,,,,,,,,,,,,,,,,,,,,,,,,,,,,,,,,,
-1500,-1500,-1500,-1500,-1500,-1500,-1500,-1500,-1500,-1500,-1500,-1500,-1500,-1500,-1500,-1500,-1500,,,,,,,,,,,,,,,,,,,,,,,,,,,,,,,,,,
-1500,-1500,-1500,-1500,-1500,-1500,-1500,-1500,-1500,-1500,-1500,-1500,-1500,-1500,-1500,-1500,-1500,,,,,,,,,,,,,,,,,,,,,,,,,,,,,,,,,,
-1500,-1500,-1500,-1500,-1500,-1500,-1500,-1500,-1500,-1500,-1500,-1500,-1500,-1500,-1500,-1500,-1500,,,,,,,,,,,,,,,,,,,,,,,,,,,,,,,,,,
-1500,-1500,-1500,-1500,-1500,-1500,-1500,-1500,-1500,-1500,-1500,-1500,-1500,-1500,-1500,-1500,-1500,,,,,,,,,,,,,,,,,,,,,,,,,,,,,,,,,,
-1500,-1500,-1500,-1500,-1500,-1500,-1500,-1500,-1500,-1500,-1500,-1500,-1500,-1500,-1500,-1500,-1500,,,,,,,,,,,,,,,,,,,,,,,,,,,,,,,,,,
-1500,-1500,-1500,-1500,-1500,-1500,-1500,-1500,-1500,-1500,-1500,-1500,-1500,-1500,-1500,-1500,-1500,,,,,,,,,,,,,,,,,,,,,,,,,,,,,,,,,,
-1500,-1500,-1500,-1500,-1500,-1500,-1500,-1500,-1500,-1500,-1500,-1500,-1500,-1500,-1500,-1500,-1500,,,,,,,,,,,,,,,,,,,,,,,,,,,,,,,,,,
-1500,-1500,-1500,-1500,-1500,-1500,-1500,-1500,-1500,-1500,-1500,-1500,-1500,-1500,-1500,-1500,-1500,,,,,,,,,,,,,,,,,,,,,,,,,,,,,,,,,,
-1500,-1500,-1500,-1500,-1500,-1500,-1500,-1500,-1500,-1500,-1500,-1500,-1500,-1500,-1500,-1500,-1500,,,,,,,,,,,,,,,,,,,,,,,,,,,,,,,,,,
