{
    "version": "1.0.0",
    "delay" : 10,
    "schedule_time" : 10,
    "sensor" : {
        "name": "system_h",
        "accuracy": 1
    },
    "temp_level" : {
        "comments" : "low_threshold, high_threshold, hysteresis_value, unit is millicentigrade",
        "table" : [
            [36000, 42000, 2000],
            [42000, 44000, 2000],
            [44000, 46000, 2000],
            [46000, 49000, 2000],
            [49000, 52000, 2000],
            [52000, 55000, 2000],
            [55000, 99000, 2000]
        ]
    },
    "current_limit" : {
        "comments" : "scale1, scale2, scale3, scale4, scale5, scale6, scale7",
        "wcurrent_5v" : {
            "channel" : 0,
            "prefix" : "dcp 0#",
            "limit" : [1200, 1080, 1000, 900, 900, 470, 100]
        },
        "wcurrent_9v" : {
            "channel" : 0,
            "prefix" : "dcp 1#",
            "limit": [1200, 1080, 1000, 900, 900, 470, 100]
        },
        "direct_charger_sc" : {
            "channel" : 0,
            "prefix" : "sc 0#",
            "limit": [0, 3700, 3300, 2500, 2000, 1500, 1000]
        }
    },
    "su_version": "1.0.0",
    "su_delay" : 1,
    "su_current_limit" : {
        "comments" : "hota, normal",
        "wcurrent_5v" : {
            "channel" : 0,
            "prefix" : "dcp 0#",
            "limit" : [900, 1300]
        },
        "wcurrent_9v" : {
            "channel" : 0,
            "prefix" : "dcp 1#",
            "limit": [900, 1300]
        },
        "direct_charger" : {
            "channel" : 1,
            "prefix" : "lvc ",
            "limit": [1500, 1500]
        },
        "direct_charger_sc" : {
            "channel" : 0,
            "prefix" : "sc 0#",
            "limit": [1500, 1500]
        }
    }
}
