{
	"centerX" : 0.5,
	"centerY" : 0.5,
	"angle" : 0,
	"scale" : 1,
	"width" : 240,
	"height" : 80,
	"contents" : [
		{
			"type" : "image",
			"id":"resMont",
			"resource" : {
				"type" : "static",
				"path" : "res/altitude_1_montain.png"
			},
			"centerX" : 0.5,
			"centerY" : 0.3,
			"width" : 200,
			"height" : 45,
			"angle" : 0,
			"zorder" : 1
		},
        {
			"type" : "text",
			"id":"altitude_montain",
			"centerX" : 0.383,
			"centerY" : 0.75,
			"width" : 144,
			"height" : 32,
			"angle" : 0,
			"text": "{ALTITUDE}",
			"editable":true,
			"angle": 0,
            "color": "#00ffffff",
            "isVertical": 0,
            "alignment": 0,
            "font":"roboto",
            "zorder": 2
        },{
			"id":"resNum",
			"type" : "image",
			"resource" : {
				"type" : "static",
				"path" : "res/8.png"
			},
			"centerX" : 0.15,
			"centerY" : 0.75,
			"width" : 32,
			"height" : 32,
			"angle" : 0,
			"zorder" : 3
        },{
			"id":"resNum",
			"type" : "image",
			"resource" : {
				"type" : "static",
				"path" : "res/8.png"
			},
			"centerX" : 0.3,
			"centerY" : 0.75,
			"width" : 32,
			"height" : 32,
			"angle" : 0,
			"zorder" : 3
        },{
			"id":"resNum",
			"type" : "image",
			"resource" : {
				"type" : "static",
				"path" : "res/4.png"
			},
			"centerX" : 0.45,
			"centerY" : 0.75,
			"width" : 32,
			"height" : 32,
			"angle" : 0,
			"zorder" : 3
        }
		,{
			"id":"resNum",
			"type" : "image",
			"resource" : {
				"type" : "static",
				"path" : "res/8.png"
			},
			"centerX" : 0.6,
			"centerY" : 0.75,
			"width" : 32,
			"height" : 32,
			"angle" : 0,
			"zorder" : 3
        }
		,{
			"type" : "image",
			"id":"resM",
			"resource" : {
				"type" : "static",
				"path" : "res/altitude_1_num_m.png"
			},
			"centerX" : 0.75,
			"centerY" : 0.75,
			"width" : 32,
			"height" : 32,
			"angle" : 0,
			"zorder" : 3
        }
	]
}
