#,version,,,,,,,,,,,,,,,,,,,,,,,,,,,,,,,,,,,,,,,,,,,,,,,,
2019,1,8,1,,,,,,,,,,,,,,,,,,,,,,,,,,,,,,,,,,,,,,,,,,,,,,
#,row_col_num,,,,,,,,,,,,,,,,,,,,,,,,,,,,,,,,,,,,,,,,,,,,,,,,
33,15,,,,,,,,,,,,,,,,,,,,,,,,,,,,,,,,,,,,,,,,,,,,,,,,
#,noise,,,,,,,,,,,,,,,,,,,,,,,,,,,,,,,,,,,,,,,,,,,,,,,,
-150,150,,,,,,,,,,,,,,,,,,,,,,,,,,,,,,,,,,,,,,,,,,,,,,,,
#,raw_max,,,,,,,,,,,,,,,,,,,,,,,,,,,,,,,,,,,,,,,,,,,,,,,,
2558,5742,5888,5847,5880,5793,5313,5431,5551,6072,6052,6135,6137,6005,4424,
5352,5794,5915,5881,5905,5850,5959,5647,5983,5996,5949,6007,6000,6055,5741,
5749,5821,5940,5906,5928,5864,6010,5927,6010,6003,5958,6016,6001,6068,5928,
5740,5794,5911,5880,5902,5837,5986,5920,5979,5977,5931,5986,5970,6052,5881,
5740,5788,5910,5881,5903,5837,5981,5918,5975,5970,5924,5984,5962,6024,5845,
5758,5802,5929,5892,5915,5851,6002,5934,5996,5986,5940,6001,5979,6040,5846,
5764,5810,5932,5898,5922,5856,5998,5948,6001,5993,5946,6010,5993,6049,5845,
5786,5836,5953,5927,5944,5879,6022,5957,6019,6018,5971,6029,6009,6066,5841,
5776,5827,5951,5915,5940,5877,6029,5966,6023,6015,5975,6038,6012,6064,5833,
5792,5840,5960,5928,5951,5885,6040,5970,6037,6029,5996,6057,6040,6088,5849,
5786,5832,5953,5922,5945,5880,6035,5972,6033,6029,5984,6048,6032,6080,5832,
5807,5859,5981,5948,5971,5901,6049,5983,6050,6049,6003,6068,6053,6111,5849,
5827,5875,5996,5959,5985,5927,6066,6003,6071,6066,6022,6085,6075,6119,5858,
5859,5907,6028,5993,6016,5950,6101,6029,6102,6101,6049,6107,6101,6144,5876,
5894,5948,6074,6038,6063,5996,6150,6075,6156,6148,6104,6163,6156,6198,5920,
5897,5950,6068,6031,6057,5990,6144,6072,6148,6145,6098,6154,6154,6189,5910,
5941,5992,6115,6085,6113,6044,6194,6127,6209,6200,6154,6218,6214,6248,5958,
6062,6107,6235,6206,6226,6157,6310,6239,6327,6319,6275,6340,6340,6373,6076,
6046,6092,6227,6183,6210,6141,6304,6226,6315,6310,6261,6323,6332,6366,6064,
6110,6149,6276,6248,6269,6193,6352,6279,6376,6373,6326,6391,6397,6426,6122,
6111,6158,6283,6249,6270,6200,6353,6286,6378,6382,6330,6392,6401,6425,6119,
6152,6196,6322,6289,6312,6240,6399,6324,6430,6419,6374,6442,6448,6470,6166,
6204,6243,6375,6335,6362,6292,6451,6367,6471,6469,6423,6501,6508,6534,6220,
6283,6321,6453,6421,6445,6378,6539,6464,6572,6572,6518,6587,6599,6621,6314,
6345,6382,6514,6482,6510,6439,6604,6526,6646,6651,6590,6655,6683,6695,6367,
6434,6477,6610,6569,6607,6538,6717,6621,6752,6739,6691,6757,6781,6799,6471,
6499,6532,6668,6639,6657,6584,6754,6673,6803,6799,6751,6816,6847,6855,6534,
6624,6656,6787,6756,6790,6717,6887,6804,6945,6943,6889,6963,6990,7010,6676,
6751,6785,6920,6908,6929,6854,7028,6945,7102,7097,7041,7116,7144,7160,6821,
6809,6848,6991,6968,6991,6917,7095,7010,7177,7164,7119,7190,7233,7255,6921,
6869,6906,7050,7066,7088,7002,7185,7101,7274,7270,7214,7290,7322,7344,7024,
6794,6998,7158,7189,7208,7144,7326,7244,7437,7431,7380,7459,7491,7515,7206,
5639,7066,7331,7319,7340,7251,7428,7319,7489,7448,7462,7537,7643,7468,5877,
#,raw_min,,,,,,,,,,,,,,,,,,,,,,,,,,,,,,,,,,,,,,,,,,,,,,,,
1378,3092,3170,3149,3166,3119,2861,2925,2989,3270,3258,3303,3305,3233,2382,
2882,3120,3185,3167,3179,3150,3209,3041,3221,3228,3203,3235,3230,3261,3091,
3095,3135,3198,3180,3192,3158,3236,3191,3236,3233,3208,3240,3231,3268,3192,
3090,3120,3183,3166,3178,3143,3224,3188,3219,3219,3193,3224,3214,3258,3167,
3090,3116,3182,3167,3179,3143,3221,3186,3217,3214,3190,3222,3210,3244,3147,
3100,3124,3193,3172,3185,3151,3232,3196,3228,3224,3198,3231,3219,3252,3148,
3104,3128,3194,3176,3188,3154,3230,3202,3231,3227,3202,3236,3227,3257,3147,
3116,3142,3205,3191,3200,3165,3242,3207,3241,3240,3215,3247,3235,3266,3145,
3110,3137,3205,3185,3198,3165,3247,3212,3243,3239,3217,3252,3238,3266,3141,
3118,3144,3210,3192,3205,3169,3252,3214,3251,3247,3228,3261,3252,3278,3149,
3116,3140,3205,3188,3201,3166,3249,3216,3249,3247,3222,3256,3248,3274,3140,
3127,3155,3221,3202,3215,3177,3257,3221,3258,3257,3233,3268,3259,3291,3149,
3137,3163,3228,3209,3223,3191,3266,3233,3269,3266,3242,3277,3271,3295,3154,
3155,3181,3246,3227,3240,3204,3285,3247,3286,3285,3257,3289,3285,3308,3164,
3174,3202,3270,3252,3265,3228,3312,3271,3314,3310,3286,3319,3314,3338,3188,
3175,3204,3268,3247,3261,3226,3308,3270,3310,3309,3284,3314,3314,3333,3182,
3199,3226,3293,3277,3291,3254,3336,3299,3343,3338,3314,3348,3346,3364,3208,
3264,3289,3357,3342,3352,3315,3398,3359,3407,3403,3379,3414,3414,3431,3272,
3256,3280,3353,3329,3344,3307,3394,3352,3401,3398,3371,3405,3410,3428,3266,
3290,3311,3380,3364,3375,3335,3420,3381,3434,3431,3406,3441,3445,3460,3296,
3291,3316,3383,3365,3376,3338,3421,3384,3434,3436,3408,3442,3447,3459,3295,
3312,3336,3404,3387,3398,3360,3445,3406,3462,3457,3432,3468,3472,3484,3320,
3340,3361,3433,3411,3426,3388,3473,3429,3485,3483,3459,3501,3504,3518,3350,
3383,3403,3475,3457,3471,3434,3521,3480,3538,3538,3510,3547,3553,3565,3400,
3417,3436,3508,3490,3506,3467,3556,3514,3578,3581,3548,3583,3599,3605,3429,
3464,3487,3560,3537,3557,3520,3617,3565,3636,3629,3603,3639,3651,3661,3485,
3499,3518,3590,3575,3585,3546,3636,3593,3663,3661,3635,3670,3687,3691,3518,
3566,3584,3655,3638,3656,3617,3709,3664,3739,3739,3709,3749,3764,3774,3594,
3635,3653,3726,3720,3731,3690,3784,3739,3824,3821,3791,3832,3846,3856,3673,
3667,3688,3765,3752,3765,3725,3821,3774,3865,3858,3833,3872,3895,3907,3727,
3699,3718,3796,3804,3816,3770,3869,3823,3916,3914,3884,3926,3942,3954,3782,
3658,3768,3854,3871,3881,3846,3944,3900,4005,4001,3974,4017,4033,4047,3880,
3037,3804,3947,3941,3952,3905,4000,3941,4033,4010,4018,4059,4115,4021,3165,