{
"rollie/sa_dynamic_switch.xml":"20220609224500",
"collie/CallRecoveryConfig.json":"20230701215501",
"rollie/net_predict.xml":"20220314105000",
"collie/vonr_dynamic_switch.xml":"20220829110000"
}