unified_raw_limit,,,,,,,,,,,,,,,,,,,,,,,,,,,,,,,,,,,,,,,,,,,,,,,,,,,,,,,,,,,,,,,,,,,,,,,,,,,,,,,,,,,,,,,,,,,
9999,500,110,,,,,,,,,,,,,,,,,,,,,,,,,,,,,,,,,,,,,,,,,,,,,,,,,,,,,,,,,,,,,,,,,,,,,,,,,,,,,,,,,,,,,,,,,
noise_data_limit,,,,,,,,,,,,,,,,,,,,,,,,,,,,,,,,,,,,,,,,,,,,,,,,,,,,,,,,,,,,,,,,,,,,,,,,,,,,,,,,,,,,,,,,,,,
100,,,,,,,,,,,,,,,,,,,,,,,,,,,,,,,,,,,,,,,,,,,,,,,,,,,,,,,,,,,,,,,,,,,,,,,,,,,,,,,,,,,,,,,,,,,
shortciurt_threshold,,,,,,,,,,,,,,,,,,,,,,,,,,,,,,,,,,,,,,,,,,,,,,,,,,,,,,,,,,,,,,,,,,,,,,,,,,,,,,,,,,,,,,,,,,,
30,150,150,150,100,100,20,,,,,,,,,,,,,,,,,,,,,,,,,,,,,,,,,,,,,,,,,,,,,,,,,,,,,,,,,,,,,,,,,,,,,,,,,,,,,,,,,,,,,
specail_raw_max,,,,,,,,,,,,,,,,,,,,,,,,,,,,,,,,,,,,,,,,,,,,,,,,,,,,,,,,,,,,,,,,,,,,,,,,,,,,,,,,,,,,,,,,,,,
3114,3169,3209,3191,3217,3243,3255,3250,3307,3270,3300,3324,3350,3325,3373,3350,3372,3424,3218,3286,3272,3282,3313,3316,3304,3352,3328,3333,3369,3348,3370,3356,3386,3372,3378,3529,,,,,,,,,,,,,,,,,,,,,,,,,,,,,,,,,,,,,,,,,,,,,,,,,,,,,,,,
3117,3169,3212,3194,3220,3242,3252,3246,3304,3269,3300,3325,3355,3331,3383,3359,3390,3430,3225,3294,3281,3295,3328,3329,3315,3365,3341,3346,3385,3368,3396,3386,3422,3412,3419,3554,,,,,,,,,,,,,,,,,,,,,,,,,,,,,,,,,,,,,,,,,,,,,,,,,,,,,,,,
3120,3173,3217,3204,3224,3247,3255,3248,3305,3272,3302,3326,3357,3335,3387,3364,3387,3434,3231,3300,3286,3300,3331,3333,3318,3369,3344,3350,3387,3370,3400,3390,3426,3416,3421,3545,,,,,,,,,,,,,,,,,,,,,,,,,,,,,,,,,,,,,,,,,,,,,,,,,,,,,,,,
3129,3183,3226,3209,3234,3256,3265,3259,3317,3282,3312,3337,3368,3346,3398,3376,3400,3446,3239,3308,3295,3308,3341,3342,3326,3376,3352,3359,3395,3378,3408,3399,3435,3425,3429,3549,,,,,,,,,,,,,,,,,,,,,,,,,,,,,,,,,,,,,,,,,,,,,,,,,,,,,,,,
3126,3187,3225,3207,3231,3252,3261,3256,3315,3279,3308,3333,3363,3342,3393,3370,3394,3441,3235,3304,3292,3305,3337,3337,3321,3372,3347,3354,3391,3374,3404,3394,3430,3420,3424,3541,,,,,,,,,,,,,,,,,,,,,,,,,,,,,,,,,,,,,,,,,,,,,,,,,,,,,,,,
3130,3187,3230,3212,3242,3259,3268,3261,3320,3285,3316,3339,3369,3347,3399,3376,3399,3446,3238,3308,3295,3308,3339,3339,3324,3374,3348,3354,3391,3374,3406,3396,3432,3421,3425,3538,,,,,,,,,,,,,,,,,,,,,,,,,,,,,,,,,,,,,,,,,,,,,,,,,,,,,,,,
3138,3195,3244,3220,3244,3266,3274,3268,3326,3292,3321,3346,3377,3356,3407,3382,3406,3454,3247,3316,3302,3315,3346,3346,3330,3381,3355,3360,3395,3380,3411,3400,3437,3426,3429,3542,,,,,,,,,,,,,,,,,,,,,,,,,,,,,,,,,,,,,,,,,,,,,,,,,,,,,,,,
3097,3155,3196,3178,3201,3224,3238,3226,3283,3250,3278,3303,3333,3312,3363,3339,3363,3408,3208,3274,3261,3273,3304,3303,3287,3335,3311,3315,3351,3337,3367,3357,3393,3381,3383,3493,,,,,,,,,,,,,,,,,,,,,,,,,,,,,,,,,,,,,,,,,,,,,,,,,,,,,,,,
3101,3157,3200,3182,3205,3226,3235,3234,3286,3252,3281,3305,3335,3315,3364,3342,3364,3411,3211,3278,3265,3276,3307,3305,3290,3338,3313,3316,3352,3338,3368,3359,3394,3383,3386,3491,,,,,,,,,,,,,,,,,,,,,,,,,,,,,,,,,,,,,,,,,,,,,,,,,,,,,,,,
3109,3165,3207,3190,3213,3234,3243,3235,3299,3259,3287,3312,3342,3321,3370,3347,3372,3419,3216,3283,3269,3281,3312,3309,3295,3343,3318,3321,3357,3342,3372,3363,3399,3387,3390,3494,,,,,,,,,,,,,,,,,,,,,,,,,,,,,,,,,,,,,,,,,,,,,,,,,,,,,,,,
3110,3168,3209,3192,3214,3243,3244,3239,3296,3261,3291,3315,3344,3324,3373,3350,3373,3420,3218,3286,3272,3283,3315,3313,3298,3346,3321,3325,3360,3344,3374,3365,3400,3390,3393,3494,,,,,,,,,,,,,,,,,,,,,,,,,,,,,,,,,,,,,,,,,,,,,,,,,,,,,,,,
3120,3177,3220,3201,3225,3247,3256,3250,3307,3277,3300,3326,3355,3333,3383,3360,3382,3430,3225,3294,3279,3291,3322,3321,3305,3355,3329,3333,3368,3352,3381,3373,3408,3396,3400,3498,,,,,,,,,,,,,,,,,,,,,,,,,,,,,,,,,,,,,,,,,,,,,,,,,,,,,,,,
3114,3172,3214,3198,3221,3243,3252,3244,3302,3266,3295,3325,3348,3328,3385,3355,3377,3422,3221,3289,3274,3287,3317,3316,3300,3350,3325,3328,3364,3347,3377,3368,3404,3394,3395,3491,,,,,,,,,,,,,,,,,,,,,,,,,,,,,,,,,,,,,,,,,,,,,,,,,,,,,,,,
3131,3187,3231,3213,3238,3259,3266,3260,3317,3282,3317,3337,3365,3343,3394,3380,3394,3441,3237,3304,3290,3300,3331,3330,3315,3365,3339,3342,3378,3361,3391,3383,3419,3407,3409,3503,,,,,,,,,,,,,,,,,,,,,,,,,,,,,,,,,,,,,,,,,,,,,,,,,,,,,,,,
3123,3181,3222,3205,3229,3250,3259,3252,3309,3274,3304,3328,3356,3341,3386,3364,3394,3433,3229,3296,3282,3294,3324,3322,3307,3356,3331,3335,3370,3354,3383,3374,3411,3399,3402,3490,,,,,,,,,,,,,,,,,,,,,,,,,,,,,,,,,,,,,,,,,,,,,,,,,,,,,,,,
3133,3190,3233,3214,3238,3259,3268,3260,3318,3283,3312,3337,3372,3343,3395,3373,3396,3451,3238,3305,3291,3303,3333,3331,3316,3364,3339,3344,3380,3363,3393,3383,3419,3408,3409,3495,,,,,,,,,,,,,,,,,,,,,,,,,,,,,,,,,,,,,,,,,,,,,,,,,,,,,,,,
3133,3190,3233,3216,3239,3259,3266,3260,3317,3282,3312,3335,3365,3344,3394,3373,3394,3442,3237,3305,3291,3303,3331,3331,3315,3364,3339,3343,3380,3363,3393,3382,3419,3407,3409,3490,,,,,,,,,,,,,,,,,,,,,,,,,,,,,,,,,,,,,,,,,,,,,,,,,,,,,,,,
3138,3196,3239,3226,3244,3266,3273,3265,3324,3289,3317,3342,3370,3350,3400,3378,3399,3447,3242,3311,3296,3307,3338,3335,3321,3369,3344,3348,3385,3368,3396,3387,3422,3412,3412,3490,,,,,,,,,,,,,,,,,,,,,,,,,,,,,,,,,,,,,,,,,,,,,,,,,,,,,,,,
3127,3185,3227,3211,3233,3253,3261,3253,3312,3277,3305,3330,3359,3337,3389,3365,3387,3435,3230,3299,3285,3296,3326,3325,3311,3357,3333,3337,3372,3355,3385,3374,3411,3400,3402,3474,,,,,,,,,,,,,,,,,,,,,,,,,,,,,,,,,,,,,,,,,,,,,,,,,,,,,,,,
3147,3204,3247,3229,3252,3273,3281,3273,3331,3296,3325,3348,3378,3356,3408,3385,3408,3456,3250,3318,3303,3316,3346,3344,3328,3376,3351,3354,3390,3373,3402,3393,3429,3419,3420,3489,,,,,,,,,,,,,,,,,,,,,,,,,,,,,,,,,,,,,,,,,,,,,,,,,,,,,,,,
3147,3199,3242,3224,3246,3268,3274,3268,3325,3290,3318,3343,3372,3351,3402,3378,3402,3448,3243,3312,3298,3309,3341,3339,3324,3372,3346,3350,3385,3368,3398,3389,3425,3413,3415,3480,,,,,,,,,,,,,,,,,,,,,,,,,,,,,,,,,,,,,,,,,,,,,,,,,,,,,,,,
3153,3211,3255,3237,3259,3281,3289,3281,3339,3303,3331,3356,3385,3364,3413,3391,3413,3461,3255,3324,3308,3318,3351,3350,3334,3382,3357,3360,3396,3380,3409,3400,3437,3425,3426,3485,,,,,,,,,,,,,,,,,,,,,,,,,,,,,,,,,,,,,,,,,,,,,,,,,,,,,,,,
3149,3213,3251,3234,3256,3277,3286,3278,3337,3300,3329,3352,3381,3360,3411,3387,3409,3456,3252,3320,3305,3316,3347,3347,3331,3380,3354,3356,3393,3374,3404,3396,3433,3421,3422,3474,,,,,,,,,,,,,,,,,,,,,,,,,,,,,,,,,,,,,,,,,,,,,,,,,,,,,,,,
3157,3216,3259,3242,3270,3286,3295,3287,3346,3309,3338,3361,3391,3369,3420,3396,3419,3465,3259,3328,3313,3322,3355,3354,3339,3387,3361,3364,3400,3382,3412,3403,3439,3428,3429,3474,,,,,,,,,,,,,,,,,,,,,,,,,,,,,,,,,,,,,,,,,,,,,,,,,,,,,,,,
3157,3214,3264,3242,3264,3286,3295,3287,3346,3309,3337,3361,3390,3368,3419,3395,3417,3463,3257,3326,3312,3321,3354,3352,3337,3386,3360,3363,3399,3381,3412,3402,3439,3428,3428,3465,,,,,,,,,,,,,,,,,,,,,,,,,,,,,,,,,,,,,,,,,,,,,,,,,,,,,,,,
3168,3225,3269,3252,3274,3296,3311,3298,3356,3320,3347,3372,3402,3380,3429,3406,3426,3473,3268,3337,3322,3331,3364,3361,3346,3395,3369,3373,3408,3391,3422,3413,3450,3438,3439,3468,,,,,,,,,,,,,,,,,,,,,,,,,,,,,,,,,,,,,,,,,,,,,,,,,,,,,,,,
3156,3213,3256,3240,3263,3289,3292,3285,3342,3307,3334,3359,3387,3365,3415,3391,3413,3460,3255,3324,3311,3320,3352,3351,3334,3382,3356,3361,3396,3380,3411,3402,3438,3426,3428,3454,,,,,,,,,,,,,,,,,,,,,,,,,,,,,,,,,,,,,,,,,,,,,,,,,,,,,,,,
3164,3221,3264,3246,3269,3291,3299,3291,3348,3318,3341,3364,3394,3372,3422,3399,3420,3467,3263,3331,3317,3328,3360,3357,3342,3390,3364,3368,3404,3386,3417,3408,3445,3434,3435,3469,,,,,,,,,,,,,,,,,,,,,,,,,,,,,,,,,,,,,,,,,,,,,,,,,,,,,,,,
3196,3255,3299,3282,3305,3326,3334,3325,3385,3350,3377,3400,3429,3407,3456,3434,3455,3502,3302,3367,3351,3361,3394,3393,3378,3426,3400,3403,3439,3421,3454,3443,3489,3469,3473,3511,,,,,,,,,,,,,,,,,,,,,,,,,,,,,,,,,,,,,,,,,,,,,,,,,,,,,,,,
3207,3265,3308,3291,3315,3337,3344,3335,3395,3360,3387,3411,3441,3419,3468,3445,3467,3513,3304,3381,3360,3370,3402,3400,3385,3434,3408,3411,3447,3430,3461,3451,3489,3477,3478,3506,,,,,,,,,,,,,,,,,,,,,,,,,,,,,,,,,,,,,,,,,,,,,,,,,,,,,,,,
3204,3263,3305,3287,3312,3333,3342,3333,3393,3356,3383,3408,3438,3416,3465,3442,3464,3511,3302,3373,3356,3367,3399,3398,3382,3432,3406,3408,3446,3428,3460,3448,3487,3474,3478,3507,,,,,,,,,,,,,,,,,,,,,,,,,,,,,,,,,,,,,,,,,,,,,,,,,,,,,,,,
3208,3265,3308,3291,3315,3337,3344,3335,3395,3359,3386,3409,3439,3417,3467,3445,3467,3513,3304,3374,3360,3369,3402,3400,3385,3434,3408,3411,3447,3430,3461,3451,3490,3477,3480,3523,,,,,,,,,,,,,,,,,,,,,,,,,,,,,,,,,,,,,,,,,,,,,,,,,,,,,,,,
3201,3260,3303,3285,3309,3330,3338,3329,3387,3351,3380,3403,3433,3411,3461,3438,3460,3507,3298,3369,3352,3364,3395,3394,3383,3428,3402,3404,3442,3424,3456,3445,3485,3472,3476,3520,,,,,,,,,,,,,,,,,,,,,,,,,,,,,,,,,,,,,,,,,,,,,,,,,,,,,,,,
3196,3255,3296,3279,3303,3325,3333,3324,3382,3346,3374,3398,3428,3406,3455,3432,3454,3500,3294,3364,3352,3357,3390,3389,3373,3422,3396,3399,3435,3419,3451,3439,3478,3467,3471,3523,,,,,,,,,,,,,,,,,,,,,,,,,,,,,,,,,,,,,,,,,,,,,,,,,,,,,,,,
3201,3259,3302,3285,3308,3330,3338,3329,3387,3352,3380,3406,3434,3412,3461,3439,3461,3507,3300,3369,3354,3368,3394,3393,3378,3428,3402,3406,3443,3425,3458,3447,3485,3473,3476,3534,,,,,,,,,,,,,,,,,,,,,,,,,,,,,,,,,,,,,,,,,,,,,,,,,,,,,,,,
3151,3209,3251,3234,3257,3278,3286,3277,3335,3302,3329,3354,3382,3360,3409,3386,3408,3454,3252,3321,3305,3316,3347,3351,3330,3380,3354,3357,3393,3376,3407,3398,3435,3422,3425,3489,,,,,,,,,,,,,,,,,,,,,,,,,,,,,,,,,,,,,,,,,,,,,,,,,,,,,,,,
3147,3207,3248,3230,3253,3274,3283,3273,3331,3298,3325,3350,3380,3356,3407,3385,3406,3452,3250,3318,3303,3312,3350,3342,3326,3376,3350,3352,3390,3372,3404,3394,3432,3420,3422,3490,,,,,,,,,,,,,,,,,,,,,,,,,,,,,,,,,,,,,,,,,,,,,,,,,,,,,,,,
3144,3203,3244,3226,3251,3272,3279,3270,3329,3294,3322,3346,3376,3354,3403,3380,3402,3448,3247,3316,3300,3309,3341,3339,3324,3372,3347,3356,3387,3370,3402,3391,3429,3417,3419,3491,,,,,,,,,,,,,,,,,,,,,,,,,,,,,,,,,,,,,,,,,,,,,,,,,,,,,,,,
3148,3207,3250,3231,3255,3276,3285,3274,3333,3299,3326,3350,3380,3357,3407,3383,3406,3452,3251,3320,3303,3313,3344,3344,3329,3377,3359,3355,3393,3374,3407,3396,3434,3422,3425,3503,,,,,,,,,,,,,,,,,,,,,,,,,,,,,,,,,,,,,,,,,,,,,,,,,,,,,,,,
3139,3196,3238,3221,3244,3265,3273,3264,3322,3289,3316,3339,3368,3347,3395,3373,3395,3441,3240,3311,3295,3304,3335,3335,3321,3374,3343,3347,3383,3367,3398,3387,3425,3413,3416,3497,,,,,,,,,,,,,,,,,,,,,,,,,,,,,,,,,,,,,,,,,,,,,,,,,,,,,,,,
3140,3198,3239,3222,3246,3266,3274,3266,3325,3291,3318,3342,3370,3350,3399,3376,3398,3445,3244,3312,3298,3307,3339,3338,3324,3372,3347,3350,3386,3374,3408,3391,3428,3416,3419,3504,,,,,,,,,,,,,,,,,,,,,,,,,,,,,,,,,,,,,,,,,,,,,,,,,,,,,,,,
3130,3186,3229,3213,3235,3256,3265,3256,3315,3281,3308,3331,3360,3339,3389,3365,3387,3434,3234,3303,3287,3296,3329,3328,3312,3361,3335,3339,3381,3359,3390,3381,3417,3406,3416,3497,,,,,,,,,,,,,,,,,,,,,,,,,,,,,,,,,,,,,,,,,,,,,,,,,,,,,,,,
3131,3188,3231,3214,3237,3257,3266,3257,3316,3282,3309,3333,3361,3341,3390,3367,3389,3435,3237,3305,3290,3300,3331,3330,3316,3363,3338,3341,3378,3363,3394,3389,3429,3409,3412,3503,,,,,,,,,,,,,,,,,,,,,,,,,,,,,,,,,,,,,,,,,,,,,,,,,,,,,,,,
3126,3182,3224,3207,3229,3250,3257,3248,3307,3273,3300,3324,3352,3333,3381,3357,3380,3426,3230,3299,3283,3294,3325,3324,3308,3355,3331,3334,3372,3356,3387,3377,3415,3409,3406,3507,,,,,,,,,,,,,,,,,,,,,,,,,,,,,,,,,,,,,,,,,,,,,,,,,,,,,,,,
3120,3177,3218,3201,3224,3244,3253,3244,3303,3269,3295,3318,3348,3328,3376,3354,3376,3422,3225,3294,3278,3289,3321,3318,3304,3351,3326,3330,3368,3351,3382,3372,3411,3399,3402,3498,,,,,,,,,,,,,,,,,,,,,,,,,,,,,,,,,,,,,,,,,,,,,,,,,,,,,,,,
3107,3161,3203,3187,3209,3231,3239,3231,3289,3255,3282,3305,3334,3313,3363,3341,3361,3408,3212,3281,3265,3281,3308,3307,3291,3339,3313,3317,3354,3338,3368,3359,3396,3386,3389,3487,,,,,,,,,,,,,,,,,,,,,,,,,,,,,,,,,,,,,,,,,,,,,,,,,,,,,,,,
3099,3155,3196,3181,3203,3225,3233,3225,3282,3248,3276,3299,3328,3307,3356,3334,3356,3402,3211,3274,3259,3268,3300,3299,3285,3333,3307,3309,3347,3330,3361,3351,3389,3378,3381,3482,,,,,,,,,,,,,,,,,,,,,,,,,,,,,,,,,,,,,,,,,,,,,,,,,,,,,,,,
3103,3160,3201,3185,3208,3230,3238,3229,3286,3253,3281,3305,3333,3312,3360,3339,3361,3407,3211,3281,3265,3274,3305,3304,3290,3337,3312,3315,3352,3335,3367,3357,3395,3383,3386,3491,,,,,,,,,,,,,,,,,,,,,,,,,,,,,,,,,,,,,,,,,,,,,,,,,,,,,,,,
3104,3160,3203,3186,3208,3230,3238,3230,3287,3256,3282,3305,3334,3312,3360,3339,3361,3408,3212,3281,3266,3276,3307,3304,3290,3337,3312,3315,3352,3337,3369,3359,3396,3385,3387,3495,,,,,,,,,,,,,,,,,,,,,,,,,,,,,,,,,,,,,,,,,,,,,,,,,,,,,,,,
3094,3151,3191,3174,3196,3218,3227,3218,3276,3244,3272,3296,3324,3302,3350,3329,3352,3398,3204,3272,3256,3265,3296,3295,3279,3326,3302,3304,3342,3326,3359,3350,3387,3376,3380,3489,,,,,,,,,,,,,,,,,,,,,,,,,,,,,,,,,,,,,,,,,,,,,,,,,,,,,,,,
3096,3152,3194,3177,3199,3221,3229,3221,3278,3246,3274,3299,3328,3305,3352,3331,3355,3402,3207,3279,3259,3269,3300,3298,3282,3329,3304,3307,3344,3329,3361,3352,3391,3380,3383,3494,,,,,,,,,,,,,,,,,,,,,,,,,,,,,,,,,,,,,,,,,,,,,,,,,,,,,,,,
3091,3147,3187,3173,3194,3216,3224,3216,3273,3242,3269,3294,3322,3299,3347,3326,3350,3396,3201,3270,3260,3264,3296,3294,3278,3325,3299,3302,3339,3324,3357,3348,3387,3376,3378,3491,,,,,,,,,,,,,,,,,,,,,,,,,,,,,,,,,,,,,,,,,,,,,,,,,,,,,,,,
3091,3148,3188,3173,3194,3216,3225,3216,3274,3243,3269,3294,3321,3300,3348,3328,3351,3398,3203,3270,3256,3266,3298,3295,3285,3326,3302,3303,3341,3326,3357,3350,3389,3378,3382,3497,,,,,,,,,,,,,,,,,,,,,,,,,,,,,,,,,,,,,,,,,,,,,,,,,,,,,,,,
3070,3127,3168,3153,3174,3196,3204,3196,3255,3222,3248,3273,3300,3279,3328,3307,3329,3376,3185,3252,3237,3247,3279,3277,3261,3307,3283,3291,3322,3307,3338,3330,3369,3359,3364,3485,,,,,,,,,,,,,,,,,,,,,,,,,,,,,,,,,,,,,,,,,,,,,,,,,,,,,,,,
3062,3116,3156,3139,3161,3183,3191,3183,3240,3209,3234,3259,3286,3265,3313,3291,3313,3359,3170,3238,3224,3234,3265,3269,3250,3296,3273,3276,3312,3296,3328,3318,3359,3350,3356,3486,,,,,,,,,,,,,,,,,,,,,,,,,,,,,,,,,,,,,,,,,,,,,,,,,,,,,,,,
3060,3118,3155,3138,3159,3181,3187,3179,3235,3204,3229,3251,3278,3256,3304,3282,3302,3344,3160,3226,3211,3221,3251,3247,3233,3278,3252,3252,3286,3274,3303,3286,3321,3308,3315,3459,,,,,,,,,,,,,,,,,,,,,,,,,,,,,,,,,,,,,,,,,,,,,,,,,,,,,,,,
specail_raw_min,,,,,,,,,,,,,,,,,,,,,,,,,,,,,,,,,,,,,,,,,,,,,,,,,,,,,,,,,,,,,,,,,,,,,,,,,,,,,,,,,,,,,,,,,,,
1677,1706,1728,1718,1732,1746,1752,1750,1780,1761,1777,1789,1803,1790,1816,1803,1815,1843,1733,1769,1761,1767,1784,1785,1779,1805,1792,1794,1814,1803,1815,1807,1823,1815,1819,1900,,,,,,,,,,,,,,,,,,,,,,,,,,,,,,,,,,,,,,,,,,,,,,,,,,,,,,,,
1678,1706,1729,1719,1733,1745,1751,1747,1779,1760,1777,1790,1806,1794,1822,1808,1825,1847,1736,1773,1766,1774,1792,1792,1785,1812,1798,1801,1822,1813,1829,1823,1843,1837,1840,1913,,,,,,,,,,,,,,,,,,,,,,,,,,,,,,,,,,,,,,,,,,,,,,,,,,,,,,,,
1680,1708,1732,1725,1736,1748,1752,1749,1780,1761,1778,1791,1808,1796,1824,1811,1824,1849,1740,1777,1769,1777,1794,1794,1787,1814,1801,1803,1824,1815,1831,1825,1845,1839,1842,1908,,,,,,,,,,,,,,,,,,,,,,,,,,,,,,,,,,,,,,,,,,,,,,,,,,,,,,,,
1684,1714,1737,1728,1741,1753,1758,1754,1786,1767,1783,1796,1813,1801,1829,1817,1831,1855,1744,1781,1774,1781,1798,1799,1791,1817,1805,1808,1828,1819,1835,1830,1850,1844,1846,1910,,,,,,,,,,,,,,,,,,,,,,,,,,,,,,,,,,,,,,,,,,,,,,,,,,,,,,,,
1683,1716,1736,1726,1740,1751,1756,1753,1785,1766,1781,1794,1810,1799,1826,1815,1827,1852,1742,1779,1773,1780,1796,1796,1788,1815,1802,1805,1826,1817,1833,1827,1847,1841,1843,1906,,,,,,,,,,,,,,,,,,,,,,,,,,,,,,,,,,,,,,,,,,,,,,,,,,,,,,,,
1685,1716,1739,1729,1745,1754,1759,1756,1787,1768,1785,1798,1814,1802,1830,1817,1830,1855,1743,1781,1774,1781,1798,1798,1789,1817,1803,1805,1826,1817,1833,1829,1847,1842,1844,1905,,,,,,,,,,,,,,,,,,,,,,,,,,,,,,,,,,,,,,,,,,,,,,,,,,,,,,,,
1689,1720,1747,1733,1747,1759,1763,1759,1791,1773,1788,1801,1818,1807,1834,1821,1833,1859,1748,1785,1778,1785,1801,1801,1793,1820,1806,1809,1828,1819,1836,1831,1850,1845,1846,1907,,,,,,,,,,,,,,,,,,,,,,,,,,,,,,,,,,,,,,,,,,,,,,,,,,,,,,,,
1668,1698,1721,1711,1724,1736,1743,1737,1768,1750,1765,1778,1794,1783,1810,1798,1810,1835,1727,1763,1756,1762,1779,1778,1770,1796,1782,1785,1804,1796,1812,1808,1826,1820,1822,1880,,,,,,,,,,,,,,,,,,,,,,,,,,,,,,,,,,,,,,,,,,,,,,,,,,,,,,,,
1670,1700,1723,1713,1726,1737,1742,1741,1769,1751,1766,1780,1796,1785,1811,1799,1811,1836,1729,1765,1758,1764,1780,1780,1771,1797,1784,1785,1805,1797,1813,1808,1827,1822,1823,1880,,,,,,,,,,,,,,,,,,,,,,,,,,,,,,,,,,,,,,,,,,,,,,,,,,,,,,,,
1674,1704,1726,1717,1730,1741,1746,1742,1776,1754,1770,1783,1799,1788,1815,1802,1815,1840,1731,1768,1760,1766,1783,1782,1774,1800,1787,1788,1808,1799,1815,1810,1830,1824,1825,1881,,,,,,,,,,,,,,,,,,,,,,,,,,,,,,,,,,,,,,,,,,,,,,,,,,,,,,,,
1675,1705,1728,1719,1731,1746,1747,1744,1775,1756,1772,1785,1801,1789,1816,1803,1816,1841,1733,1769,1761,1768,1785,1784,1775,1801,1788,1790,1809,1801,1817,1812,1831,1825,1826,1881,,,,,,,,,,,,,,,,,,,,,,,,,,,,,,,,,,,,,,,,,,,,,,,,,,,,,,,,
1680,1710,1733,1724,1736,1748,1753,1750,1780,1764,1777,1791,1806,1794,1822,1809,1821,1847,1736,1773,1766,1772,1789,1788,1780,1806,1792,1794,1813,1805,1820,1816,1835,1829,1831,1883,,,,,,,,,,,,,,,,,,,,,,,,,,,,,,,,,,,,,,,,,,,,,,,,,,,,,,,,
1677,1708,1731,1722,1734,1746,1751,1747,1778,1759,1774,1790,1803,1792,1822,1806,1818,1843,1734,1771,1763,1770,1786,1785,1777,1803,1790,1792,1811,1802,1818,1813,1833,1827,1828,1880,,,,,,,,,,,,,,,,,,,,,,,,,,,,,,,,,,,,,,,,,,,,,,,,,,,,,,,,
1686,1716,1740,1730,1743,1754,1759,1755,1786,1767,1786,1796,1812,1800,1827,1819,1827,1852,1743,1779,1771,1777,1794,1793,1785,1812,1798,1799,1819,1810,1826,1822,1840,1834,1836,1886,,,,,,,,,,,,,,,,,,,,,,,,,,,,,,,,,,,,,,,,,,,,,,,,,,,,,,,,
1682,1712,1735,1726,1738,1750,1754,1751,1782,1763,1779,1792,1807,1798,1823,1811,1827,1848,1738,1775,1767,1773,1789,1789,1780,1807,1794,1796,1815,1805,1822,1817,1836,1830,1831,1879,,,,,,,,,,,,,,,,,,,,,,,,,,,,,,,,,,,,,,,,,,,,,,,,,,,,,,,,
1687,1717,1740,1731,1743,1754,1759,1755,1787,1768,1783,1796,1815,1800,1828,1816,1829,1858,1743,1780,1772,1778,1794,1794,1785,1811,1798,1801,1819,1810,1826,1822,1840,1835,1836,1882,,,,,,,,,,,,,,,,,,,,,,,,,,,,,,,,,,,,,,,,,,,,,,,,,,,,,,,,
1687,1717,1740,1731,1744,1754,1759,1755,1786,1767,1783,1796,1812,1801,1827,1816,1827,1853,1743,1780,1772,1778,1794,1794,1785,1811,1798,1800,1819,1810,1826,1821,1840,1834,1836,1879,,,,,,,,,,,,,,,,,,,,,,,,,,,,,,,,,,,,,,,,,,,,,,,,,,,,,,,,
1689,1721,1744,1737,1747,1759,1762,1758,1789,1771,1786,1799,1815,1803,1831,1819,1830,1856,1745,1782,1775,1780,1797,1796,1788,1814,1801,1803,1822,1813,1829,1824,1843,1837,1837,1879,,,,,,,,,,,,,,,,,,,,,,,,,,,,,,,,,,,,,,,,,,,,,,,,,,,,,,,,
1684,1715,1738,1729,1740,1752,1756,1752,1783,1764,1780,1793,1808,1796,1824,1812,1824,1850,1739,1776,1768,1775,1791,1790,1782,1808,1794,1796,1815,1806,1822,1817,1836,1831,1831,1871,,,,,,,,,,,,,,,,,,,,,,,,,,,,,,,,,,,,,,,,,,,,,,,,,,,,,,,,
1694,1725,1748,1738,1751,1762,1766,1762,1794,1775,1790,1803,1819,1807,1835,1822,1835,1861,1750,1787,1778,1785,1801,1801,1792,1817,1804,1805,1825,1816,1831,1826,1846,1840,1841,1878,,,,,,,,,,,,,,,,,,,,,,,,,,,,,,,,,,,,,,,,,,,,,,,,,,,,,,,,
1694,1722,1745,1736,1747,1759,1763,1759,1790,1771,1787,1800,1815,1804,1831,1819,1831,1857,1746,1783,1775,1782,1798,1798,1789,1815,1801,1803,1822,1813,1829,1824,1844,1838,1838,1873,,,,,,,,,,,,,,,,,,,,,,,,,,,,,,,,,,,,,,,,,,,,,,,,,,,,,,,,
1698,1729,1752,1743,1754,1766,1771,1766,1798,1778,1794,1807,1822,1811,1838,1826,1838,1864,1752,1789,1781,1787,1804,1803,1795,1821,1808,1809,1829,1819,1836,1831,1850,1844,1845,1876,,,,,,,,,,,,,,,,,,,,,,,,,,,,,,,,,,,,,,,,,,,,,,,,,,,,,,,,
1696,1730,1750,1741,1753,1764,1769,1765,1796,1777,1792,1805,1820,1809,1836,1824,1836,1861,1751,1787,1780,1785,1802,1802,1794,1819,1805,1807,1826,1817,1833,1829,1848,1842,1843,1871,,,,,,,,,,,,,,,,,,,,,,,,,,,,,,,,,,,,,,,,,,,,,,,,,,,,,,,,
1700,1731,1754,1745,1761,1769,1774,1770,1801,1782,1797,1810,1826,1814,1841,1829,1840,1866,1754,1792,1784,1789,1806,1805,1798,1824,1810,1811,1831,1821,1837,1832,1852,1845,1846,1871,,,,,,,,,,,,,,,,,,,,,,,,,,,,,,,,,,,,,,,,,,,,,,,,,,,,,,,,
1700,1731,1757,1745,1757,1769,1774,1770,1801,1782,1796,1810,1825,1813,1840,1828,1840,1864,1754,1791,1783,1788,1805,1805,1796,1823,1809,1810,1830,1820,1837,1831,1852,1845,1845,1866,,,,,,,,,,,,,,,,,,,,,,,,,,,,,,,,,,,,,,,,,,,,,,,,,,,,,,,,
1705,1736,1760,1751,1763,1775,1782,1775,1807,1787,1802,1815,1831,1819,1846,1833,1845,1870,1759,1796,1789,1794,1811,1810,1801,1828,1814,1816,1835,1826,1843,1838,1857,1851,1852,1867,,,,,,,,,,,,,,,,,,,,,,,,,,,,,,,,,,,,,,,,,,,,,,,,,,,,,,,,
1699,1730,1753,1745,1757,1771,1773,1768,1799,1780,1795,1808,1824,1812,1838,1826,1838,1863,1752,1789,1782,1787,1805,1804,1795,1821,1807,1810,1829,1819,1836,1831,1851,1845,1845,1859,,,,,,,,,,,,,,,,,,,,,,,,,,,,,,,,,,,,,,,,,,,,,,,,,,,,,,,,
1703,1734,1757,1747,1760,1772,1776,1772,1803,1787,1798,1811,1827,1815,1843,1830,1841,1866,1757,1794,1786,1792,1809,1808,1799,1825,1811,1813,1833,1823,1840,1835,1854,1849,1850,1868,,,,,,,,,,,,,,,,,,,,,,,,,,,,,,,,,,,,,,,,,,,,,,,,,,,,,,,,
1721,1752,1776,1767,1780,1791,1795,1790,1822,1803,1818,1831,1846,1834,1861,1849,1860,1885,1778,1812,1804,1810,1827,1826,1819,1845,1831,1832,1852,1842,1859,1854,1878,1868,1870,1890,,,,,,,,,,,,,,,,,,,,,,,,,,,,,,,,,,,,,,,,,,,,,,,,,,,,,,,,
1726,1758,1781,1772,1785,1796,1801,1796,1828,1809,1824,1836,1852,1840,1867,1854,1866,1892,1779,1820,1809,1815,1831,1831,1822,1849,1835,1836,1856,1847,1864,1858,1878,1872,1873,1887,,,,,,,,,,,,,,,,,,,,,,,,,,,,,,,,,,,,,,,,,,,,,,,,,,,,,,,,
1725,1757,1780,1770,1783,1794,1799,1794,1826,1807,1822,1835,1851,1839,1866,1853,1865,1890,1778,1816,1807,1812,1830,1829,1821,1847,1833,1835,1855,1845,1863,1857,1878,1871,1873,1888,,,,,,,,,,,,,,,,,,,,,,,,,,,,,,,,,,,,,,,,,,,,,,,,,,,,,,,,
1727,1758,1781,1772,1785,1796,1801,1796,1828,1808,1823,1836,1852,1840,1866,1854,1866,1892,1779,1817,1809,1814,1831,1831,1822,1849,1835,1836,1856,1847,1864,1858,1879,1872,1873,1896,,,,,,,,,,,,,,,,,,,,,,,,,,,,,,,,,,,,,,,,,,,,,,,,,,,,,,,,
1724,1755,1778,1768,1782,1793,1797,1792,1824,1804,1819,1832,1848,1836,1864,1851,1863,1888,1775,1814,1805,1811,1828,1827,1822,1845,1831,1833,1853,1843,1861,1854,1876,1869,1871,1895,,,,,,,,,,,,,,,,,,,,,,,,,,,,,,,,,,,,,,,,,,,,,,,,,,,,,,,,
1721,1752,1775,1766,1778,1790,1794,1789,1821,1801,1817,1829,1845,1833,1860,1847,1859,1885,1773,1811,1805,1808,1825,1824,1816,1843,1829,1830,1850,1840,1858,1852,1873,1866,1868,1896,,,,,,,,,,,,,,,,,,,,,,,,,,,,,,,,,,,,,,,,,,,,,,,,,,,,,,,,
1724,1754,1778,1768,1781,1793,1797,1792,1824,1805,1819,1833,1849,1837,1864,1852,1864,1888,1777,1814,1805,1813,1827,1826,1819,1845,1831,1833,1854,1844,1861,1856,1876,1870,1871,1903,,,,,,,,,,,,,,,,,,,,,,,,,,,,,,,,,,,,,,,,,,,,,,,,,,,,,,,,
1696,1728,1750,1741,1754,1765,1769,1764,1796,1778,1792,1805,1821,1809,1836,1823,1835,1859,1751,1788,1780,1785,1802,1804,1793,1819,1805,1808,1826,1817,1834,1829,1850,1843,1844,1878,,,,,,,,,,,,,,,,,,,,,,,,,,,,,,,,,,,,,,,,,,,,,,,,,,,,,,,,
1694,1726,1749,1739,1752,1763,1768,1762,1794,1775,1790,1803,1819,1807,1834,1822,1833,1859,1750,1787,1778,1783,1803,1799,1791,1817,1803,1805,1825,1815,1833,1827,1847,1841,1843,1879,,,,,,,,,,,,,,,,,,,,,,,,,,,,,,,,,,,,,,,,,,,,,,,,,,,,,,,,
1693,1724,1747,1737,1750,1761,1766,1761,1792,1773,1789,1801,1817,1805,1832,1819,1831,1857,1748,1785,1777,1782,1798,1798,1789,1815,1802,1807,1824,1815,1831,1826,1846,1840,1840,1880,,,,,,,,,,,,,,,,,,,,,,,,,,,,,,,,,,,,,,,,,,,,,,,,,,,,,,,,
1695,1726,1750,1740,1752,1764,1768,1763,1794,1776,1791,1803,1819,1808,1834,1822,1833,1859,1750,1787,1778,1784,1801,1801,1792,1818,1808,1806,1826,1817,1834,1829,1849,1843,1844,1886,,,,,,,,,,,,,,,,,,,,,,,,,,,,,,,,,,,,,,,,,,,,,,,,,,,,,,,,
1690,1721,1743,1734,1747,1758,1762,1757,1789,1771,1785,1798,1813,1802,1828,1816,1828,1852,1745,1782,1774,1779,1796,1796,1788,1817,1800,1802,1822,1812,1829,1824,1844,1838,1839,1882,,,,,,,,,,,,,,,,,,,,,,,,,,,,,,,,,,,,,,,,,,,,,,,,,,,,,,,,
1691,1722,1744,1735,1747,1759,1763,1759,1790,1772,1787,1799,1815,1803,1830,1817,1829,1854,1747,1783,1775,1780,1798,1797,1789,1815,1802,1803,1823,1817,1835,1826,1845,1839,1840,1887,,,,,,,,,,,,,,,,,,,,,,,,,,,,,,,,,,,,,,,,,,,,,,,,,,,,,,,,
1685,1715,1738,1730,1742,1753,1758,1753,1785,1766,1781,1794,1809,1798,1824,1812,1824,1849,1741,1778,1770,1775,1792,1792,1783,1810,1796,1798,1820,1808,1825,1820,1840,1833,1839,1882,,,,,,,,,,,,,,,,,,,,,,,,,,,,,,,,,,,,,,,,,,,,,,,,,,,,,,,,
1686,1717,1740,1731,1743,1754,1759,1754,1785,1767,1782,1794,1810,1798,1825,1812,1824,1850,1743,1780,1771,1777,1794,1793,1785,1810,1797,1798,1819,1810,1827,1824,1846,1836,1837,1886,,,,,,,,,,,,,,,,,,,,,,,,,,,,,,,,,,,,,,,,,,,,,,,,,,,,,,,,
1683,1713,1736,1726,1738,1750,1754,1749,1780,1762,1777,1789,1805,1794,1820,1808,1819,1845,1739,1776,1768,1773,1790,1789,1781,1806,1794,1795,1815,1807,1824,1818,1838,1836,1833,1888,,,,,,,,,,,,,,,,,,,,,,,,,,,,,,,,,,,,,,,,,,,,,,,,,,,,,,,,
1680,1710,1733,1724,1736,1747,1752,1747,1778,1760,1774,1787,1803,1792,1817,1805,1817,1843,1736,1773,1765,1771,1788,1787,1779,1804,1791,1793,1813,1804,1821,1815,1836,1830,1831,1883,,,,,,,,,,,,,,,,,,,,,,,,,,,,,,,,,,,,,,,,,,,,,,,,,,,,,,,,
1673,1702,1724,1716,1728,1740,1744,1740,1771,1752,1767,1780,1795,1784,1810,1798,1810,1835,1729,1766,1758,1766,1781,1780,1772,1798,1784,1786,1805,1797,1813,1808,1829,1823,1824,1878,,,,,,,,,,,,,,,,,,,,,,,,,,,,,,,,,,,,,,,,,,,,,,,,,,,,,,,,
1668,1698,1721,1712,1724,1736,1740,1736,1767,1749,1764,1776,1792,1780,1807,1795,1807,1831,1729,1763,1754,1759,1777,1776,1768,1794,1780,1782,1802,1793,1810,1804,1824,1819,1820,1875,,,,,,,,,,,,,,,,,,,,,,,,,,,,,,,,,,,,,,,,,,,,,,,,,,,,,,,,
1670,1701,1724,1715,1727,1739,1743,1738,1769,1752,1766,1780,1794,1783,1809,1798,1810,1834,1729,1766,1758,1763,1780,1779,1771,1796,1783,1785,1805,1796,1812,1808,1828,1822,1823,1880,,,,,,,,,,,,,,,,,,,,,,,,,,,,,,,,,,,,,,,,,,,,,,,,,,,,,,,,
1671,1701,1724,1715,1727,1739,1743,1739,1770,1753,1767,1780,1795,1783,1809,1798,1810,1835,1729,1766,1759,1764,1780,1779,1771,1796,1783,1785,1805,1796,1814,1808,1829,1822,1824,1882,,,,,,,,,,,,,,,,,,,,,,,,,,,,,,,,,,,,,,,,,,,,,,,,,,,,,,,,
1666,1696,1718,1709,1721,1733,1738,1733,1764,1747,1761,1775,1789,1778,1803,1792,1805,1829,1725,1761,1753,1758,1775,1774,1766,1791,1778,1779,1799,1791,1808,1803,1824,1817,1819,1878,,,,,,,,,,,,,,,,,,,,,,,,,,,,,,,,,,,,,,,,,,,,,,,,,,,,,,,,
1667,1697,1719,1710,1722,1734,1738,1734,1765,1747,1763,1776,1792,1780,1805,1794,1806,1831,1726,1766,1754,1760,1777,1775,1767,1792,1779,1780,1801,1792,1810,1805,1826,1819,1822,1881,,,,,,,,,,,,,,,,,,,,,,,,,,,,,,,,,,,,,,,,,,,,,,,,,,,,,,,,
1664,1694,1716,1708,1719,1731,1736,1731,1762,1745,1760,1773,1789,1776,1802,1791,1803,1829,1724,1761,1755,1757,1775,1773,1765,1790,1776,1778,1798,1789,1808,1803,1824,1817,1819,1880,,,,,,,,,,,,,,,,,,,,,,,,,,,,,,,,,,,,,,,,,,,,,,,,,,,,,,,,
1664,1695,1717,1708,1719,1731,1736,1731,1763,1746,1760,1773,1788,1777,1803,1792,1804,1829,1724,1761,1753,1759,1775,1774,1768,1791,1778,1778,1798,1791,1808,1803,1824,1819,1821,1882,,,,,,,,,,,,,,,,,,,,,,,,,,,,,,,,,,,,,,,,,,,,,,,,,,,,,,,,
1653,1684,1705,1698,1709,1721,1725,1721,1752,1735,1749,1762,1777,1766,1792,1780,1792,1817,1715,1751,1743,1748,1766,1764,1756,1780,1768,1772,1789,1780,1797,1793,1814,1808,1811,1876,,,,,,,,,,,,,,,,,,,,,,,,,,,,,,,,,,,,,,,,,,,,,,,,,,,,,,,,
1649,1677,1699,1690,1702,1714,1718,1714,1745,1728,1741,1754,1769,1758,1784,1772,1784,1808,1707,1743,1736,1741,1758,1760,1750,1775,1762,1764,1783,1775,1792,1787,1808,1803,1807,1877,,,,,,,,,,,,,,,,,,,,,,,,,,,,,,,,,,,,,,,,,,,,,,,,,,,,,,,,
1647,1679,1698,1689,1701,1712,1716,1712,1742,1725,1738,1750,1765,1753,1779,1767,1778,1801,1701,1737,1729,1734,1750,1748,1740,1765,1751,1751,1769,1763,1778,1769,1788,1781,1785,1862,,,,,,,,,,,,,,,,,,,,,,,,,,,,,,,,,,,,,,,,,,,,,,,,,,,,,,,,
special_raw_delta,,,,,,,,,,,,,,,,,,,,,,,,,,,,,,,,,,,,,,,,,,,,,,,,,,,,,,,,,,,,,,,,,,,,,,,,,,,,,,,,,,,,,,,,,,,
300,300,300,300,300,300,300,300,300,300,300,300,300,300,300,300,300,300,300,300,300,300,300,300,300,300,300,300,300,300,300,300,300,300,300,300,,,,,,,,,,,,,,,,,,,,,,,,,,,,,,,,,,,,,,,,,,,,,,,,,,,,,,,,
300,300,300,300,300,300,300,300,300,300,300,300,300,300,300,300,300,300,300,300,300,300,300,300,300,300,300,300,300,300,300,300,300,300,300,300,,,,,,,,,,,,,,,,,,,,,,,,,,,,,,,,,,,,,,,,,,,,,,,,,,,,,,,,
300,300,300,300,300,300,300,300,300,300,300,300,300,300,300,300,300,300,300,300,300,300,300,300,300,300,300,300,300,300,300,300,300,300,300,300,,,,,,,,,,,,,,,,,,,,,,,,,,,,,,,,,,,,,,,,,,,,,,,,,,,,,,,,
300,300,300,300,300,300,300,300,300,300,300,300,300,300,300,300,300,300,300,300,300,300,300,300,300,300,300,300,300,300,300,300,300,300,300,300,,,,,,,,,,,,,,,,,,,,,,,,,,,,,,,,,,,,,,,,,,,,,,,,,,,,,,,,
300,300,300,300,300,300,300,300,300,300,300,300,300,300,300,300,300,300,300,300,300,300,300,300,300,300,300,300,300,300,300,300,300,300,300,300,,,,,,,,,,,,,,,,,,,,,,,,,,,,,,,,,,,,,,,,,,,,,,,,,,,,,,,,
300,300,300,300,300,300,300,300,300,300,300,300,300,300,300,300,300,300,300,300,300,300,300,300,300,300,300,300,300,300,300,300,300,300,300,300,,,,,,,,,,,,,,,,,,,,,,,,,,,,,,,,,,,,,,,,,,,,,,,,,,,,,,,,
300,300,300,300,300,300,300,300,300,300,300,300,300,300,300,300,300,300,300,300,300,300,300,300,300,300,300,300,300,300,300,300,300,300,300,300,,,,,,,,,,,,,,,,,,,,,,,,,,,,,,,,,,,,,,,,,,,,,,,,,,,,,,,,
300,300,300,300,300,300,300,300,300,300,300,300,300,300,300,300,300,300,300,300,300,300,300,300,300,300,300,300,300,300,300,300,300,300,300,300,,,,,,,,,,,,,,,,,,,,,,,,,,,,,,,,,,,,,,,,,,,,,,,,,,,,,,,,
300,300,300,300,300,300,300,300,300,300,300,300,300,300,300,300,300,300,300,300,300,300,300,300,300,300,300,300,300,300,300,300,300,300,300,300,,,,,,,,,,,,,,,,,,,,,,,,,,,,,,,,,,,,,,,,,,,,,,,,,,,,,,,,
300,300,300,300,300,300,300,300,300,300,300,300,300,300,300,300,300,300,300,300,300,300,300,300,300,300,300,300,300,300,300,300,300,300,300,300,,,,,,,,,,,,,,,,,,,,,,,,,,,,,,,,,,,,,,,,,,,,,,,,,,,,,,,,
300,300,300,300,300,300,300,300,300,300,300,300,300,300,300,300,300,300,300,300,300,300,300,300,300,300,300,300,300,300,300,300,300,300,300,300,,,,,,,,,,,,,,,,,,,,,,,,,,,,,,,,,,,,,,,,,,,,,,,,,,,,,,,,
300,300,300,300,300,300,300,300,300,300,300,300,300,300,300,300,300,300,300,300,300,300,300,300,300,300,300,300,300,300,300,300,300,300,300,300,,,,,,,,,,,,,,,,,,,,,,,,,,,,,,,,,,,,,,,,,,,,,,,,,,,,,,,,
300,300,300,300,300,300,300,300,300,300,300,300,300,300,300,300,300,300,300,300,300,300,300,300,300,300,300,300,300,300,300,300,300,300,300,300,,,,,,,,,,,,,,,,,,,,,,,,,,,,,,,,,,,,,,,,,,,,,,,,,,,,,,,,
300,300,300,300,300,300,300,300,300,300,300,300,300,300,300,300,300,300,300,300,300,300,300,300,300,300,300,300,300,300,300,300,300,300,300,300,,,,,,,,,,,,,,,,,,,,,,,,,,,,,,,,,,,,,,,,,,,,,,,,,,,,,,,,
300,300,300,300,300,300,300,300,300,300,300,300,300,300,300,300,300,300,300,300,300,300,300,300,300,300,300,300,300,300,300,300,300,300,300,300,,,,,,,,,,,,,,,,,,,,,,,,,,,,,,,,,,,,,,,,,,,,,,,,,,,,,,,,
300,300,300,300,300,300,300,300,300,300,300,300,300,300,300,300,300,300,300,300,300,300,300,300,300,300,300,300,300,300,300,300,300,300,300,300,,,,,,,,,,,,,,,,,,,,,,,,,,,,,,,,,,,,,,,,,,,,,,,,,,,,,,,,
300,300,300,300,300,300,300,300,300,300,300,300,300,300,300,300,300,300,300,300,300,300,300,300,300,300,300,300,300,300,300,300,300,300,300,300,,,,,,,,,,,,,,,,,,,,,,,,,,,,,,,,,,,,,,,,,,,,,,,,,,,,,,,,
300,300,300,300,300,300,300,300,300,300,300,300,300,300,300,300,300,300,300,300,300,300,300,300,300,300,300,300,300,300,300,300,300,300,300,300,,,,,,,,,,,,,,,,,,,,,,,,,,,,,,,,,,,,,,,,,,,,,,,,,,,,,,,,
300,300,300,300,300,300,300,300,300,300,300,300,300,300,300,300,300,300,300,300,300,300,300,300,300,300,300,300,300,300,300,300,300,300,300,300,,,,,,,,,,,,,,,,,,,,,,,,,,,,,,,,,,,,,,,,,,,,,,,,,,,,,,,,
300,300,300,300,300,300,300,300,300,300,300,300,300,300,300,300,300,300,300,300,300,300,300,300,300,300,300,300,300,300,300,300,300,300,300,300,,,,,,,,,,,,,,,,,,,,,,,,,,,,,,,,,,,,,,,,,,,,,,,,,,,,,,,,
300,300,300,300,300,300,300,300,300,300,300,300,300,300,300,300,300,300,300,300,300,300,300,300,300,300,300,300,300,300,300,300,300,300,300,300,,,,,,,,,,,,,,,,,,,,,,,,,,,,,,,,,,,,,,,,,,,,,,,,,,,,,,,,
300,300,300,300,300,300,300,300,300,300,300,300,300,300,300,300,300,300,300,300,300,300,300,300,300,300,300,300,300,300,300,300,300,300,300,300,,,,,,,,,,,,,,,,,,,,,,,,,,,,,,,,,,,,,,,,,,,,,,,,,,,,,,,,
300,300,300,300,300,300,300,300,300,300,300,300,300,300,300,300,300,300,300,300,300,300,300,300,300,300,300,300,300,300,300,300,300,300,300,300,,,,,,,,,,,,,,,,,,,,,,,,,,,,,,,,,,,,,,,,,,,,,,,,,,,,,,,,
300,300,300,300,300,300,300,300,300,300,300,300,300,300,300,300,300,300,300,300,300,300,300,300,300,300,300,300,300,300,300,300,300,300,300,300,,,,,,,,,,,,,,,,,,,,,,,,,,,,,,,,,,,,,,,,,,,,,,,,,,,,,,,,
300,300,300,300,300,300,300,300,300,300,300,300,300,300,300,300,300,300,300,300,300,300,300,300,300,300,300,300,300,300,300,300,300,300,300,300,,,,,,,,,,,,,,,,,,,,,,,,,,,,,,,,,,,,,,,,,,,,,,,,,,,,,,,,
300,300,300,300,300,300,300,300,300,300,300,300,300,300,300,300,300,300,300,300,300,300,300,300,300,300,300,300,300,300,300,300,300,300,300,300,,,,,,,,,,,,,,,,,,,,,,,,,,,,,,,,,,,,,,,,,,,,,,,,,,,,,,,,
300,300,300,300,300,300,300,300,300,300,300,300,300,300,300,300,300,300,300,300,300,300,300,300,300,300,300,300,300,300,300,300,300,300,300,300,,,,,,,,,,,,,,,,,,,,,,,,,,,,,,,,,,,,,,,,,,,,,,,,,,,,,,,,
300,300,300,300,300,300,300,300,300,300,300,300,300,300,300,300,300,300,300,300,300,300,300,300,300,300,300,300,300,300,300,300,300,300,300,300,,,,,,,,,,,,,,,,,,,,,,,,,,,,,,,,,,,,,,,,,,,,,,,,,,,,,,,,
300,300,300,300,300,300,300,300,300,300,300,300,300,300,300,300,300,300,300,300,300,300,300,300,300,300,300,300,300,300,300,300,300,300,300,300,,,,,,,,,,,,,,,,,,,,,,,,,,,,,,,,,,,,,,,,,,,,,,,,,,,,,,,,
300,300,300,300,300,300,300,300,300,300,300,300,300,300,300,300,300,300,300,300,300,300,300,300,300,300,300,300,300,300,300,300,300,300,300,300,,,,,,,,,,,,,,,,,,,,,,,,,,,,,,,,,,,,,,,,,,,,,,,,,,,,,,,,
300,300,300,300,300,300,300,300,300,300,300,300,300,300,300,300,300,300,300,300,300,300,300,300,300,300,300,300,300,300,300,300,300,300,300,300,,,,,,,,,,,,,,,,,,,,,,,,,,,,,,,,,,,,,,,,,,,,,,,,,,,,,,,,
300,300,300,300,300,300,300,300,300,300,300,300,300,300,300,300,300,300,300,300,300,300,300,300,300,300,300,300,300,300,300,300,300,300,300,300,,,,,,,,,,,,,,,,,,,,,,,,,,,,,,,,,,,,,,,,,,,,,,,,,,,,,,,,
300,300,300,300,300,300,300,300,300,300,300,300,300,300,300,300,300,300,300,300,300,300,300,300,300,300,300,300,300,300,300,300,300,300,300,300,,,,,,,,,,,,,,,,,,,,,,,,,,,,,,,,,,,,,,,,,,,,,,,,,,,,,,,,
300,300,300,300,300,300,300,300,300,300,300,300,300,300,300,300,300,300,300,300,300,300,300,300,300,300,300,300,300,300,300,300,300,300,300,300,,,,,,,,,,,,,,,,,,,,,,,,,,,,,,,,,,,,,,,,,,,,,,,,,,,,,,,,
300,300,300,300,300,300,300,300,300,300,300,300,300,300,300,300,300,300,300,300,300,300,300,300,300,300,300,300,300,300,300,300,300,300,300,300,,,,,,,,,,,,,,,,,,,,,,,,,,,,,,,,,,,,,,,,,,,,,,,,,,,,,,,,
300,300,300,300,300,300,300,300,300,300,300,300,300,300,300,300,300,300,300,300,300,300,300,300,300,300,300,300,300,300,300,300,300,300,300,300,,,,,,,,,,,,,,,,,,,,,,,,,,,,,,,,,,,,,,,,,,,,,,,,,,,,,,,,
300,300,300,300,300,300,300,300,300,300,300,300,300,300,300,300,300,300,300,300,300,300,300,300,300,300,300,300,300,300,300,300,300,300,300,300,,,,,,,,,,,,,,,,,,,,,,,,,,,,,,,,,,,,,,,,,,,,,,,,,,,,,,,,
300,300,300,300,300,300,300,300,300,300,300,300,300,300,300,300,300,300,300,300,300,300,300,300,300,300,300,300,300,300,300,300,300,300,300,300,,,,,,,,,,,,,,,,,,,,,,,,,,,,,,,,,,,,,,,,,,,,,,,,,,,,,,,,
300,300,300,300,300,300,300,300,300,300,300,300,300,300,300,300,300,300,300,300,300,300,300,300,300,300,300,300,300,300,300,300,300,300,300,300,,,,,,,,,,,,,,,,,,,,,,,,,,,,,,,,,,,,,,,,,,,,,,,,,,,,,,,,
300,300,300,300,300,300,300,300,300,300,300,300,300,300,300,300,300,300,300,300,300,300,300,300,300,300,300,300,300,300,300,300,300,300,300,300,,,,,,,,,,,,,,,,,,,,,,,,,,,,,,,,,,,,,,,,,,,,,,,,,,,,,,,,
300,300,300,300,300,300,300,300,300,300,300,300,300,300,300,300,300,300,300,300,300,300,300,300,300,300,300,300,300,300,300,300,300,300,300,300,,,,,,,,,,,,,,,,,,,,,,,,,,,,,,,,,,,,,,,,,,,,,,,,,,,,,,,,
300,300,300,300,300,300,300,300,300,300,300,300,300,300,300,300,300,300,300,300,300,300,300,300,300,300,300,300,300,300,300,300,300,300,300,300,,,,,,,,,,,,,,,,,,,,,,,,,,,,,,,,,,,,,,,,,,,,,,,,,,,,,,,,
300,300,300,300,300,300,300,300,300,300,300,300,300,300,300,300,300,300,300,300,300,300,300,300,300,300,300,300,300,300,300,300,300,300,300,300,,,,,,,,,,,,,,,,,,,,,,,,,,,,,,,,,,,,,,,,,,,,,,,,,,,,,,,,
300,300,300,300,300,300,300,300,300,300,300,300,300,300,300,300,300,300,300,300,300,300,300,300,300,300,300,300,300,300,300,300,300,300,300,300,,,,,,,,,,,,,,,,,,,,,,,,,,,,,,,,,,,,,,,,,,,,,,,,,,,,,,,,
300,300,300,300,300,300,300,300,300,300,300,300,300,300,300,300,300,300,300,300,300,300,300,300,300,300,300,300,300,300,300,300,300,300,300,300,,,,,,,,,,,,,,,,,,,,,,,,,,,,,,,,,,,,,,,,,,,,,,,,,,,,,,,,
300,300,300,300,300,300,300,300,300,300,300,300,300,300,300,300,300,300,300,300,300,300,300,300,300,300,300,300,300,300,300,300,300,300,300,300,,,,,,,,,,,,,,,,,,,,,,,,,,,,,,,,,,,,,,,,,,,,,,,,,,,,,,,,
300,300,300,300,300,300,300,300,300,300,300,300,300,300,300,300,300,300,300,300,300,300,300,300,300,300,300,300,300,300,300,300,300,300,300,300,,,,,,,,,,,,,,,,,,,,,,,,,,,,,,,,,,,,,,,,,,,,,,,,,,,,,,,,
300,300,300,300,300,300,300,300,300,300,300,300,300,300,300,300,300,300,300,300,300,300,300,300,300,300,300,300,300,300,300,300,300,300,300,300,,,,,,,,,,,,,,,,,,,,,,,,,,,,,,,,,,,,,,,,,,,,,,,,,,,,,,,,
300,300,300,300,300,300,300,300,300,300,300,300,300,300,300,300,300,300,300,300,300,300,300,300,300,300,300,300,300,300,300,300,300,300,300,300,,,,,,,,,,,,,,,,,,,,,,,,,,,,,,,,,,,,,,,,,,,,,,,,,,,,,,,,
300,300,300,300,300,300,300,300,300,300,300,300,300,300,300,300,300,300,300,300,300,300,300,300,300,300,300,300,300,300,300,300,300,300,300,300,,,,,,,,,,,,,,,,,,,,,,,,,,,,,,,,,,,,,,,,,,,,,,,,,,,,,,,,
300,300,300,300,300,300,300,300,300,300,300,300,300,300,300,300,300,300,300,300,300,300,300,300,300,300,300,300,300,300,300,300,300,300,300,300,,,,,,,,,,,,,,,,,,,,,,,,,,,,,,,,,,,,,,,,,,,,,,,,,,,,,,,,
300,300,300,300,300,300,300,300,300,300,300,300,300,300,300,300,300,300,300,300,300,300,300,300,300,300,300,300,300,300,300,300,300,300,300,300,,,,,,,,,,,,,,,,,,,,,,,,,,,,,,,,,,,,,,,,,,,,,,,,,,,,,,,,
300,300,300,300,300,300,300,300,300,300,300,300,300,300,300,300,300,300,300,300,300,300,300,300,300,300,300,300,300,300,300,300,300,300,300,300,,,,,,,,,,,,,,,,,,,,,,,,,,,,,,,,,,,,,,,,,,,,,,,,,,,,,,,,
300,300,300,300,300,300,300,300,300,300,300,300,300,300,300,300,300,300,300,300,300,300,300,300,300,300,300,300,300,300,300,300,300,300,300,300,,,,,,,,,,,,,,,,,,,,,,,,,,,,,,,,,,,,,,,,,,,,,,,,,,,,,,,,
300,300,300,300,300,300,300,300,300,300,300,300,300,300,300,300,300,300,300,300,300,300,300,300,300,300,300,300,300,300,300,300,300,300,300,300,,,,,,,,,,,,,,,,,,,,,,,,,,,,,,,,,,,,,,,,,,,,,,,,,,,,,,,,
300,300,300,300,300,300,300,300,300,300,300,300,300,300,300,300,300,300,300,300,300,300,300,300,300,300,300,300,300,300,300,300,300,300,300,300,,,,,,,,,,,,,,,,,,,,,,,,,,,,,,,,,,,,,,,,,,,,,,,,,,,,,,,,
unified_selfraw_limit,,,,,,,,,,,,,,,,,,,,,,,,,,,,,,,,,,,,,,,,,,,,,,,,,,,,,,,,,,,,,,,,,,,,,,,,,,,,,,,,,,,,,,,,,,,
99999,100,,,,,,,,,,,,,,,,,,,,,,,,,,,,,,,,,,,,,,,,,,,,,,,,,,,,,,,,,,,,,,,,,,,,,,,,,,,,,,,,,,,,,,,,,,
noise_selfdata_limit,,,,,,,,,,,,,,,,,,,,,,,,,,,,,,,,,,,,,,,,,,,,,,,,,,,,,,,,,,,,,,,,,,,,,,,,,,,,,,,,,,,,,,,,,,,
500,,,,,,,,,,,,,,,,,,,,,,,,,,,,,,,,,,,,,,,,,,,,,,,,,,,,,,,,,,,,,,,,,,,,,,,,,,,,,,,,,,,,,,,,,,,
special_selfraw_max,,,,,,,,,,,,,,,,,,,,,,,,,,,,,,,,,,,,,,,,,,,,,,,,,,,,,,,,,,,,,,,,,,,,,,,,,,,,,,,,,,,,,,,,,,,
17500,17528,17402,17951,17822,18329,17698,18459,17617,18050,17903,18320,17789,18371,17914,18337,18268,18472,18146,18702,18304,18434,17744,18288,17651,17716,16009,16380,17000,15000,14816,14620,14888,14535,15052,14888,14911,14242,14704,14126,14391,14481,14652,13882,14728,13874,14405,14008,14123,13784,14087,13507,13885,13500,13000,13000,12000,12000,12000,12000,12000,12000,12000,12000,12000,12000,12000,12000,12000,12000,12000,12000,12000,12000,12000,12000,12497,12355,12497,12379,12568,12726,12931,12796,13019,12726,12762,12654,12692,12710,12425,13000
special_selfraw_min,,,,,,,,,,,,,,,,,,,,,,,,,,,,,,,,,,,,,,,,,,,,,,,,,,,,,,,,,,,,,,,,,,,,,,,,,,,,,,,,,,,,,,,,,,,
100,600,600,600,600,600,600,600,600,600,600,600,600,600,600,600,600,600,600,600,600,600,600,600,600,600,600,400,200,400,600,600,600,600,600,600,600,600,600,600,600,600,600,600,600,600,600,600,600,600,600,600,600,600,60,60,100,400,400,400,400,400,400,400,400,400,400,400,400,400,400,400,400,200,400,400,400,400,400,400,400,400,400,400,400,400,400,400,400,400,400,100
