[
  {
    "color": [
      1,
      1,
      1
    ],
    "ignore_ext_mv": true,
    "intensity_diff": 60,
    "intensity_spec": 0,
    "ltc_two_sided": true,
    "name": "key",
    "onnoff": true,
    "rel_rot": [
      -0.58403831720352173,
      -0.11647713929414749,
      0
    ],
    "rel_scale": [
      2,
      1
    ],
    "rel_trans": [
      -0.87255358695983887,
      4.9625759124755859,
      7.4573116302490234
    ],
    "shadow_cast": true,
    "type": "AREA"
  },
  {
    "color": [
      0.70990538597106934,
      0.70990216732025146,
      0.70990216732025146
    ],
    "ignore_ext_mv": true,
    "intensity_diff": 10,
    "intensity_spec": 0,
    "ltc_two_sided": true,
    "name": "fill",
    "onnoff": false,
    "rel_rot": [
      0,
      0.90986084938049316,
      5
    ],
    "rel_scale": [
      2,
      2
    ],
    "rel_trans": [
      2.5720000267028809,
      0,
      2
    ],
    "shadow_cast": false,
    "type": "AREA"
  },
  {
    "color": [
      0.70990538597106934,
      0.70990216732025146,
      0.70990216732025146
    ],
    "ignore_ext_mv": true,
    "intensity_diff": 10,
    "intensity_spec": 0.10000000149011612,
    "ltc_two_sided": true,
    "name": "back",
    "onnoff": false,
    "rel_rot": [
      0,
      -0.90986084938049316,
      0
    ],
    "rel_scale": [
      1,
      1
    ],
    "rel_trans": [
      -2.5720000267028809,
      0,
      2
    ],
    "shadow_cast": false,
    "type": "AREA"
  }
]
