{
	"centerX" : 0.5,
	"centerY" : 0.5,
	"angle" : 0,
	"scale" : 1,
	"width" : 286,
	"height" : 110,
	"contents" : [{
			"type" : "image",
			"resource" : {
				"type" : "static",
				"path" : "res/today.png"
			},
			"centerX" : 0.4,
			"centerY" : 0.281,
			"width" : 196,
			"height" : 62,
			"angle" : 0,
			"zorder" : 1
		},
		{
			"type" : "image",
			"resource":{
                "type":"dynamic",
                "resKey":"{eee}",
                "resources":[
                    {
                        "key":"1",
                        "path":"res/sun.png"
                    },
                    {
                        "key":"2",
                        "path":"res/monday.png"
					},
					{
                        "key":"3",
                        "path":"res/tuesday.png"
                    },
                    {
                        "key":"4",
                        "path":"res/wednesday.png"
                    },{
                        "key":"5",
                        "path":"res/thu.png"
                    },
                    {
                        "key":"6",
                        "path":"res/fri.png"
                    },
                    {
                        "key":"7",
                        "path":"res/sat.png"
                    }
                ]
            },
			"centerX" : 0.63,
			"centerY" : 0.809,
			"width" : 212,
			"height" : 42,
			"angle" : 0,
			"zorder" : 1
		}
	]
}
