{
    "cameraCopybitSupportFormat": [
        "CAMERA_FORMAT_STANDARD_YCBCR_422_I",
        "CAMERA_FORMAT_STANDARD_YCRCB_420_SP",
        "CAMERA_FORMAT_CUSTOM_YCBCR_420_SP",
        "CAMERA_FORMAT_STANDARD_YCBCR_420_888",
        "CAMERA_FORMAT_STANDARD_RGBA_8888"
    ],
    "cameraDefaultOutFormat": "CAMERA_FORMAT_CUSTOM_YCBCR_420_SP",
    "cameraGpuCopybitCapability": [
        "GPU_SCALE_SUPPORTED",
        "GPU_ROTATE_SUPPORTED"
    ],
    "useSoftcopy": 0,
    "limited" : {
        "srcLimited" : 3072,
        "maxRatio" : 6,
        "midRatio" : 4
    }
}
