{
    "ProcessorList": {
        "WarpPostEisTnrProcessor": {},
        "WarpPostTnrProcessor": {},
        "WarpDsPostProcessor": {}
    },
    "ProcessorGraphList": {
        "GRAPH_EIS": {
            "WarpPostEisTnrProcessor": {}
        },
        "GRAPH_TNR": {
            "WarpPostTnrProcessor": {}
        },
        "GRAPH_EISAUTO": {
            "WarpPostEisTnrProcessor": {},
            "WarpPostTnrProcessor": {}
        },
        "GRAPH_PIP": {
            "WarpDsPostProcessor": {}
        }
    }
}
