[
    "PPRawControl",
    "TofControl",
    "SingleUnifySeekControl",
    "SeamlessControl",
    "StartCaptureCmdControl",
    "CaptureManualAeControl",
    "CaptureManualAfControl",
    "TorchFlashControl",
    "DropBufferControl",
    "SeekBufferControl",
    "SensorHdrControl",
    "SyncBufferControl",
    "LockBufferControl",
    "ValidityCheckControl",
    "AfBigDataControl",
    "FocusControl",
    "FbdControl",
    "DisableHotplugControl",
    "ReprocessPerfControl"
]
