{
    "ProcessorList": {
        "DmapDisparityPreviewProcessor": {}
    },
    "ProcessorGraphList": {
        "DmapDisparityPreviewProcessor": {
            "DmapDisparityPreviewProcessor": {}
        }
    }
}
