{
    "install_list" : [
        {
            "app_dir" : "/system/app/ohos.global.systemres",
            "removable" : false
        },
        {
            "app_dir" : "/system/app/com.ohos.nweb",
            "removable" : false
        },
        {
            "app_dir" : "/system/app/huaweishareproxy",
            "removable" : false
        },
        {
            "app_dir": "/system/app/com.ohos.formrenderservice",
            "removable": false
        }
    ]
}
