{
    "initialRules": [
        {
            "input": {
                "curStateType": "DeviceStateType::POWER_UP"
            }
        }
    ],
    "breakRules": [
        {
            "input": {
                "curStateType": "DeviceStateType::START_UP_FINISH"
            }
        }
    ],
    "finishRules": [
        {
            "input": {
                "curStateType": "DeviceStateType::START_UP_FINISH"
            }
        }
    ],
    "transferRules": [
        {
            "input": {
                "scheduleStep": "HardwareScheduleStep::FIRST_START_UP",
                "curStateType": "DeviceStateType::POWER_UP"
            },
            "output": {
                "dstStateType": "DeviceStateType::START_UP_FINISH"
            }
        }
    ]
}
