{
	"centerX" : 0.5,
	"centerY" : 0.5,
	"angle" : 0,
	"scale" : 1,
	"width" : 150,
	"height" : 82,
	"contents" : [{
			"type" : "image",
			"resource" : {
				"type" : "static",
				"path" : "res/smile.png"
			},
			"centerX" : 0.5,
			"centerY" : 0.5,
			"width" : 150,
			"height" : 82,
			"angle" : 0,
			"zorder" : 1
		}
	]
}
