{
  "ambient_brightness_scale": 1.1499999761581421,
  "ambient_integrate_first": false,
  "ambient_saturation_scale": 0.89999997615814209,
  "ambient_shadow_brightness_scale": 0.85000002384185791,
  "ambient_shadow_saturation_scale": 1.1000000238418579,
  "auxnormal_distort_scale": 0.69999998807907104,
  "bg_color_temp": 7500,
  "bg_grayscale": false,
  "cameras": [
    {
      "ext_rot": [
        0,
        0,
        0
      ],
      "eye": [
        0,
        0,
        10000
      ],
      "fov": 45,
      "look_at": [
        0,
        0,
        0
      ],
      "name": "Primary",
      "ortho_scale": 1,
      "perspective": false,
      "up": [
        0,
        1,
        0
      ]
    },
    {
      "ext_rot": [
        0,
        0,
        0
      ],
      "eye": [
        0,
        0,
        10000
      ],
      "fov": 45,
      "look_at": [
        0,
        0,
        0
      ],
      "name": "Secondary",
      "ortho_scale": 1,
      "perspective": true,
      "up": [
        0,
        1,
        0
      ]
    }
  ],
  "compmask_close_scale": 0.039999999105930328,
  "compmask_close_scale_feather": 0.10000000149011612,
  "compmask_dist_blur_scale": -1,
  "compmask_feat_label_blur_scale": 1,
  "compmask_simple_blur_scale": 0.070000000298023224,
  "compmask_simple_blur_scale_feather": 0.20000000298023224,
  "eye_alpha_threshold": 0.11999999731779099,
  "eyeball_radius_scale": 2.5,
  "freq_kernel_scale": 0.0099999997764825821,
  "ignore_pupil_normal": true,
  "is_huawei_depth": false,
  "light_filenames": [
    ".\/lights\/light-blind.json"
  ],
  "mtl_filenames": [
    ".\/materials\/face-type-b.dat"
  ],
  "n_max_faces": -1,
  "overwrite_bg_normal": true,
  "overwrite_eyeball_normal": true,
  "post_bg_blur_width": 0.079999998211860657,
  "post_bg_color": [
    0.58823525905609131,
    0.58822935819625854,
    0.58822935819625854
  ],
  "post_bg_color2": [
    0.58823525905609131,
    0.58822935819625854,
    0.58822935819625854
  ],
  "post_bg_inpaint": true,
  "post_bg_mode": "GRADATION",
  "post_bg_org_alpha": 0.95000004768371582,
  "post_bg_projshadow_blend_mode": "SCREEN",
  "post_bg_projshadow_enable_alpha_channel": true,
  "post_bg_projshadow_indep_blend": true,
  "post_bg_projshadow_intensity": 1,
  "post_bg_projshadow_onoff": true,
  "post_bg_projshadow_scale": [
    0.55000001192092896,
    1.5
  ],
  "post_bg_projshadow_scale_by_face": false,
  "post_bg_s_tone_scale": 8.5,
  "post_bg_tex_alpha": 0.40000000596046448,
  "post_bg_tex_blend_mode": "SCREEN",
  "post_bg_tex_scale": 1,
  "post_bg_tex_trans": [
    0,
    0
  ],
  "post_bg_texname": "",
  "post_bg_z_offset": 200.00001525878906,
  "post_dropshadow_blur_width": 0.10999999940395355,
  "post_dropshadow_color": [
    9.9999999747524271e-07,
    9.9998999303352321e-07,
    9.9998999303352321e-07
  ],
  "post_dropshadow_intensity": 1,
  "post_exposure": 1,
  "post_exposure_offset": 0,
  "post_fg_tex_alpha": 1,
  "post_fg_tex_blend_mode": "SCREEN",
  "post_fg_tex_scale": 1,
  "post_fg_tex_trans": [
    0,
    0
  ],
  "post_fg_texname": "",
  "post_freecurve_ctrl_pts": [
    0.3333333432674408,
    0.3333333432674408,
    0.66666668653488159,
    0.66666668653488159
  ],
  "post_freecurve_lut": [
    0,
    0,
    0,
    0,
    0,
    0,
    0,
    0,
    0,
    0,
    0,
    0,
    0,
    0,
    0,
    0,
    0,
    0,
    0,
    0,
    0,
    0,
    0,
    0,
    0,
    0,
    0,
    0,
    0,
    0,
    0,
    0,
    0,
    0,
    0,
    0,
    0,
    0,
    0,
    0,
    0,
    0,
    0,
    0,
    0,
    0,
    0,
    0,
    0,
    0,
    0,
    0,
    0,
    0,
    0,
    0,
    0,
    0,
    0,
    0,
    0,
    0,
    0,
    0,
    0,
    0,
    0,
    0,
    0,
    0,
    0,
    0,
    0,
    0,
    0,
    0,
    0,
    0,
    0,
    0,
    0,
    0,
    0,
    0,
    0,
    0,
    0,
    0,
    0,
    0,
    0,
    0,
    0,
    0,
    0,
    0,
    0,
    0,
    0,
    0,
    0,
    0,
    0,
    0,
    0,
    0,
    0,
    0,
    0,
    0,
    0,
    0,
    0,
    0,
    0,
    0,
    0,
    0,
    0,
    0,
    0,
    0,
    0,
    0,
    0,
    0,
    0,
    0,
    0,
    0,
    0,
    0,
    0,
    0,
    0,
    0,
    0,
    0,
    0,
    0,
    0,
    0,
    0,
    0,
    0,
    0,
    0,
    0,
    0,
    0,
    0,
    0,
    0,
    0,
    0,
    0,
    0,
    0,
    0,
    0,
    0,
    0,
    0,
    0,
    0,
    0,
    0,
    0,
    0,
    0,
    0,
    0,
    0,
    0,
    0,
    0,
    0,
    0,
    0,
    0,
    0,
    0,
    0,
    0,
    0,
    0,
    0,
    0,
    0,
    0,
    0,
    0,
    0,
    0,
    0,
    0,
    0,
    0,
    0,
    0,
    0,
    0,
    0,
    0,
    0,
    0,
    0,
    0,
    0,
    0,
    0,
    0,
    0,
    0,
    0,
    0,
    0,
    0,
    0,
    0,
    0,
    0,
    0,
    0,
    0,
    0,
    0,
    0,
    0,
    0,
    0,
    0,
    0,
    0,
    0,
    0,
    0,
    0,
    0,
    0,
    0,
    0,
    0,
    0,
    0,
    0,
    0,
    0,
    0,
    0,
    0,
    0,
    0,
    0,
    0,
    0
  ],
  "post_grayscale": false,
  "post_tonemap_mode": "LINEAR",
  "post_tonemap_with_fore_back": true,
  "post_use_dropshadow": true,
  "projshadow_blend_mode": "OVERLAY",
  "projshadow_buffer_range": 0.25,
  "projshadow_color": [
    1,
    0.99998998641967773,
    0.99998998641967773
  ],
  "projshadow_enable_alpha_channel": true,
  "projshadow_ext_scale": 1,
  "projshadow_ext_trans_mode": true,
  "projshadow_fit_to_image": false,
  "projshadow_ignore_ext_move": false,
  "projshadow_intensity": 1,
  "projshadow_mono_inversion": false,
  "projshadow_repeat": true,
  "projshadow_repeat_flip": false,
  "projshadow_scale": [
    0.64999997615814209,
    1.8999999761581421
  ],
  "projshadow_scale_by_face": true,
  "projshadow_shadow_mode": false,
  "projshadow_texname": "projshadow\/blind-h03.png",
  "projshadow_trans": [
    0.029999999329447746,
    0.054999999701976776,
    0
  ],
  "projshadow_two_sided": true,
  "projshadow_yaw_pitch_roll": [
    0,
    0,
    0
  ],
  "pupil_radius_scale": 2.5999999046325684,
  "relative_light": true,
  "rigid_eyeball_normal": true,
  "screen_width": 1024,
  "shading_grayscale": false,
  "shading_region_thld": 0.004999999888241291,
  "softshadow_blend_mode": "MULTIPLY",
  "softshadow_blur_width": 0.11000000685453415,
  "softshadow_buffer_range": 0.5,
  "softshadow_displace_intensity_2d_x": 0.029999999329447746,
  "softshadow_displace_intensity_2d_y": 0.029999999329447746,
  "softshadow_displace_intensity_all": 0,
  "softshadow_displace_intensity_dark": 0,
  "softshadow_displace_tex_scale": 1,
  "softshadow_displace_texname": "",
  "softshadow_intensity": 1,
  "softshadow_ray_offset": 1,
  "ssss_quality": 0,
  "ssss_width": 0.059999998658895493,
  "use_ambient": true,
  "use_bg_color_temp": false,
  "use_bg_s_tone": true,
  "use_estimated_light": false,
  "use_feathering_compmask": false,
  "use_foreground": false,
  "use_freq_separation": false,
  "use_projshadow": true,
  "use_softshadow": true,
  "use_softshadow_displace": false,
  "use_ssss": false
}
