{
    "initialRules": [
        {
            "input": {
                "curStateType": "DeviceStateType::POWER_UP"
            }
        }
    ],
    "breakRules": [
        {
            "input": {
                "scheduleStep": "HardwareScheduleStep::FIRST_START_UP",
                "curStateType": "DeviceStateType::PREPARE_4_STREAM_ON"
            }
        },
        {
            "input": {
                "scheduleStep": "HardwareScheduleStep::FIRST_START_UP",
                "curStateType": "DeviceStateType::STREAM_ON"
            }
        },
        {
            "input": {
                "scheduleStep": "HardwareScheduleStep::NEXT_START_UP",
                "curStateType": "DeviceStateType::RELEASE_HARDWARE_STANDBY"
            }
        }
    ],
    "finishRules": [
        {
            "input": {
                "curStateType": "DeviceStateType::START_UP_FINISH"
            }
        }
    ],
    "transferRules": [
        {
            "input": {
                "scheduleStep": "HardwareScheduleStep::FIRST_START_UP",
                "curStateType": "DeviceStateType::POWER_UP"
            },
            "output": {
                "dstStateType": "DeviceStateType::HARDWARE_INIT"
            }
        },
        {
            "input": {
                "scheduleStep": "HardwareScheduleStep::FIRST_START_UP",
                "curStateType": "DeviceStateType::HARDWARE_INIT"
            },
            "output": {
                "dstStateType": "DeviceStateType::SUB_DEVICE_INIT"
            }
        },
        {
            "input": {
                "scheduleStep": "HardwareScheduleStep::FIRST_START_UP",
                "curStateType": "DeviceStateType::SUB_DEVICE_INIT"
            },
            "output": {
                "dstStateType": "DeviceStateType::PREPARE_4_STREAM_ON"
            }
        },
        {
            "input": {
                "curStateType": "DeviceStateType::PREPARE_4_STREAM_ON"
            },
            "output": {
                "dstStateType": "DeviceStateType::STREAM_ON"
            }
        },
        {
            "input": {
                "scheduleStep": "HardwareScheduleStep::FIRST_START_UP",
                "curStateType": "DeviceStateType::SUB_DEVICE_AND_PREPARE_PACKAGE"
            },
            "output": {
                "dstStateType": "DeviceStateType::STREAM_ON"
            }
        },
        {
            "input": {
                "scheduleStep": "HardwareScheduleStep::NEXT_START_UP",
                "curStateType": "DeviceStateType::HARDWARE_STANDBY"
            },
            "output": {
                "dstStateType": "DeviceStateType::RELEASE_HARDWARE_STANDBY"
            }
        },
        {
            "input": {
                "scheduleStep": "HardwareScheduleStep::NEXT_START_UP",
                "curStateType": "DeviceStateType::RELEASE_HARDWARE_STANDBY"
            },
            "output": {
                "dstStateType": "DeviceStateType::PREPARE_4_STREAM_ON"
            }
        },
        {
            "input": {
                "curStateType": "DeviceStateType::STREAM_ON"
            },
            "output": {
                "dstStateType": "DeviceStateType::STREAM_OFF"
            }
        },
        {
            "input": {
                "curStateType": "DeviceStateType::STREAM_OFF"
            },
            "output": {
                "dstStateType": "DeviceStateType::START_UP_FINISH"
            }
        }
    ],
    "changeRules": [
        {
            "input": {
                "curStateType": "DeviceStateType::PREPARE_4_STREAM_ON"
            },
            "output": {
                "dstStateType": "DeviceStateType::HARDWARE_STANDBY"
            }
        },
        {
            "input": {
                "curStateType": "DeviceStateType::STREAM_ON"
            },
            "output": {
                "dstStateType": "DeviceStateType::HARDWARE_STANDBY"
            }
        }
    ],
    "relyOnHispStartUpRules": [
        {
            "input": {
                "curStateType": "DeviceStateType::HARDWARE_INIT"
            }
        }
    ]
}
