{
    "MaxSystemCacheSize": 3932160,
    "MaxRunningDDRSize": 134217728,
    "MaxMultiframeDDRSize": 134217728,
    "ResOfflineBufferSize": 20643840,
    "HdrHistoryBufferSize": 37748736,
    "OnlineBufPoolSize":  4194304,
    "OfflineBufPoolSize": 16777216,
    "ResolutionNpuLimited": {
        "minW": 896,
        "minH": 256,
        "maxW": 4608,
        "maxH": 2592
    },
    "FreqPerfLevelList": [
        {
            "freq": 406,
            "perfLevel": 1
        },
        {
            "freq": 850,
            "perfLevel": 2
        },
        {
            "freq": 604,
            "perfLevel": 1,
            "needSetFreq": 604
        }
    ]
}