{
  "color": [
    {
      "name": "unread_count_color",
      "value": "#FFFFFF"
    },
    {
      "name": "unread_count_bg_color",
      "value": "#0A59F7"
    },
    {
      "name": "unread_count_border_color",
      "value": "#FFFFFF"
    },
    {
      "name": "unread_flag_bg_color",
      "value": "#0A59F7"
    }
  ]
}