{
    "hosts" : [
        "unix:///dev/hsl/run/isulad.sock"
    ],
    "group": "isula",
    "default-runtime": "lcr",
    "graph": "/mnt/isula/var/lib/isulad",
    "state": "/mnt/isula/var/run/isulad",
    "engine": "lcr",
    "log-level": "INFO",
    "pidfile": "/mnt/isula/var/run/isulad.pid",
    "log-opts": {
        "log-file-mode": "0644",
        "log-path": "/data/log/hsl_share/",
        "max-file": "5",
        "max-size": "4MB"
    },
    "log-driver": "file",
    "container-log": {
        "driver": "json-file"
    },
    "hook-spec": "/hw_product/bin/isula/etc/default/isulad/hooks/default.json",
    "start-timeout": "2m",
    "storage-driver": "overlay2",
    "storage-opts": [
        "overlay2.override_kernel_check=true"
    ],
    "registry-mirrors": [
    ],
    "insecure-registries": [
    ],
    "pod-sandbox-image": "",
    "native.umask": "secure",
    "network-plugin": "",
    "cni-bin-dir": "",
    "cni-conf-dir": "",
    "sup-groups": [
        1000,
        1023,
        9997
    ],
    "image-layer-check": false,
    "use-decrypted-key": true,
    "insecure-skip-verify-enforce": false,
    "cri-runtimes": {
        "kata": "io.containerd.kata.v2"
    }
}
