{
    "ProcessorList": {
        "MetadataProcessor": {},
        "FbdProcessor": {},
        "FbcProcessor": {},
        "Quad2BayerProcessor": {},
        "QuickThumbProcessor": {},
        "Raw2yuvProcessor": {},
        "RawTransformProcessor": {},
        "DngRawTransformProcessor": {},
        "YuvCropProcessor": {},
        "TunningProcessor": {},
        "YuvDummyProcessor": {},
        "RawDummyProcessor": {},
        "RawTransformDummyProcessor": {},
        "DepthProcessor": {},
        "ShareMetaProcessor": {},
        "QuickThumbnailYuvPreProcessor": {},
        "PPRawProcessor" :{},
        "RawMfnrProcessor" :{}
    },
    "ProcessorGraphList": {
        "StartCaptureProcessor": {
            "MetadataProcessor": {},
            "FbdProcessor": {},
            "FbcProcessor": {},
            "Quad2BayerProcessor": {},
            "QuickThumbProcessor": {},
            "Raw2yuvProcessor": {},
            "RawTransformProcessor": {},
            "YuvCropProcessor": {},
            "TunningProcessor": {},
            "YuvDummyProcessor": {},
            "RawDummyProcessor": {},
            "RawTransformDummyProcessor": {},
            "DepthProcessor": {},
            "QuickThumbnailYuvPreProcessor": {},
            "PPRawProcessor" :{}
        },
        "StopCaptureProcessor": {
            "MetadataProcessor": {},
            "FbdProcessor": {},
            "FbcProcessor": {},
            "Quad2BayerProcessor": {},
            "QuickThumbProcessor": {},
            "Raw2yuvProcessor": {},
            "RawTransformProcessor": {},
            "YuvCropProcessor": {},
            "TunningProcessor": {},
            "YuvDummyProcessor": {},
            "RawDummyProcessor": {},
            "RawTransformDummyProcessor": {},
            "DepthProcessor": {},
            "QuickThumbnailYuvPreProcessor": {},
            "PPRawProcessor" :{}
        },
        "Raw2yuv": {
            "MetadataProcessor": {
                "Raw2yuvProcessor": {
                    "YuvDummyProcessor": {}
                }
            }
        },
        "3Rd_RawMfnr": {
            "MetadataProcessor": {
                "RawMfnrProcessor": {
                    "YuvDummyProcessor": {}
                }
            }
        },
        "Raw2yuv_Share": {
            "MetadataProcessor": {
                "ShareMetaProcessor": {
                    "Raw2yuvProcessor": {
                        "YuvDummyProcessor": {}
                    }
                }
            }
        },
        "Tunning_Raw2yuv": {
            "MetadataProcessor": {
                "TunningProcessor": {
                    "Raw2yuvProcessor": {
                        "YuvDummyProcessor": {}
                    }
                }
            }
        },
        "Fbd": {
            "MetadataProcessor": {
                "FbdProcessor": {
                    "RawDummyProcessor": {}
                }
            }
        },
        "Fbc": {
            "MetadataProcessor": {
                "FbcProcessor": {
                    "RawDummyProcessor": {}
                }
            }
        },
        "Fbd_QuickThumb": {
            "MetadataProcessor": {
                "Raw2yuvProcessor": {
                    "QuickThumbProcessor": {
                        "YuvDummyProcessor": {}
                    }
                },
                "FbdProcessor": {
                    "RawDummyProcessor": {}
                }
            }
        },
        "Fbc_QuickThumb": {
            "MetadataProcessor": {
                "Raw2yuvProcessor": {
                    "QuickThumbProcessor": {
                        "YuvDummyProcessor": {}
                    }
                },
                "FbcProcessor": {
                    "RawDummyProcessor": {}
                }
            }
        },
        "Fbd_QuickThumbByPrev": {
            "MetadataProcessor": {
                "FbdProcessor": {
                    "RawDummyProcessor": {}
                },
                "QuickThumbnailYuvPreProcessor": {
                    "QuickThumbProcessor": {
                        "YuvDummyProcessor": {}
                    }
                }
            }
        },
        "Fbc_QuickThumbByPrev": {
            "MetadataProcessor": {
                "FbcProcessor": {
                    "RawDummyProcessor": {}
                },
                "QuickThumbnailYuvPreProcessor": {
                    "QuickThumbProcessor": {
                        "YuvDummyProcessor": {}
                    }
                }
            }
        },
        "Fbd_QuickThumb_YuvCrop": {
            "MetadataProcessor": {
                "Raw2yuvProcessor": {
                    "YuvCropProcessor": {
                        "QuickThumbProcessor": {
                            "YuvDummyProcessor": {}
                        }
                    }
                },
                "FbdProcessor": {
                    "RawDummyProcessor": {}
                }
            }
        },
        "Fbc_QuickThumb_YuvCrop": {
            "MetadataProcessor": {
                "Raw2yuvProcessor": {
                    "YuvCropProcessor": {
                        "QuickThumbProcessor": {
                            "YuvDummyProcessor": {}
                        }
                    }
                },
                "FbcProcessor": {
                    "RawDummyProcessor": {}
                }
            }
        },
        "Raw2yuv_QuickThumb_Fbd": {
            "MetadataProcessor": {
                "Raw2yuvProcessor": {
                    "QuickThumbProcessor": {
                        "YuvDummyProcessor": {}
                    },
                    "YuvDummyProcessor": {}
                },
                "FbdProcessor": {
                    "RawDummyProcessor": {}
                }
            }
        },
        "Raw2yuv_QuickThumbByPrev_Fbd": {
            "MetadataProcessor": {
                "Raw2yuvProcessor": {
                    "YuvDummyProcessor": {}
                },
                "FbdProcessor": {
                    "RawDummyProcessor": {}
                },
                "QuickThumbnailYuvPreProcessor": {
                    "QuickThumbProcessor": {
                        "YuvDummyProcessor": {}
                    }
                }
            }
        },
        "Raw2yuv_QuickThumb_Fbd_YuvCrop": {
            "MetadataProcessor": {
                "Raw2yuvProcessor": {
                    "YuvCropProcessor": {
                        "QuickThumbProcessor": {
                            "YuvDummyProcessor": {}
                        }
                    },
                    "YuvDummyProcessor": {}
                },
                "FbdProcessor": {
                    "RawDummyProcessor": {}
                }
            }
        },
        "Raw2yuv_QuickThumb_Dng": {
            "MetadataProcessor": {
                "Raw2yuvProcessor": {
                    "QuickThumbProcessor": {
                        "YuvDummyProcessor": {}
                    },
                    "YuvDummyProcessor": {}
                },
                "DngRawTransformProcessor": {
                    "RawDummyProcessor": {}
                }
            }
        },
        "Raw2yuv_QuickThumbByPrev_Dng": {
            "MetadataProcessor": {
                "Raw2yuvProcessor": {
                    "YuvDummyProcessor": {}
                },
                "DngRawTransformProcessor": {
                    "RawDummyProcessor": {}
                },
                "QuickThumbnailYuvPreProcessor": {
                    "QuickThumbProcessor": {
                        "YuvDummyProcessor": {}
                    }
                }
            }
        },
        "Raw2yuv_Dng": {
            "MetadataProcessor": {
                "Raw2yuvProcessor": {
                    "YuvDummyProcessor": {}
                },
                "DngRawTransformProcessor": {
                    "RawDummyProcessor": {}
                }
            }
        },
        "Raw2yuv_QuickThumb": {
            "MetadataProcessor": {
                "Raw2yuvProcessor": {
                    "QuickThumbProcessor": {
                        "YuvDummyProcessor": {}
                    },
                    "YuvDummyProcessor": {}
                }
            }
        },
        "Raw2yuv_QuickThumbByPrev": {
            "MetadataProcessor": {
                "QuickThumbnailYuvPreProcessor": {
                    "QuickThumbProcessor": {
                        "YuvDummyProcessor": {}
                    }
                },
                "Raw2yuvProcessor": {
                    "YuvDummyProcessor": {}
                }
            }
        },
        "Raw2yuv_QuickThumb_YuvCrop": {
            "MetadataProcessor": {
                "Raw2yuvProcessor": {
                    "YuvCropProcessor": {
                        "QuickThumbProcessor": {
                            "YuvDummyProcessor": {}
                        }
                    },
                    "YuvDummyProcessor": {}
                }
            }
        },
        "Raw2yuv_Depth_QuickThumb": {
            "MetadataProcessor": {
                "Raw2yuvProcessor": {
                    "DepthProcessor": {
                        "QuickThumbProcessor": {
                            "YuvDummyProcessor": {}
                        },
                        "YuvDummyProcessor": {}
                    }
                }
            }
        },
        "Raw2yuv_Depth_QuickThumbByPrev": {
            "MetadataProcessor": {
                "Raw2yuvProcessor": {
                    "DepthProcessor": {
                        "YuvDummyProcessor": {}
                    }
                },
                "QuickThumbnailYuvPreProcessor": {
                    "QuickThumbProcessor": {
                        "YuvDummyProcessor": {}
                    }
                }
            }
        },
        "Raw2yuv_Depth": {
            "MetadataProcessor": {
                "Raw2yuvProcessor": {
                    "DepthProcessor": {
                        "YuvDummyProcessor": {}
                    }
                }
            }
        },
        "Tunning_Raw2yuv_QuickThumb": {
            "MetadataProcessor": {
                "TunningProcessor": {
                    "Raw2yuvProcessor": {
                        "QuickThumbProcessor": {
                            "YuvDummyProcessor": {}
                        },
                        "YuvDummyProcessor": {}
                    }
                }
            }
        },
        "Tunning_Raw2yuv_QuickThumbByPrev": {
            "MetadataProcessor": {
                "TunningProcessor": {
                    "Raw2yuvProcessor": {
                        "YuvDummyProcessor": {}
                    },
                    "QuickThumbnailYuvPreProcessor": {
                        "QuickThumbProcessor": {
                            "YuvDummyProcessor": {}
                        }
                    }
                }
            }
        },
        "Fbd_Quad2Bayer": {
            "MetadataProcessor": {
                "FbdProcessor": {
                    "Quad2BayerProcessor": {
                        "YuvDummyProcessor": {}
                    }
                }
            }
        },
        "Fbd_Quad2Bayer_QuickThumb": {
            "MetadataProcessor": {
                "FbdProcessor": {
                    "Quad2BayerProcessor": {
                        "Raw2yuvProcessor": {
                            "QuickThumbProcessor": {
                                "YuvDummyProcessor": {}
                            }
                        }
                    }
                }
            }
        },
        "Fbd_Quad2Bayer_Raw2yuv": {
            "MetadataProcessor": {
                "FbdProcessor": {
                    "Quad2BayerProcessor": {
                        "Raw2yuvProcessor": {
                            "YuvDummyProcessor": {}
                        }
                    }
                }
            }
        },
        "Fbd_Quad2Bayer_Raw2yuv_QuickThumb": {
            "MetadataProcessor": {
                "FbdProcessor": {
                    "Quad2BayerProcessor": {
                        "Raw2yuvProcessor": {
                            "QuickThumbProcessor": {
                                "YuvDummyProcessor": {}
                            },
                            "YuvDummyProcessor": {}
                        }
                    }
                }
            }
        },
        "Fbd_Quad2Bayer_QuickThumbByPrev": {
            "MetadataProcessor": {
                "FbdProcessor": {
                    "Quad2BayerProcessor": {
                        "QuickThumbnailYuvPreProcessor": {
                            "QuickThumbProcessor": {
                                "YuvDummyProcessor": {}
                            }
                        }
                    }
                }
            }
        },
        "Fbd_Quad2Bayer_Raw2yuv_QuickThumbByPrev": {
            "MetadataProcessor": {
                "FbdProcessor": {
                    "Quad2BayerProcessor": {
                        "Raw2yuvProcessor": {
                            "YuvDummyProcessor": {}
                        }
                    }
                },
                "QuickThumbnailYuvPreProcessor": {
                    "QuickThumbProcessor": {
                        "YuvDummyProcessor": {}
                    }
                }
            }
        },
        "Fbd_Quad2Bayer_QuickThumb_YuvCrop": {
            "MetadataProcessor": {
                "FbdProcessor": {
                    "Quad2BayerProcessor": {
                        "Raw2yuvProcessor": {
                            "YuvCropProcessor": {
                                "QuickThumbProcessor": {
                                    "YuvDummyProcessor": {}
                                }
                            }
                        }
                    }
                }
            }
        },
        "Fbd_RawTransform": {
            "MetadataProcessor": {
                "FbdProcessor": {
                    "RawDummyProcessor": {}
                },
                "RawTransformProcessor": {
                    "RawTransformDummyProcessor": {}
                }
            }
        },
        "QuickThumb_Fbd_RawTransform": {
            "MetadataProcessor": {
                "Raw2yuvProcessor": {
                    "QuickThumbProcessor": {
                        "YuvDummyProcessor": {}
                    }
                },
                "FbdProcessor": {
                    "RawDummyProcessor": {}
                },
                "RawTransformProcessor": {
                    "RawTransformDummyProcessor": {}
                }
            }
        },
        "QuickThumb_Opt_Fbd_RawTransform": {
            "MetadataProcessor": {
                "QuickThumbnailYuvPreProcessor": {
                    "QuickThumbProcessor": {
                        "YuvDummyProcessor": {}
                    }
                },
                "FbdProcessor": {
                    "RawDummyProcessor": {}
                },
                "RawTransformProcessor": {
                    "RawTransformDummyProcessor": {}
                }
            }
        },
        "YuvCrop_QuickThumb_Fbd_RawTransform": {
            "MetadataProcessor": {
                "Raw2yuvProcessor": {
                    "YuvCropProcessor": {
                        "QuickThumbProcessor": {
                            "YuvDummyProcessor": {}
                        }
                    }
                },
                "FbdProcessor": {
                    "RawDummyProcessor": {}
                },
                "RawTransformProcessor": {
                    "RawTransformDummyProcessor": {}
                }
            }
        },
        "Raw2yuv_QuickThumb_PPRaw": {
            "MetadataProcessor": {
                "PPRawProcessor": {
                    "Raw2yuvProcessor": {
                        "QuickThumbProcessor": {
                            "YuvDummyProcessor": {}
                        },
                        "YuvDummyProcessor": {}
                    }
                }
            }
        },
        "Fbd_QuickThumb_PPRaw": {
            "MetadataProcessor": {
                "PPRawProcessor": {
                    "Raw2yuvProcessor": {
                        "QuickThumbProcessor": {
                            "YuvDummyProcessor": {}
                        }
                    },
                    "FbdProcessor": {
                        "RawDummyProcessor": {}
                    }
                }
            }
        },
        "Fbd_QuickThumbByPrev_PPRaw": {
            "MetadataProcessor": {
                "PPRawProcessor": {
                    "FbdProcessor": {
                        "RawDummyProcessor": {}
                    },
                    "QuickThumbnailYuvPreProcessor": {
                        "QuickThumbProcessor": {
                            "YuvDummyProcessor": {}
                        }
                    }
                }
            }
        },
        "Fbd_QuickThumb_YuvCrop_PPRaw": {
            "MetadataProcessor": {
                "PPRawProcessor": {
                    "Raw2yuvProcessor": {
                        "YuvCropProcessor": {
                            "QuickThumbProcessor": {
                                "YuvDummyProcessor": {}
                            }
                        }
                    },
                    "FbdProcessor": {
                        "RawDummyProcessor": {}
                    }
                }
            }
        },
        "Fbd_Depth": {
            "MetadataProcessor": {
                "FbdProcessor": {
                    "DepthProcessor": {
                        "RawDummyProcessor": {}
                    }
                }
            }
        },
        "Fbd_Quad2Bayer_Depth_QuickThumb": {
            "MetadataProcessor": {
                "FbdProcessor": {
                    "DepthProcessor":{
                        "Quad2BayerProcessor": {
                            "Raw2yuvProcessor": {
                                "QuickThumbProcessor": {
                                    "YuvDummyProcessor": {}
                                }
                            }
                        }
                    }
                }
            }
        },
        "Fbd_Depth_QuickThumb": {
            "MetadataProcessor": {
                "Raw2yuvProcessor": {
                    "QuickThumbProcessor": {
                        "YuvDummyProcessor": {}
                    }
                },
                "FbdProcessor": {
                    "DepthProcessor": {
                        "RawDummyProcessor": {}
                    }
                }
            }
        },
        "Fbd_Depth_QuickThumb_YuvCrop": {
            "MetadataProcessor": {
                "Raw2yuvProcessor": {
                    "YuvCropProcessor": {
                        "QuickThumbProcessor": {
                            "YuvDummyProcessor": {}
                        }
                    }
                },
                "FbdProcessor": {
                    "DepthProcessor": {
                        "RawDummyProcessor": {}
                    }
                }
            }
        },
        "Fbd_Depth_QuickThumbByPrev": {
            "MetadataProcessor": {
                "FbdProcessor": {
                    "DepthProcessor": {
                        "RawDummyProcessor": {}
                    }
                },
                "QuickThumbnailYuvPreProcessor": {
                    "QuickThumbProcessor": {
                        "YuvDummyProcessor": {}
                    }
                }
            }
        },
        "Fbd_Quad2Bayer_Depth_QuickThumbByPrev": {
            "MetadataProcessor": {
                "FbdProcessor": {
                    "DepthProcessor":{
                        "Quad2BayerProcessor": {
                            "QuickThumbnailYuvPreProcessor": {
                                "QuickThumbProcessor": {
                                    "YuvDummyProcessor": {}
                                }
                            }
                        }
                    }
                }
            }
        },
        "Fbd_Quad2Bayer_Depth_QuickThumb_YuvCrop": {
            "MetadataProcessor": {
                "FbdProcessor": {
                    "DepthProcessor":{
                        "Quad2BayerProcessor": {
                            "Raw2yuvProcessor": {
                                "YuvCropProcessor": {
                                    "QuickThumbProcessor": {
                                        "YuvDummyProcessor": {}
                                    }
                                }
                            }
                        }
                    }
                }
            }
        },
        "Raw2yuv_Depth_QuickThumb_YuvCrop": {
            "MetadataProcessor": {
                "Raw2yuvProcessor": {
                    "DepthProcessor": {
                        "YuvCropProcessor": {
                            "QuickThumbProcessor": {
                                "YuvDummyProcessor": {}
                            }
                        },
                        "YuvDummyProcessor": {}
                    }
                }
            }
        },
        "Tunning_Raw2yuv_Depth_QuickThumb": {
            "MetadataProcessor": {
                "TunningProcessor": {
                    "Raw2yuvProcessor": {
                        "DepthProcessor": {
                            "QuickThumbProcessor": {
                                "YuvDummyProcessor": {}
                            },
                            "YuvDummyProcessor": {}
                        }
                    }
                }
            }
        },
        "Tunning_Raw2yuv_Depth_QuickThumbByPrev": {
            "MetadataProcessor": {
                "TunningProcessor": {
                    "Raw2yuvProcessor": {
                        "DepthProcessor": {
                            "YuvDummyProcessor": {}
                        }
                    },
                    "QuickThumbnailYuvPreProcessor": {
                        "QuickThumbProcessor": {
                            "YuvDummyProcessor": {}
                        }
                    }
                }
            }
        },
        "Tunning_Raw2yuv_Depth": {
            "MetadataProcessor": {
                "TunningProcessor": {
                    "Raw2yuvProcessor": {
                        "DepthProcessor": {
                            "YuvDummyProcessor": {}
                        }
                    }
                }
            }
        },
        "Raw2yuv_Depth_QuickThumb_Fbd": {
            "MetadataProcessor": {
                "Raw2yuvProcessor": {
                    "QuickThumbProcessor": {
                        "YuvDummyProcessor": {}
                    },
                    "YuvDummyProcessor": {}
                },
                "FbdProcessor": {
                    "DepthProcessor": {
                        "RawDummyProcessor": {}
                    }
                }
            }
        },
        "Raw2yuv_Depth_QuickThumbByPrev_Fbd": {
            "MetadataProcessor": {
                "Raw2yuvProcessor": {
                    "YuvDummyProcessor": {}
                },
                "FbdProcessor": {
                    "DepthProcessor": {
                        "RawDummyProcessor": {}
                    }
                },
                "QuickThumbnailYuvPreProcessor": {
                    "QuickThumbProcessor": {
                        "YuvDummyProcessor": {}
                    }
                }
            }
        },
        "Raw2yuv_Depth_QuickThumb_Fbd_YuvCrop": {
            "MetadataProcessor": {
                "Raw2yuvProcessor": {
                    "YuvCropProcessor": {
                        "QuickThumbProcessor": {
                            "YuvDummyProcessor": {}
                        }
                    },
                    "YuvDummyProcessor": {}
                },
                "FbdProcessor": {
                    "DepthProcessor": {
                        "RawDummyProcessor": {}
                    }
                }
            }
        },
        "Fbd_Depth_Quad2Bayer": {
            "MetadataProcessor": {
                "FbdProcessor": {
                    "DepthProcessor": {
                        "Quad2BayerProcessor": {
                            "YuvDummyProcessor": {}
                        }
                    }
                }
            }
        },
        "Fbd_Depth_Quad2Bayer_Raw2yuv": {
            "MetadataProcessor": {
                "FbdProcessor": {
                    "DepthProcessor": {
                        "Quad2BayerProcessor": {
                            "Raw2yuvProcessor": {
                                "YuvDummyProcessor": {}
                            }
                        }
                    }
                }
            }
        },
        "Fbd_Quad2Bayer_Raw2yuv_Depth_QuickThumb": {
            "MetadataProcessor": {
                "FbdProcessor": {
                    "DepthProcessor": {
                        "Quad2BayerProcessor": {
                            "Raw2yuvProcessor": {
                                "QuickThumbProcessor": {
                                    "YuvDummyProcessor": {}
                                },
                                "YuvDummyProcessor": {}
                            }
                        }
                    }
                }
            }
        },
        "Fbd_Quad2Bayer_Raw2yuv_Depth_QuickThumbByPrev": {
            "MetadataProcessor": {
                "FbdProcessor": {
                    "DepthProcessor": {
                        "Quad2BayerProcessor": {
                            "Raw2yuvProcessor": {
                                "YuvDummyProcessor": {}
                            }
                        }
                    }
                },
                "QuickThumbnailYuvPreProcessor": {
                    "QuickThumbProcessor": {
                        "YuvDummyProcessor": {}
                    }
                }
            }
        }
    }
}
