{
	"centerX" : 0.5,
	"centerY" : 0.5,
	"angle" : 0,
	"scale" : 1,
	"width" : 88,
	"height" : 183,
	"contents" : [
		{
            "type": "text",
            "centerX": 0.2,
            "centerY": 0.5,
            "width": 20,
            "height": 178,
            "angle": 0,
            "color": "#ffffffff",
            "isVertical": 1,
            "alignment": 0,
            "editable":true,
            "text": "{USER_EDIT}",
            "zorder": 2
        },
        {
            "type": "text",
            "centerX": 0.5,
            "centerY": 0.5,
            "width": 20,
            "height": 178,
            "angle": 0,
            "color": "#ffffffff",
            "isVertical": 1,
			"alignment": 0,
            "text": "{LOCATION}",
            "editable":true,
            "zorder": 2
        },
        {
			"type" : "image",
			"resource" : {
				"type" : "static",
				"path" : "res/stop.png"
			},
			"centerX" : 0.8,
			"centerY" : 0.3,
			"width" : 22,
			"height" : 103,
			"angle" : 0,
			"zorder" : 1
		}
	]
}
