{
  "color": [
    {
      "name": "unread_count_color",
      "value": "#FFFFFF"
    },
    {
      "name": "unread_count_bg_color",
      "value": "#317AF7"
    },
    {
      "name": "unread_count_border_color",
      "value": "#FFFFFF"
    },
    {
      "name": "unread_flag_bg_color",
      "value": "#317AF7"
    },
    {
      "name": "fa_background_not_blur",
      "value": "#202224"
    },
    {
      "name": "divider_line_color",
      "value": "#0CFFFFFF"
    }
  ]
}