{
	"centerX" : 0.5,
	"centerY" : 0.5,
	"angle" : 0,
	"scale" : 1,
	"width" : 140,
	"height" : 160,
	"contents" : [{
            "type": "text",
            "centerX": 0.5,
            "centerY": 0.125,
            "width": 120,
            "height": 35,
            "color": "#ffffffff",
			"alignment": 1,
            "text": "{LATITUDE_TEXT}"
		},
		{
            "type": "text",
            "centerX": 0.5,
            "centerY": 0.375,
            "width": 120,
            "height": 35,
            "color": "#ffffffff",
            "font":"robotothin",
			"alignment": 1,
            "text": "{LATITUDE}"
        },
		{
            "type": "text",
            "centerX": 0.5,
            "centerY": 0.625,
            "width": 120,
            "height": 35,
            "color": "#ffffffff",
			"alignment": 1,
            "text": "{LONGITUDE_TEXT}"
        },
		{
            "type": "text",
            "centerX": 0.5,
            "centerY": 0.865,
			"width": 120,
            "height": 35,
            "font":"robotothin",
            "color": "#ffffffff",
			"alignment": 1,
            "text": "{LONGITUDE}"
        }
	]
}
