#,version,,,,,,,,,,,,,,,,,,,,,,,,,,,,,,,,,,,,,,,,,,,,,,,,,,,,,,,,,,,,,,,,,,,,,,,,,,,,,,,,,,,,,,,,,,,,,,,,,,,,,,,,,,,,,,
2022,4,18,1,,,,,,,,,,,,,,,,,,,,,,,,,,,,,,,,,,,,,,,,,,,,,,,,,,,,,,,,,,,,,,,,,,,,,,,,,,,,,,,,,,,,,,,,,,,,,,,,,,,,,,,,,,,,
#,row_col_num,,,,,,,,,,,,,,,,,,,,,,,,,,,,,,,,,,,,,,,,,,,,,,,,,,,,,,,,,,,,,,,,,,,,,,,,,,,,,,,,,,,,,,,,,,,,,,,,,,,,,,,,,,,,,,
34,39,,,,,,,,,,,,,,,,,,,,,,,,,,,,,,,,,,,,,,,,,,,,,,,,,,,,,,,,,,,,,,,,,,,,,,,,,,,,,,,,,,,,,,,,,,,,,,,,,,,,,,,,,,,,,,
#,screen_off_noise,,,,,,,,,,,,,,,,,,,,,,,,,,,,,,,,,,,,,,,,,,,,,,,,,,,,,,,,,,,,,,,,,,,,,,,,,,,,,,,,,,,,,,,,,,,,,,,,,,,,,,,,,,,,,,
-600,600,,,,,,,,,,,,,,,,,,,,,,,,,,,,,,,,,,,,,,,,,,,,,,,,,,,,,,,,,,,,,,,,,,,,,,,,,,,,,,,,,,,,,,,,,,,,,,,,,,,,,,,,,,,,,,
#,noise,,,,,,,,,,,,,,,,,,,,,,,,,,,,,,,,,,,,,,,,,,,,,,,,,,,,,,,,,,,,,,,,,,,,,,,,,,,,,,,,,,,,,,,,,,,,,,,,,,,,,,,,,,,,,,
-600,600,,,,,,,,,,,,,,,,,,,,,,,,,,,,,,,,,,,,,,,,,,,,,,,,,,,,,,,,,,,,,,,,,,,,,,,,,,,,,,,,,,,,,,,,,,,,,,,,,,,,,,,,,,,,,,
#,raw_max,,,,,,,,,,,,,,,,,,,,,,,,,,,,,,,,,,,,,,,,,,,,,,,,,,,,,,,,,,,,,,,,,,,,,,,,,,,,,,,,,,,,,,,,,,,,,,,,,,,,,,,,,,,,,,
4142,4087,4216,4182,4202,4189,4170,4170,4154,4181,4168,4205,4155,4147,3853,4159,3985,4129,3765,4038,4145,4227,4244,4261,4321,4306,4295,4322,4325,4316,4316,4327,4330,4323,4141,4360,4417,4431,4611,,,,,,,,,,,,,,,,,,,,,,,,,,,,,,,,,,,,,,,,,,,,,,,,,,,,,,,,,,,,,,,,,,,,,,,,,
4600,4600,4108,4097,4111,4125,4105,4102,4075,4130,4085,4122,4110,4067,3773,4080,3910,4080,3703,3962,4095,4156,4181,4186,4223,4207,4220,4237,4234,4246,4262,4269,4236,4258,4044,4265,4244,4316,4460,,,,,,,,,,,,,,,,,,,,,,,,,,,,,,,,,,,,,,,,,,,,,,,,,,,,,,,,,,,,,,,,,,,,,,,,,
4002,4018,4070,4059,4075,4087,4063,4067,4044,4097,4065,4090,4085,4044,3735,4057,3888,4057,3682,3945,4080,4108,4143,4175,4211,4198,4195,4214,4210,4221,4236,4237,4223,4228,4007,4252,4218,4221,4397,,,,,,,,,,,,,,,,,,,,,,,,,,,,,,,,,,,,,,,,,,,,,,,,,,,,,,,,,,,,,,,,,,,,,,,,,
4012,4110,4050,4049,4055,4072,4050,4063,4038,4090,4051,4090,4074,4036,3721,4061,3888,4052,3680,3959,4057,4098,4171,4174,4215,4197,4191,4228,4221,4225,4238,4240,4230,4232,3995,4241,4226,4187,4316,,,,,,,,,,,,,,,,,,,,,,,,,,,,,,,,,,,,,,,,,,,,,,,,,,,,,,,,,,,,,,,,,,,,,,,,,
3974,4094,4039,4044,4052,4062,4045,4051,4028,4078,4045,4074,4069,4036,3712,4033,3876,4045,3666,3915,4050,4090,4140,4150,4189,4166,4171,4191,4200,4206,4205,4215,4203,4210,3987,4243,4226,4180,4289,,,,,,,,,,,,,,,,,,,,,,,,,,,,,,,,,,,,,,,,,,,,,,,,,,,,,,,,,,,,,,,,,,,,,,,,,
3950,4094,4043,4044,4063,4073,4050,4049,4039,4082,4056,4081,4076,4037,3719,4029,3883,4050,3667,3915,4056,4089,4143,4147,4183,4165,4175,4207,4226,4214,4203,4227,4204,4227,3988,4238,4215,4183,4275,,,,,,,,,,,,,,,,,,,,,,,,,,,,,,,,,,,,,,,,,,,,,,,,,,,,,,,,,,,,,,,,,,,,,,,,,
3931,4089,4044,4046,4058,4072,4045,4045,4042,4085,4062,4084,4078,4043,3724,4031,3877,4052,3657,3917,4047,4090,4139,4143,4184,4167,4171,4208,4211,4222,4198,4212,4203,4225,3996,4221,4200,4179,4266,,,,,,,,,,,,,,,,,,,,,,,,,,,,,,,,,,,,,,,,,,,,,,,,,,,,,,,,,,,,,,,,,,,,,,,,,
3931,4089,4053,4058,4068,4080,4060,4063,4063,4106,4077,4098,4096,4056,3738,4037,3883,4073,3661,3916,4052,4101,4145,4143,4182,4173,4176,4210,4214,4212,4213,4218,4222,4202,4007,4222,4198,4182,4270,,,,,,,,,,,,,,,,,,,,,,,,,,,,,,,,,,,,,,,,,,,,,,,,,,,,,,,,,,,,,,,,,,,,,,,,,
3919,4082,4058,4056,4077,4083,4064,4063,4068,4112,4072,4105,4106,4060,3737,4046,3884,4077,3655,3915,4056,4107,4146,4152,4195,4184,4182,4213,4217,4215,4196,4218,4207,4177,4000,4210,4194,4196,4274,,,,,,,,,,,,,,,,,,,,,,,,,,,,,,,,,,,,,,,,,,,,,,,,,,,,,,,,,,,,,,,,,,,,,,,,,
3893,4056,4041,4033,4053,4071,4049,4043,4044,4097,4065,4084,4092,4051,3726,4032,3877,4066,3657,3904,4039,4094,4123,4129,4181,4164,4163,4195,4199,4196,4178,4201,4187,4155,3985,4186,4166,4159,4232,,,,,,,,,,,,,,,,,,,,,,,,,,,,,,,,,,,,,,,,,,,,,,,,,,,,,,,,,,,,,,,,,,,,,,,,,
3883,4042,4026,4020,4031,4049,4029,4025,4015,4074,4045,4063,4083,4044,3713,4016,3852,4050,3627,3893,4035,4079,4132,4140,4183,4169,4166,4198,4201,4198,4184,4206,4189,4163,3966,4187,4177,4136,4198,,,,,,,,,,,,,,,,,,,,,,,,,,,,,,,,,,,,,,,,,,,,,,,,,,,,,,,,,,,,,,,,,,,,,,,,,
3852,4029,4018,4005,4021,4038,4014,4014,4007,4058,4029,4060,4063,4032,3706,4005,3850,4039,3612,3880,4001,4070,4089,4092,4133,4129,4119,4143,4148,4144,4141,4149,4135,4110,3962,4138,4123,4123,4179,,,,,,,,,,,,,,,,,,,,,,,,,,,,,,,,,,,,,,,,,,,,,,,,,,,,,,,,,,,,,,,,,,,,,,,,,
3847,4040,4008,4011,4030,4031,4013,4012,4002,4054,4018,4053,4055,4021,3706,3995,3834,4030,3612,3871,4007,4053,4078,4084,4122,4112,4111,4145,4147,4141,4148,4146,4133,4114,3943,4139,4123,4116,4164,,,,,,,,,,,,,,,,,,,,,,,,,,,,,,,,,,,,,,,,,,,,,,,,,,,,,,,,,,,,,,,,,,,,,,,,,
3837,4013,3986,3990,4004,4017,3994,3988,3992,4026,3998,4037,4033,3998,3681,3978,3815,4016,3608,3868,3989,4028,4061,4073,4107,4103,4100,4130,4133,4130,4130,4131,4123,4100,3929,4125,4110,4097,4131,,,,,,,,,,,,,,,,,,,,,,,,,,,,,,,,,,,,,,,,,,,,,,,,,,,,,,,,,,,,,,,,,,,,,,,,,
3838,4010,4006,3997,4008,4025,4002,3986,3981,4033,3997,4030,4029,3992,3677,3981,3818,4019,3611,3867,3978,4034,4063,4075,4113,4108,4104,4145,4151,4141,4123,4144,4130,4107,3929,4134,4122,4092,4137,,,,,,,,,,,,,,,,,,,,,,,,,,,,,,,,,,,,,,,,,,,,,,,,,,,,,,,,,,,,,,,,,,,,,,,,,
3813,4016,3995,4002,4010,4019,3994,3981,3976,4023,4006,4019,4023,3997,3673,3970,3815,4012,3598,3858,3964,4033,4057,4060,4104,4097,4093,4132,4140,4127,4114,4129,4121,4097,3923,4124,4110,4095,4124,,,,,,,,,,,,,,,,,,,,,,,,,,,,,,,,,,,,,,,,,,,,,,,,,,,,,,,,,,,,,,,,,,,,,,,,,
3800,4019,3994,3996,4014,4017,3984,3979,3974,4018,3985,4020,4015,3980,3662,3980,3810,4023,3592,3849,3951,4025,4047,4053,4094,4090,4088,4121,4125,4117,4105,4121,4111,4089,3919,4122,4105,4088,4116,,,,,,,,,,,,,,,,,,,,,,,,,,,,,,,,,,,,,,,,,,,,,,,,,,,,,,,,,,,,,,,,,,,,,,,,,
3773,3983,3959,3961,3974,3996,3973,3957,3942,3985,3954,3985,3987,3948,3632,3938,3778,3978,3570,3827,3928,3995,4019,4027,4072,4058,4057,4091,4093,4085,4078,4098,4089,4060,3898,4091,4080,4062,4061,,,,,,,,,,,,,,,,,,,,,,,,,,,,,,,,,,,,,,,,,,,,,,,,,,,,,,,,,,,,,,,,,,,,,,,,,
3974,4074,4104,3948,3952,4115,4100,4118,4110,4136,3745,4149,3883,4145,4023,4036,4049,3745,4001,3988,4085,4117,4101,4125,4088,4094,4116,4196,4108,4240,3917,4079,4177,4209,4219,4196,4183,4128,4125,,,,,,,,,,,,,,,,,,,,,,,,,,,,,,,,,,,,,,,,,,,,,,,,,,,,,,,,,,,,,,,,,,,,,,,,,
4014,4121,4157,4001,3998,4156,4131,4169,4143,4184,3777,4188,3918,4191,4057,4065,4079,3785,4046,4024,4107,4142,4138,4168,4120,4115,4136,4232,4134,4275,3954,4102,4216,4256,4246,4231,4226,4169,4139,,,,,,,,,,,,,,,,,,,,,,,,,,,,,,,,,,,,,,,,,,,,,,,,,,,,,,,,,,,,,,,,,,,,,,,,,
3981,4108,4145,3982,3981,4152,4134,4176,4146,4193,3778,4185,3912,4192,4058,4052,4050,3778,4038,4022,4095,4139,4138,4172,4122,4096,4126,4231,4130,4275,3950,4086,4215,4245,4240,4223,4221,4162,4129,,,,,,,,,,,,,,,,,,,,,,,,,,,,,,,,,,,,,,,,,,,,,,,,,,,,,,,,,,,,,,,,,,,,,,,,,
3978,4101,4153,3987,3986,4164,4140,4179,4167,4185,3784,4207,3921,4200,4061,4063,4054,3789,4042,4030,4108,4145,4152,4176,4129,4107,4131,4241,4152,4286,3962,4093,4224,4251,4240,4238,4227,4177,4135,,,,,,,,,,,,,,,,,,,,,,,,,,,,,,,,,,,,,,,,,,,,,,,,,,,,,,,,,,,,,,,,,,,,,,,,,
3991,4120,4177,3998,3999,4199,4158,4192,4167,4201,3795,4214,3936,4216,4070,4071,4072,3801,4049,4039,4139,4156,4166,4193,4135,4111,4137,4250,4157,4305,3963,4103,4230,4264,4256,4245,4241,4183,4135,,,,,,,,,,,,,,,,,,,,,,,,,,,,,,,,,,,,,,,,,,,,,,,,,,,,,,,,,,,,,,,,,,,,,,,,,
3985,4114,4156,3991,4001,4175,4145,4177,4159,4200,3801,4207,3925,4218,4066,4077,4076,3801,4053,4035,4124,4152,4161,4190,4132,4119,4142,4247,4146,4301,3960,4105,4236,4262,4246,4240,4239,4187,4119,,,,,,,,,,,,,,,,,,,,,,,,,,,,,,,,,,,,,,,,,,,,,,,,,,,,,,,,,,,,,,,,,,,,,,,,,
3975,4111,4145,3986,3998,4167,4136,4173,4157,4197,3799,4207,3928,4221,4067,4071,4078,3798,4049,4034,4118,4146,4157,4191,4142,4126,4142,4244,4159,4296,3954,4107,4219,4271,4241,4232,4231,4172,4115,,,,,,,,,,,,,,,,,,,,,,,,,,,,,,,,,,,,,,,,,,,,,,,,,,,,,,,,,,,,,,,,,,,,,,,,,
3982,4119,4164,4000,4010,4180,4153,4198,4175,4210,3814,4225,3935,4224,4076,4084,4078,3809,4064,4045,4131,4161,4178,4209,4157,4135,4147,4268,4160,4301,3965,4118,4229,4276,4260,4252,4259,4206,4123,,,,,,,,,,,,,,,,,,,,,,,,,,,,,,,,,,,,,,,,,,,,,,,,,,,,,,,,,,,,,,,,,,,,,,,,,
3996,4140,4184,4014,4021,4196,4168,4206,4190,4225,3831,4243,3949,4243,4094,4095,4096,3822,4085,4061,4145,4172,4187,4215,4168,4144,4163,4277,4179,4312,3981,4129,4242,4294,4276,4282,4253,4196,4127,,,,,,,,,,,,,,,,,,,,,,,,,,,,,,,,,,,,,,,,,,,,,,,,,,,,,,,,,,,,,,,,,,,,,,,,,
3937,4080,4119,3968,3959,4123,4096,4132,4132,4154,3774,4173,3897,4174,4041,4041,4040,3769,4027,4007,4088,4115,4121,4169,4103,4091,4113,4214,4134,4265,3927,4087,4180,4228,4207,4200,4190,4137,4067,,,,,,,,,,,,,,,,,,,,,,,,,,,,,,,,,,,,,,,,,,,,,,,,,,,,,,,,,,,,,,,,,,,,,,,,,
3940,4089,4116,3974,3968,4127,4104,4139,4135,4157,3764,4181,3910,4174,4048,4049,4053,3768,4030,4014,4094,4128,4132,4167,4105,4101,4127,4207,4129,4259,3932,4109,4179,4223,4216,4207,4201,4140,4082,,,,,,,,,,,,,,,,,,,,,,,,,,,,,,,,,,,,,,,,,,,,,,,,,,,,,,,,,,,,,,,,,,,,,,,,,
3912,4070,4095,3947,3950,4098,4084,4119,4119,4139,3746,4154,3900,4156,4020,4023,4026,3748,4002,3989,4068,4105,4103,4148,4086,4082,4105,4183,4113,4230,3916,4077,4155,4201,4190,4180,4177,4120,4043,,,,,,,,,,,,,,,,,,,,,,,,,,,,,,,,,,,,,,,,,,,,,,,,,,,,,,,,,,,,,,,,,,,,,,,,,
3933,4095,4120,3976,3977,4122,4110,4150,4153,4168,3772,4182,3916,4180,4048,4053,4046,3768,4021,4006,4093,4139,4123,4160,4108,4114,4128,4206,4124,4249,3937,4104,4184,4225,4219,4209,4204,4142,4081,,,,,,,,,,,,,,,,,,,,,,,,,,,,,,,,,,,,,,,,,,,,,,,,,,,,,,,,,,,,,,,,,,,,,,,,,
3960,4120,4145,4005,4002,4150,4140,4173,4180,4188,3789,4201,3938,4201,4069,4074,4076,3779,4043,4025,4115,4148,4142,4171,4139,4140,4169,4239,4152,4276,3963,4136,4208,4253,4246,4240,4233,4172,4113,,,,,,,,,,,,,,,,,,,,,,,,,,,,,,,,,,,,,,,,,,,,,,,,,,,,,,,,,,,,,,,,,,,,,,,,,
3975,4141,4169,4025,4023,4170,4156,4189,4191,4199,3793,4204,3945,4203,4084,4083,4090,3781,4063,4050,4127,4160,4152,4175,4156,4141,4166,4244,4164,4291,3974,4152,4232,4263,4258,4251,4249,4188,4102,,,,,,,,,,,,,,,,,,,,,,,,,,,,,,,,,,,,,,,,,,,,,,,,,,,,,,,,,,,,,,,,,,,,,,,,,
4159,4275,4310,4161,4147,4322,4286,4315,4312,4339,3916,4346,4070,4345,4219,4221,4209,3905,4193,4175,4247,4285,4294,4317,4287,4257,4289,4396,4294,4430,4098,4280,4375,4422,4411,4399,4403,4345,4284,,,,,,,,,,,,,,,,,,,,,,,,,,,,,,,,,,,,,,,,,,,,,,,,,,,,,,,,,,,,,,,,,,,,,,,,,
#,raw_min,,,,,,,,,,,,,,,,,,,,,,,,,,,,,,,,,,,,,,,,,,,,,,,,,,,,,,,,,,,,,,,,,,,,,,,,,,,,,,,,,,,,,,,,,,,,,,,,,,,,,,,,,,,,,,
2676,2604,2695,2710,2691,2675,2661,2678,2632,2658,2652,2616,2632,2594,2343,2602,2451,2601,2308,2564,2594,2697,2708,2710,2730,2754,2725,2761,2746,2721,2745,2752,2740,2746,2545,2792,2841,2851,2990,,,,,,,,,,,,,,,,,,,,,,,,,,,,,,,,,,,,,,,,,,,,,,,,,,,,,,,,,,,,,,,,,,,,,,,,,
1350,1350,2611,2630,2623,2609,2589,2615,2574,2599,2600,2565,2577,2543,2302,2563,2411,2580,2272,2527,2563,2650,2662,2687,2702,2701,2674,2714,2688,2669,2700,2714,2704,2701,2502,2740,2725,2739,2888,,,,,,,,,,,,,,,,,,,,,,,,,,,,,,,,,,,,,,,,,,,,,,,,,,,,,,,,,,,,,,,,,,,,,,,,,
2563,2568,2582,2610,2602,2591,2572,2594,2562,2584,2587,2558,2560,2538,2289,2554,2401,2571,2273,2532,2559,2645,2656,2702,2705,2710,2678,2720,2696,2673,2711,2700,2699,2694,2495,2724,2716,2691,2825,,,,,,,,,,,,,,,,,,,,,,,,,,,,,,,,,,,,,,,,,,,,,,,,,,,,,,,,,,,,,,,,,,,,,,,,,
2534,2615,2577,2586,2590,2589,2572,2586,2560,2588,2587,2559,2562,2553,2286,2555,2421,2571,2280,2544,2553,2643,2659,2684,2692,2702,2683,2726,2720,2684,2710,2699,2701,2694,2483,2713,2704,2657,2741,,,,,,,,,,,,,,,,,,,,,,,,,,,,,,,,,,,,,,,,,,,,,,,,,,,,,,,,,,,,,,,,,,,,,,,,,
2506,2609,2560,2565,2580,2573,2565,2580,2543,2578,2578,2570,2554,2551,2281,2556,2407,2565,2274,2521,2553,2640,2668,2675,2678,2690,2671,2707,2708,2671,2708,2686,2684,2682,2465,2686,2684,2637,2709,,,,,,,,,,,,,,,,,,,,,,,,,,,,,,,,,,,,,,,,,,,,,,,,,,,,,,,,,,,,,,,,,,,,,,,,,
2516,2612,2563,2580,2591,2582,2578,2596,2555,2600,2587,2589,2572,2562,2300,2570,2417,2575,2279,2532,2565,2653,2665,2680,2688,2702,2681,2713,2729,2682,2723,2711,2695,2688,2468,2670,2676,2636,2707,,,,,,,,,,,,,,,,,,,,,,,,,,,,,,,,,,,,,,,,,,,,,,,,,,,,,,,,,,,,,,,,,,,,,,,,,
2501,2600,2565,2580,2582,2578,2576,2599,2562,2615,2589,2586,2571,2564,2298,2569,2417,2571,2275,2532,2559,2644,2654,2658,2675,2697,2682,2711,2689,2676,2683,2691,2673,2676,2459,2660,2673,2631,2693,,,,,,,,,,,,,,,,,,,,,,,,,,,,,,,,,,,,,,,,,,,,,,,,,,,,,,,,,,,,,,,,,,,,,,,,,
2490,2586,2559,2579,2595,2580,2572,2601,2580,2622,2611,2582,2568,2561,2297,2567,2416,2565,2278,2535,2563,2651,2663,2662,2679,2699,2684,2714,2684,2664,2686,2687,2688,2669,2461,2662,2675,2628,2685,,,,,,,,,,,,,,,,,,,,,,,,,,,,,,,,,,,,,,,,,,,,,,,,,,,,,,,,,,,,,,,,,,,,,,,,,
2498,2608,2566,2589,2607,2596,2580,2616,2596,2627,2611,2592,2578,2574,2309,2577,2426,2577,2287,2547,2576,2657,2665,2670,2682,2716,2691,2726,2693,2672,2685,2696,2680,2680,2470,2668,2682,2651,2699,,,,,,,,,,,,,,,,,,,,,,,,,,,,,,,,,,,,,,,,,,,,,,,,,,,,,,,,,,,,,,,,,,,,,,,,,
2472,2594,2546,2573,2582,2570,2555,2582,2560,2600,2591,2560,2571,2544,2287,2556,2398,2551,2271,2517,2547,2632,2636,2636,2652,2682,2664,2695,2665,2640,2655,2667,2652,2646,2451,2636,2660,2618,2665,,,,,,,,,,,,,,,,,,,,,,,,,,,,,,,,,,,,,,,,,,,,,,,,,,,,,,,,,,,,,,,,,,,,,,,,,
2469,2580,2535,2568,2570,2561,2548,2571,2545,2581,2580,2545,2562,2525,2268,2539,2384,2538,2255,2502,2540,2627,2636,2634,2641,2665,2642,2674,2668,2631,2659,2646,2639,2638,2432,2626,2647,2603,2645,,,,,,,,,,,,,,,,,,,,,,,,,,,,,,,,,,,,,,,,,,,,,,,,,,,,,,,,,,,,,,,,,,,,,,,,,
2444,2572,2519,2556,2559,2551,2536,2568,2534,2567,2566,2542,2548,2514,2254,2529,2386,2531,2248,2490,2531,2614,2628,2633,2653,2662,2634,2666,2661,2629,2660,2646,2641,2643,2440,2627,2647,2609,2644,,,,,,,,,,,,,,,,,,,,,,,,,,,,,,,,,,,,,,,,,,,,,,,,,,,,,,,,,,,,,,,,,,,,,,,,,
2439,2580,2524,2565,2574,2558,2556,2578,2533,2570,2568,2546,2547,2523,2259,2531,2378,2533,2244,2496,2541,2634,2642,2648,2661,2676,2642,2666,2669,2640,2670,2668,2662,2664,2449,2654,2655,2595,2643,,,,,,,,,,,,,,,,,,,,,,,,,,,,,,,,,,,,,,,,,,,,,,,,,,,,,,,,,,,,,,,,,,,,,,,,,
2434,2568,2521,2559,2559,2555,2554,2574,2541,2567,2567,2554,2549,2522,2258,2523,2376,2527,2241,2481,2535,2629,2639,2646,2657,2664,2637,2676,2668,2643,2660,2671,2663,2661,2456,2654,2650,2600,2623,,,,,,,,,,,,,,,,,,,,,,,,,,,,,,,,,,,,,,,,,,,,,,,,,,,,,,,,,,,,,,,,,,,,,,,,,
2403,2567,2532,2555,2562,2567,2557,2575,2534,2578,2561,2537,2548,2515,2256,2523,2372,2525,2240,2481,2530,2616,2631,2637,2646,2673,2638,2675,2667,2644,2653,2667,2654,2653,2450,2644,2645,2609,2623,,,,,,,,,,,,,,,,,,,,,,,,,,,,,,,,,,,,,,,,,,,,,,,,,,,,,,,,,,,,,,,,,,,,,,,,,
2369,2567,2512,2552,2569,2560,2548,2568,2531,2561,2564,2535,2541,2514,2255,2515,2370,2523,2230,2476,2516,2607,2616,2621,2640,2669,2643,2669,2656,2629,2648,2656,2644,2638,2444,2637,2637,2595,2605,,,,,,,,,,,,,,,,,,,,,,,,,,,,,,,,,,,,,,,,,,,,,,,,,,,,,,,,,,,,,,,,,,,,,,,,,
2361,2562,2514,2552,2556,2545,2538,2556,2524,2555,2545,2533,2528,2506,2245,2517,2359,2523,2220,2461,2510,2599,2611,2613,2618,2656,2632,2662,2641,2621,2635,2648,2629,2623,2433,2632,2631,2593,2590,,,,,,,,,,,,,,,,,,,,,,,,,,,,,,,,,,,,,,,,,,,,,,,,,,,,,,,,,,,,,,,,,,,,,,,,,
2344,2540,2490,2525,2527,2523,2520,2527,2490,2519,2516,2497,2510,2482,2218,2476,2335,2485,2207,2437,2485,2569,2573,2580,2589,2622,2601,2631,2612,2588,2601,2613,2598,2599,2409,2599,2613,2566,2556,,,,,,,,,,,,,,,,,,,,,,,,,,,,,,,,,,,,,,,,,,,,,,,,,,,,,,,,,,,,,,,,,,,,,,,,,
2494,2573,2629,2480,2473,2609,2623,2624,2625,2647,2337,2663,2485,2642,2594,2590,2580,2344,2583,2588,2637,2662,2671,2680,2683,2661,2671,2676,2677,2681,2545,2676,2663,2659,2692,2667,2680,2648,2683,,,,,,,,,,,,,,,,,,,,,,,,,,,,,,,,,,,,,,,,,,,,,,,,,,,,,,,,,,,,,,,,,,,,,,,,,
2521,2605,2666,2516,2498,2641,2646,2656,2647,2684,2356,2691,2511,2667,2620,2613,2606,2364,2613,2619,2669,2688,2695,2711,2710,2696,2692,2706,2706,2724,2570,2693,2683,2704,2702,2687,2698,2670,2704,,,,,,,,,,,,,,,,,,,,,,,,,,,,,,,,,,,,,,,,,,,,,,,,,,,,,,,,,,,,,,,,,,,,,,,,,
2493,2593,2644,2492,2490,2632,2632,2644,2644,2683,2352,2686,2495,2656,2614,2603,2604,2352,2598,2607,2657,2678,2690,2696,2706,2687,2685,2683,2696,2709,2560,2689,2666,2684,2681,2665,2676,2647,2683,,,,,,,,,,,,,,,,,,,,,,,,,,,,,,,,,,,,,,,,,,,,,,,,,,,,,,,,,,,,,,,,,,,,,,,,,
2496,2611,2650,2506,2507,2650,2638,2651,2668,2681,2353,2708,2507,2675,2635,2622,2620,2368,2619,2620,2670,2701,2701,2710,2724,2702,2699,2693,2716,2710,2577,2715,2668,2683,2678,2659,2674,2643,2692,,,,,,,,,,,,,,,,,,,,,,,,,,,,,,,,,,,,,,,,,,,,,,,,,,,,,,,,,,,,,,,,,,,,,,,,,
2498,2618,2679,2523,2521,2674,2655,2662,2661,2698,2366,2708,2514,2685,2642,2630,2629,2374,2630,2632,2682,2714,2710,2723,2738,2707,2705,2697,2726,2713,2584,2718,2677,2695,2693,2670,2681,2657,2700,,,,,,,,,,,,,,,,,,,,,,,,,,,,,,,,,,,,,,,,,,,,,,,,,,,,,,,,,,,,,,,,,,,,,,,,,
2499,2620,2674,2522,2521,2663,2656,2661,2670,2704,2366,2706,2524,2690,2649,2638,2632,2379,2638,2641,2688,2716,2721,2739,2745,2710,2712,2705,2727,2724,2589,2717,2682,2698,2691,2677,2684,2659,2705,,,,,,,,,,,,,,,,,,,,,,,,,,,,,,,,,,,,,,,,,,,,,,,,,,,,,,,,,,,,,,,,,,,,,,,,,
2487,2613,2679,2518,2516,2650,2651,2654,2660,2690,2361,2706,2517,2696,2648,2628,2617,2379,2627,2632,2679,2708,2724,2726,2740,2711,2704,2691,2737,2713,2591,2718,2673,2715,2695,2675,2683,2659,2704,,,,,,,,,,,,,,,,,,,,,,,,,,,,,,,,,,,,,,,,,,,,,,,,,,,,,,,,,,,,,,,,,,,,,,,,,
2482,2612,2685,2521,2525,2655,2652,2663,2663,2702,2372,2714,2521,2703,2655,2632,2624,2384,2635,2630,2680,2713,2726,2734,2748,2716,2714,2713,2744,2729,2592,2739,2691,2722,2712,2696,2711,2696,2715,,,,,,,,,,,,,,,,,,,,,,,,,,,,,,,,,,,,,,,,,,,,,,,,,,,,,,,,,,,,,,,,,,,,,,,,,
2489,2620,2690,2533,2534,2672,2664,2678,2678,2720,2380,2721,2529,2712,2667,2640,2641,2390,2643,2630,2692,2737,2745,2750,2757,2723,2723,2735,2730,2739,2603,2739,2704,2734,2715,2716,2708,2691,2714,,,,,,,,,,,,,,,,,,,,,,,,,,,,,,,,,,,,,,,,,,,,,,,,,,,,,,,,,,,,,,,,,,,,,,,,,
2419,2552,2620,2468,2461,2592,2590,2607,2610,2650,2338,2647,2465,2626,2586,2567,2566,2321,2569,2567,2620,2663,2664,2674,2680,2655,2650,2651,2685,2670,2523,2681,2643,2661,2650,2641,2635,2575,2579,,,,,,,,,,,,,,,,,,,,,,,,,,,,,,,,,,,,,,,,,,,,,,,,,,,,,,,,,,,,,,,,,,,,,,,,,
2439,2565,2641,2492,2479,2613,2617,2623,2628,2671,2337,2666,2485,2649,2607,2576,2584,2337,2583,2592,2634,2681,2683,2697,2698,2675,2681,2668,2710,2690,2564,2714,2655,2677,2668,2655,2663,2590,2592,,,,,,,,,,,,,,,,,,,,,,,,,,,,,,,,,,,,,,,,,,,,,,,,,,,,,,,,,,,,,,,,,,,,,,,,,
2416,2547,2618,2473,2453,2583,2595,2603,2610,2641,2310,2644,2473,2628,2588,2564,2561,2314,2552,2567,2617,2654,2664,2674,2677,2653,2655,2640,2672,2657,2551,2678,2625,2650,2641,2626,2632,2607,2626,,,,,,,,,,,,,,,,,,,,,,,,,,,,,,,,,,,,,,,,,,,,,,,,,,,,,,,,,,,,,,,,,,,,,,,,,
2432,2567,2635,2488,2476,2607,2607,2621,2634,2660,2322,2656,2485,2652,2600,2581,2578,2329,2564,2587,2629,2666,2677,2692,2690,2671,2674,2669,2688,2687,2565,2698,2652,2675,2670,2652,2662,2638,2628,,,,,,,,,,,,,,,,,,,,,,,,,,,,,,,,,,,,,,,,,,,,,,,,,,,,,,,,,,,,,,,,,,,,,,,,,
2447,2590,2653,2495,2499,2621,2621,2634,2641,2672,2346,2671,2496,2657,2608,2589,2591,2340,2582,2600,2643,2678,2689,2703,2700,2682,2698,2689,2709,2705,2585,2715,2674,2707,2691,2669,2682,2662,2645,,,,,,,,,,,,,,,,,,,,,,,,,,,,,,,,,,,,,,,,,,,,,,,,,,,,,,,,,,,,,,,,,,,,,,,,,
2464,2611,2674,2519,2519,2645,2640,2653,2668,2687,2365,2686,2507,2672,2621,2601,2606,2352,2604,2622,2665,2704,2700,2722,2720,2686,2701,2737,2723,2751,2601,2729,2718,2743,2729,2702,2725,2694,2676,,,,,,,,,,,,,,,,,,,,,,,,,,,,,,,,,,,,,,,,,,,,,,,,,,,,,,,,,,,,,,,,,,,,,,,,,
2611,2737,2796,2626,2626,2768,2748,2769,2766,2793,2453,2779,2595,2753,2702,2699,2701,2436,2677,2692,2757,2795,2806,2810,2820,2782,2799,2859,2812,2885,2702,2836,2827,2856,2865,2819,2862,2802,2806,,,,,,,,,,,,,,,,,,,,,,,,,,,,,,,,,,,,,,,,,,,,,,,,,,,,,,,,,,,,,,,,,,,,,,,,,
#,raw_row_delta_max,,,,,,,,,,,,,,,,,,,,,,,,,,,,,,,,,,,,,,,,,,,,,,,,,,,,,,,,,,,,,,,,,,,,,,,,,,,,,,,,,,,,,,,,,,,,,,,,,,,,,,,,,,,,,,
2000,2000,189,188,192,186,189,191,196,196,197,199,198,196,192,196,193,196,199,204,206,200,201,208,203,197,210,213,216,214,208,200,200,200,201,190,151,219,1000,,,,,,,,,,,,,,,,,,,,,,,,,,,,,,,,,,,,,,,,,,,,,,,,,,,,,,,,,,,,,,,,,,,,,,,,,
2000,2000,203,205,210,207,210,215,216,220,218,214,213,216,199,217,215,216,216,221,227,224,219,232,225,235,231,231,226,226,233,235,228,223,216,217,213,183,275,,,,,,,,,,,,,,,,,,,,,,,,,,,,,,,,,,,,,,,,,,,,,,,,,,,,,,,,,,,,,,,,,,,,,,,,,
251,314,215,220,220,222,223,230,225,222,222,226,228,221,222,226,233,233,223,234,217,221,229,214,228,224,223,237,235,240,233,231,230,228,222,228,230,229,195,,,,,,,,,,,,,,,,,,,,,,,,,,,,,,,,,,,,,,,,,,,,,,,,,,,,,,,,,,,,,,,,,,,,,,,,,
182,211,208,208,209,210,212,212,217,211,212,217,215,220,217,217,215,221,215,207,222,221,221,217,217,218,219,207,213,214,216,212,216,210,217,228,222,218,216,,,,,,,,,,,,,,,,,,,,,,,,,,,,,,,,,,,,,,,,,,,,,,,,,,,,,,,,,,,,,,,,,,,,,,,,,
209,220,227,228,226,229,231,232,229,227,229,229,231,224,220,223,221,227,221,229,231,229,229,227,233,235,227,229,247,236,238,242,235,233,224,215,221,223,216,,,,,,,,,,,,,,,,,,,,,,,,,,,,,,,,,,,,,,,,,,,,,,,,,,,,,,,,,,,,,,,,,,,,,,,,,
198,206,202,202,204,206,208,212,211,213,214,215,212,208,206,210,207,208,206,211,212,210,209,207,208,209,213,213,196,220,221,201,206,221,208,209,209,212,198,,,,,,,,,,,,,,,,,,,,,,,,,,,,,,,,,,,,,,,,,,,,,,,,,,,,,,,,,,,,,,,,,,,,,,,,,
209,215,214,213,218,221,216,217,219,219,219,214,215,215,217,224,217,218,214,221,219,222,222,220,222,217,216,221,218,211,238,224,246,211,220,220,218,222,212,,,,,,,,,,,,,,,,,,,,,,,,,,,,,,,,,,,,,,,,,,,,,,,,,,,,,,,,,,,,,,,,,,,,,,,,,
223,236,239,236,237,239,238,239,242,240,235,241,239,244,232,245,234,244,230,242,242,243,242,247,250,243,242,240,242,234,222,238,221,230,229,237,230,245,236,,,,,,,,,,,,,,,,,,,,,,,,,,,,,,,,,,,,,,,,,,,,,,,,,,,,,,,,,,,,,,,,,,,,,,,,,
184,189,191,194,192,190,193,197,194,191,200,193,195,193,196,196,201,201,206,200,197,195,196,197,201,199,196,194,198,195,197,197,198,198,207,201,197,181,184,,,,,,,,,,,,,,,,,,,,,,,,,,,,,,,,,,,,,,,,,,,,,,,,,,,,,,,,,,,,,,,,,,,,,,,,,
205,217,216,220,218,216,213,218,215,219,215,213,221,220,211,218,214,215,203,222,223,219,222,225,221,222,222,222,221,222,222,219,220,221,214,222,226,218,211,,,,,,,,,,,,,,,,,,,,,,,,,,,,,,,,,,,,,,,,,,,,,,,,,,,,,,,,,,,,,,,,,,,,,,,,,
230,237,237,233,233,236,237,238,241,230,239,238,227,232,231,237,247,243,229,231,232,231,234,233,240,239,236,235,238,241,242,246,239,238,244,236,244,246,237,,,,,,,,,,,,,,,,,,,,,,,,,,,,,,,,,,,,,,,,,,,,,,,,,,,,,,,,,,,,,,,,,,,,,,,,,
213,221,218,223,229,222,222,221,213,220,212,212,213,211,209,210,201,211,210,213,216,216,216,216,218,221,213,214,218,219,218,218,217,215,207,223,223,219,214,,,,,,,,,,,,,,,,,,,,,,,,,,,,,,,,,,,,,,,,,,,,,,,,,,,,,,,,,,,,,,,,,,,,,,,,,
210,207,216,214,206,216,213,214,225,213,220,227,223,217,210,215,213,218,207,212,212,214,214,217,218,213,214,220,213,214,215,212,211,220,220,223,224,222,212,,,,,,,,,,,,,,,,,,,,,,,,,,,,,,,,,,,,,,,,,,,,,,,,,,,,,,,,,,,,,,,,,,,,,,,,,
219,214,223,215,212,213,212,216,203,226,218,210,217,214,214,222,213,215,211,220,213,219,217,214,217,222,217,215,216,215,215,213,218,215,212,219,217,221,211,,,,,,,,,,,,,,,,,,,,,,,,,,,,,,,,,,,,,,,,,,,,,,,,,,,,,,,,,,,,,,,,,,,,,,,,,
198,210,197,212,212,203,203,205,206,198,222,204,206,217,205,209,208,206,201,206,207,204,202,209,207,207,207,205,210,208,207,209,206,206,206,206,211,211,212,,,,,,,,,,,,,,,,,,,,,,,,,,,,,,,,,,,,,,,,,,,,,,,,,,,,,,,,,,,,,,,,,,,,,,,,,
197,207,204,203,205,203,200,201,206,201,194,204,204,195,201,218,205,214,198,198,202,203,203,205,207,204,206,205,203,208,203,202,204,206,205,207,205,206,197,,,,,,,,,,,,,,,,,,,,,,,,,,,,,,,,,,,,,,,,,,,,,,,,,,,,,,,,,,,,,,,,,,,,,,,,,
194,195,191,194,197,204,212,195,187,188,187,186,191,190,188,180,192,182,192,193,194,193,198,197,196,191,191,199,198,196,196,194,200,206,192,201,203,203,195,,,,,,,,,,,,,,,,,,,,,,,,,,,,,,,,,,,,,,,,,,,,,,,,,,,,,,,,,,,,,,,,,,,,,,,,,
780,830,880,702,708,887,878,929,942,929,549,938,676,957,1075,843,990,571,1048,810,837,801,772,780,785,734,764,835,772,859,581,755,831,837,1077,793,796,840,898,,,,,,,,,,,,,,,,,,,,,,,,,,,,,,,,,,,,,,,,,,,,,,,,,,,,,,,,,,,,,,,,,,,,,,,,,
285,272,273,273,268,269,259,274,267,265,250,265,262,274,274,270,266,263,269,266,264,264,266,271,267,269,269,275,276,269,269,272,274,280,265,279,281,282,280,,,,,,,,,,,,,,,,,,,,,,,,,,,,,,,,,,,,,,,,,,,,,,,,,,,,,,,,,,,,,,,,,,,,,,,,,
222,233,225,214,221,223,224,229,228,241,220,227,221,232,229,230,226,215,220,229,230,230,232,233,234,233,230,230,235,229,226,232,231,228,227,227,236,233,234,,,,,,,,,,,,,,,,,,,,,,,,,,,,,,,,,,,,,,,,,,,,,,,,,,,,,,,,,,,,,,,,,,,,,,,,,
242,235,230,228,224,229,225,227,245,220,230,244,232,233,236,239,232,226,227,227,233,235,234,235,236,236,240,237,240,237,240,235,236,235,232,246,245,248,251,,,,,,,,,,,,,,,,,,,,,,,,,,,,,,,,,,,,,,,,,,,,,,,,,,,,,,,,,,,,,,,,,,,,,,,,,
228,226,239,229,226,241,226,228,209,227,219,212,218,222,221,220,224,220,227,224,230,227,222,227,226,231,235,228,234,233,229,227,230,225,231,221,225,231,233,,,,,,,,,,,,,,,,,,,,,,,,,,,,,,,,,,,,,,,,,,,,,,,,,,,,,,,,,,,,,,,,,,,,,,,,,
213,219,200,214,214,195,208,209,209,208,209,208,212,213,215,217,214,214,215,209,214,214,212,221,220,223,216,220,228,235,217,222,226,215,207,215,216,233,236,,,,,,,,,,,,,,,,,,,,,,,,,,,,,,,,,,,,,,,,,,,,,,,,,,,,,,,,,,,,,,,,,,,,,,,,,
214,214,217,211,208,214,211,209,210,208,206,214,208,220,211,213,211,209,210,210,211,211,214,215,216,221,212,214,220,206,225,219,203,230,218,214,208,209,214,,,,,,,,,,,,,,,,,,,,,,,,,,,,,,,,,,,,,,,,,,,,,,,,,,,,,,,,,,,,,,,,,,,,,,,,,
215,221,223,226,223,224,222,224,224,221,216,225,222,216,222,225,223,220,221,221,224,228,226,225,233,233,228,236,225,231,225,228,229,212,223,228,234,239,222,,,,,,,,,,,,,,,,,,,,,,,,,,,,,,,,,,,,,,,,,,,,,,,,,,,,,,,,,,,,,,,,,,,,,,,,,
222,223,228,227,234,231,234,234,234,238,231,235,232,238,235,243,235,231,239,235,236,237,238,241,240,237,241,250,240,244,236,243,239,236,234,245,223,221,231,,,,,,,,,,,,,,,,,,,,,,,,,,,,,,,,,,,,,,,,,,,,,,,,,,,,,,,,,,,,,,,,,,,,,,,,,
171,175,172,183,178,169,173,169,176,167,180,173,173,169,175,177,172,172,172,174,175,173,171,177,179,175,181,166,170,172,172,172,170,163,174,170,179,174,172,,,,,,,,,,,,,,,,,,,,,,,,,,,,,,,,,,,,,,,,,,,,,,,,,,,,,,,,,,,,,,,,,,,,,,,,,
246,252,257,259,249,249,249,251,261,255,235,254,246,250,252,251,249,242,254,260,255,258,254,255,256,253,266,261,270,268,252,266,250,248,250,252,251,263,263,,,,,,,,,,,,,,,,,,,,,,,,,,,,,,,,,,,,,,,,,,,,,,,,,,,,,,,,,,,,,,,,,,,,,,,,,
215,202,202,195,200,198,196,196,203,205,199,202,214,200,201,199,207,200,200,200,198,195,202,199,206,212,209,204,197,207,224,193,203,200,200,201,210,201,201,,,,,,,,,,,,,,,,,,,,,,,,,,,,,,,,,,,,,,,,,,,,,,,,,,,,,,,,,,,,,,,,,,,,,,,,,
293,278,269,265,265,265,272,277,272,273,264,276,258,277,269,276,273,264,269,271,274,276,276,279,280,279,287,291,280,284,270,275,274,273,271,271,268,273,279,,,,,,,,,,,,,,,,,,,,,,,,,,,,,,,,,,,,,,,,,,,,,,,,,,,,,,,,,,,,,,,,,,,,,,,,,
253,265,262,256,254,257,252,251,251,249,243,253,246,248,251,249,252,247,254,248,248,249,253,256,263,264,282,268,253,253,254,261,261,259,262,259,269,273,282,,,,,,,,,,,,,,,,,,,,,,,,,,,,,,,,,,,,,,,,,,,,,,,,,,,,,,,,,,,,,,,,,,,,,,,,,
251,250,249,247,245,255,251,252,252,257,245,249,249,251,243,241,251,243,255,262,254,256,249,251,254,250,245,252,247,254,243,255,263,258,246,246,249,270,278,,,,,,,,,,,,,,,,,,,,,,,,,,,,,,,,,,,,,,,,,,,,,,,,,,,,,,,,,,,,,,,,,,,,,,,,,
1000,434,415,393,401,424,413,408,412,409,386,410,400,406,389,396,398,380,397,393,419,418,412,426,434,420,417,426,420,428,410,425,429,439,427,414,427,448,1000,,,,,,,,,,,,,,,,,,,,,,,,,,,,,,,,,,,,,,,,,,,,,,,,,,,,,,,,,,,,,,,,,,,,,,,,,
#,raw_row_delta_min,,,,,,,,,,,,,,,,,,,,,,,,,,,,,,,,,,,,,,,,,,,,,,,,,,,,,,,,,,,,,,,,,,,,,,,,,,,,,,,,,,,,,,,,,,,,,,,,,,,,,,,,,,,,,,
-2000,-2000,-381,-357,-350,-337,-336,-335,-334,-335,-333,-335,-332,-327,-316,-321,-314,-321,-311,-314,-311,-327,-322,-326,-345,-347,-338,-341,-345,-343,-342,-337,-341,-344,-344,-361,-429,-465,-1000,,,,,,,,,,,,,,,,,,,,,,,,,,,,,,,,,,,,,,,,,,,,,,,,,,,,,,,,,,,,,,,,,,,,,,,,,
-2000,-2000,-263,-264,-264,-263,-262,-266,-264,-265,-265,-260,-259,-265,-264,-260,-253,-254,-249,-258,-255,-264,-267,-253,-266,-275,-272,-274,-269,-269,-277,-281,-275,-274,-265,-274,-282,-356,-425,,,,,,,,,,,,,,,,,,,,,,,,,,,,,,,,,,,,,,,,,,,,,,,,,,,,,,,,,,,,,,,,,,,,,,,,,
-236,-171,-234,-230,-229,-232,-229,-233,-230,-226,-226,-228,-229,-222,-222,-223,-223,-224,-221,-213,-240,-230,-230,-247,-240,-236,-234,-224,-235,-238,-235,-233,-234,-235,-232,-237,-243,-256,-332,,,,,,,,,,,,,,,,,,,,,,,,,,,,,,,,,,,,,,,,,,,,,,,,,,,,,,,,,,,,,,,,,,,,,,,,,
-245,-253,-248,-244,-244,-243,-244,-244,-249,-243,-243,-245,-243,-247,-240,-244,-248,-253,-239,-261,-249,-250,-252,-249,-250,-252,-252,-264,-256,-256,-259,-258,-262,-257,-253,-244,-250,-263,-294,,,,,,,,,,,,,,,,,,,,,,,,,,,,,,,,,,,,,,,,,,,,,,,,,,,,,,,,,,,,,,,,,,,,,,,,,
-237,-224,-230,-228,-224,-225,-227,-229,-225,-222,-222,-223,-224,-217,-214,-218,-215,-220,-215,-220,-222,-219,-221,-218,-224,-226,-220,-222,-211,-222,-222,-213,-221,-221,-224,-243,-243,-231,-246,,,,,,,,,,,,,,,,,,,,,,,,,,,,,,,,,,,,,,,,,,,,,,,,,,,,,,,,,,,,,,,,,,,,,,,,,
-230,-214,-210,-210,-211,-210,-213,-215,-214,-214,-213,-215,-212,-211,-209,-213,-210,-211,-209,-215,-217,-216,-213,-212,-213,-214,-219,-219,-232,-211,-239,-233,-225,-207,-217,-220,-219,-224,-227,,,,,,,,,,,,,,,,,,,,,,,,,,,,,,,,,,,,,,,,,,,,,,,,,,,,,,,,,,,,,,,,,,,,,,,,,
-218,-212,-209,-208,-211,-213,-209,-208,-211,-211,-211,-208,-207,-207,-209,-216,-209,-210,-207,-210,-208,-210,-209,-210,-214,-210,-207,-213,-211,-219,-207,-218,-209,-228,-216,-217,-215,-222,-224,,,,,,,,,,,,,,,,,,,,,,,,,,,,,,,,,,,,,,,,,,,,,,,,,,,,,,,,,,,,,,,,,,,,,,,,,
-233,-234,-234,-232,-230,-232,-231,-232,-234,-232,-237,-231,-231,-236,-232,-235,-235,-235,-230,-234,-235,-238,-236,-240,-242,-236,-237,-235,-237,-238,-242,-233,-252,-239,-235,-244,-239,-218,-228,,,,,,,,,,,,,,,,,,,,,,,,,,,,,,,,,,,,,,,,,,,,,,,,,,,,,,,,,,,,,,,,,,,,,,,,,
-239,-234,-232,-235,-234,-232,-233,-237,-236,-231,-231,-233,-236,-234,-223,-237,-230,-239,-220,-238,-237,-237,-238,-238,-241,-239,-237,-236,-239,-237,-239,-239,-239,-240,-240,-244,-240,-248,-260,,,,,,,,,,,,,,,,,,,,,,,,,,,,,,,,,,,,,,,,,,,,,,,,,,,,,,,,,,,,,,,,,,,,,,,,,
-231,-233,-231,-236,-231,-229,-227,-231,-237,-231,-236,-234,-221,-231,-235,-241,-238,-238,-237,-235,-235,-234,-239,-241,-238,-241,-241,-238,-241,-243,-240,-238,-239,-239,-241,-242,-244,-245,-250,,,,,,,,,,,,,,,,,,,,,,,,,,,,,,,,,,,,,,,,,,,,,,,,,,,,,,,,,,,,,,,,,,,,,,,,,
-286,-283,-282,-278,-280,-282,-282,-282,-274,-275,-283,-273,-284,-276,-269,-273,-261,-279,-268,-277,-278,-277,-280,-279,-286,-285,-282,-283,-283,-287,-288,-290,-283,-281,-260,-280,-291,-281,-278,,,,,,,,,,,,,,,,,,,,,,,,,,,,,,,,,,,,,,,,,,,,,,,,,,,,,,,,,,,,,,,,,,,,,,,,,
-216,-203,-214,-217,-205,-217,-215,-215,-219,-213,-216,-220,-219,-215,-210,-218,-229,-220,-211,-214,-219,-217,-216,-217,-219,-222,-215,-215,-218,-220,-219,-218,-218,-217,-232,-220,-221,-229,-237,,,,,,,,,,,,,,,,,,,,,,,,,,,,,,,,,,,,,,,,,,,,,,,,,,,,,,,,,,,,,,,,,,,,,,,,,
-231,-242,-239,-236,-248,-237,-235,-237,-224,-236,-232,-218,-233,-230,-227,-232,-229,-237,-226,-233,-233,-236,-237,-238,-239,-235,-233,-239,-235,-233,-236,-235,-231,-239,-237,-240,-240,-238,-246,,,,,,,,,,,,,,,,,,,,,,,,,,,,,,,,,,,,,,,,,,,,,,,,,,,,,,,,,,,,,,,,,,,,,,,,,
-221,-213,-193,-204,-210,-203,-202,-207,-220,-204,-219,-232,-219,-215,-210,-216,-209,-211,-208,-215,-208,-214,-211,-209,-213,-216,-212,-210,-209,-209,-208,-206,-211,-209,-209,-213,-209,-215,-217,,,,,,,,,,,,,,,,,,,,,,,,,,,,,,,,,,,,,,,,,,,,,,,,,,,,,,,,,,,,,,,,,,,,,,,,,
-219,-208,-227,-223,-214,-217,-217,-220,-218,-226,-205,-217,-218,-207,-216,-222,-221,-221,-215,-222,-222,-221,-218,-225,-223,-222,-222,-221,-224,-224,-220,-222,-219,-220,-216,-219,-221,-220,-232,,,,,,,,,,,,,,,,,,,,,,,,,,,,,,,,,,,,,,,,,,,,,,,,,,,,,,,,,,,,,,,,,,,,,,,,,
-230,-224,-221,-221,-223,-223,-222,-222,-216,-223,-236,-213,-216,-229,-218,-212,-223,-214,-218,-224,-225,-225,-226,-226,-227,-226,-227,-225,-224,-225,-224,-223,-224,-224,-221,-224,-223,-219,-230,,,,,,,,,,,,,,,,,,,,,,,,,,,,,,,,,,,,,,,,,,,,,,,,,,,,,,,,,,,,,,,,,,,,,,,,,
-260,-254,-249,-252,-257,-239,-242,-253,-253,-250,-254,-255,-259,-256,-244,-269,-253,-264,-246,-256,-258,-255,-259,-258,-260,-253,-256,-262,-262,-259,-261,-257,-263,-270,-252,-264,-264,-266,-280,,,,,,,,,,,,,,,,,,,,,,,,,,,,,,,,,,,,,,,,,,,,,,,,,,,,,,,,,,,,,,,,,,,,,,,,,
-647,-795,-752,-873,-851,-766,-749,-755,-734,-747,-1005,-706,-819,-717,-354,-697,-529,-959,-303,-553,-632,-679,-706,-715,-735,-736,-741,-770,-760,-713,-887,-768,-769,-780,-589,-760,-748,-788,-757,,,,,,,,,,,,,,,,,,,,,,,,,,,,,,,,,,,,,,,,,,,,,,,,,,,,,,,,,,,,,,,,,,,,,,,,,
-200,-196,-196,-179,-192,-189,-204,-194,-198,-187,-188,-195,-194,-205,-202,-199,-194,-192,-196,-196,-192,-191,-193,-197,-193,-195,-197,-202,-202,-198,-200,-202,-204,-210,-219,-212,-215,-220,-237,,,,,,,,,,,,,,,,,,,,,,,,,,,,,,,,,,,,,,,,,,,,,,,,,,,,,,,,,,,,,,,,,,,,,,,,,
-288,-263,-256,-263,-250,-252,-243,-235,-244,-238,-236,-243,-238,-246,-244,-246,-245,-238,-244,-245,-247,-247,-250,-251,-252,-252,-249,-245,-249,-245,-242,-249,-251,-249,-249,-248,-257,-256,-268,,,,,,,,,,,,,,,,,,,,,,,,,,,,,,,,,,,,,,,,,,,,,,,,,,,,,,,,,,,,,,,,,,,,,,,,,
-228,-217,-211,-211,-209,-212,-215,-231,-203,-228,-210,-211,-211,-212,-213,-209,-210,-207,-207,-208,-213,-215,-212,-216,-216,-215,-219,-217,-221,-216,-221,-216,-218,-214,-224,-227,-225,-229,-242,,,,,,,,,,,,,,,,,,,,,,,,,,,,,,,,,,,,,,,,,,,,,,,,,,,,,,,,,,,,,,,,,,,,,,,,,
-215,-204,-195,-210,-206,-191,-199,-199,-212,-197,-202,-207,-201,-205,-206,-208,-206,-204,-208,-207,-212,-210,-205,-208,-206,-212,-214,-211,-216,-218,-213,-211,-212,-208,-202,-205,-212,-216,-223,,,,,,,,,,,,,,,,,,,,,,,,,,,,,,,,,,,,,,,,,,,,,,,,,,,,,,,,,,,,,,,,,,,,,,,,,
-219,-220,-224,-214,-215,-225,-215,-217,-214,-215,-204,-214,-206,-207,-211,-213,-209,-209,-211,-207,-211,-209,-207,-214,-215,-217,-210,-212,-225,-208,-212,-216,-205,-210,-214,-209,-211,-225,-238,,,,,,,,,,,,,,,,,,,,,,,,,,,,,,,,,,,,,,,,,,,,,,,,,,,,,,,,,,,,,,,,,,,,,,,,,
-225,-219,-220,-213,-209,-214,-211,-211,-210,-206,-203,-213,-205,-203,-208,-212,-210,-209,-210,-209,-212,-212,-210,-212,-216,-220,-211,-220,-215,-235,-223,-217,-225,-205,-218,-220,-216,-217,-220,,,,,,,,,,,,,,,,,,,,,,,,,,,,,,,,,,,,,,,,,,,,,,,,,,,,,,,,,,,,,,,,,,,,,,,,,
-210,-205,-207,-210,-207,-208,-204,-205,-207,-203,-202,-204,-205,-212,-206,-210,-207,-205,-207,-208,-208,-213,-209,-209,-214,-215,-210,-210,-210,-211,-208,-212,-210,-215,-205,-201,-192,-192,-218,,,,,,,,,,,,,,,,,,,,,,,,,,,,,,,,,,,,,,,,,,,,,,,,,,,,,,,,,,,,,,,,,,,,,,,,,
-215,-211,-215,-213,-220,-215,-218,-216,-216,-222,-211,-215,-212,-216,-216,-223,-217,-215,-221,-217,-219,-220,-220,-220,-220,-218,-223,-217,-220,-223,-217,-223,-222,-219,-220,-211,-235,-237,-226,,,,,,,,,,,,,,,,,,,,,,,,,,,,,,,,,,,,,,,,,,,,,,,,,,,,,,,,,,,,,,,,,,,,,,,,,
-294,-298,-292,-297,-299,-296,-300,-296,-303,-294,-280,-301,-292,-303,-299,-301,-297,-287,-297,-299,-302,-301,-298,-304,-308,-299,-305,-317,-296,-302,-295,-298,-300,-303,-304,-326,-308,-304,-301,,,,,,,,,,,,,,,,,,,,,,,,,,,,,,,,,,,,,,,,,,,,,,,,,,,,,,,,,,,,,,,,,,,,,,,,,
-227,-224,-230,-231,-223,-223,-219,-220,-230,-223,-230,-223,-225,-224,-222,-223,-223,-228,-230,-234,-228,-230,-228,-227,-228,-235,-235,-232,-223,-238,-229,-214,-223,-222,-223,-219,-224,-240,-240,,,,,,,,,,,,,,,,,,,,,,,,,,,,,,,,,,,,,,,,,,,,,,,,,,,,,,,,,,,,,,,,,,,,,,,,,
-258,-247,-247,-239,-239,-245,-242,-240,-245,-248,-238,-248,-228,-245,-247,-247,-254,-244,-250,-249,-248,-245,-253,-248,-254,-257,-254,-249,-255,-252,-242,-258,-247,-247,-241,-247,-253,-247,-257,,,,,,,,,,,,,,,,,,,,,,,,,,,,,,,,,,,,,,,,,,,,,,,,,,,,,,,,,,,,,,,,,,,,,,,,,
-248,-225,-218,-216,-213,-211,-219,-222,-217,-216,-217,-221,-237,-223,-228,-223,-233,-223,-221,-223,-225,-225,-223,-227,-225,-222,-239,-232,-234,-226,-241,-231,-223,-218,-214,-221,-216,-219,-232,,,,,,,,,,,,,,,,,,,,,,,,,,,,,,,,,,,,,,,,,,,,,,,,,,,,,,,,,,,,,,,,,,,,,,,,,
-210,-214,-211,-207,-206,-203,-204,-206,-207,-204,-204,-210,-208,-207,-212,-211,-212,-210,-213,-208,-207,-207,-212,-214,-220,-223,-216,-224,-207,-208,-210,-212,-209,-205,-213,-207,-215,-216,-233,,,,,,,,,,,,,,,,,,,,,,,,,,,,,,,,,,,,,,,,,,,,,,,,,,,,,,,,,,,,,,,,,,,,,,,,,
-213,-209,-206,-205,-202,-207,-211,-213,-217,-222,-218,-220,-223,-225,-217,-223,-226,-218,-211,-214,-221,-221,-214,-218,-222,-232,-242,-221,-219,-222,-213,-224,-230,-218,-209,-206,-210,-234,-247,,,,,,,,,,,,,,,,,,,,,,,,,,,,,,,,,,,,,,,,,,,,,,,,,,,,,,,,,,,,,,,,,,,,,,,,,
-1000,-145,-138,-141,-146,-148,-160,-154,-163,-156,-164,-164,-167,-161,-148,-157,-163,-164,-176,-190,-176,-178,-173,-180,-180,-179,-176,-184,-180,-184,-176,-178,-181,-166,-166,-158,-163,-166,-1000,,,,,,,,,,,,,,,,,,,,,,,,,,,,,,,,,,,,,,,,,,,,,,,,,,,,,,,,,,,,,,,,,,,,,,,,,
#,raw_col_delta_max,,,,,,,,,,,,,,,,,,,,,,,,,,,,,,,,,,,,,,,,,,,,,,,,,,,,,,,,,,,,,,,,,,,,,,,,,,,,,,,,,,,,,,,,,,,,,,,,,,,,,,,,,,,,,,
2100,2100,388,392,376,371,399,367,410,371,428,389,386,600,679,600,547,600,657,540,485,415,403,424,414,394,428,380,378,416,396,392,405,345,806,472,592,1100,,,,,,,,,,,,,,,,,,,,,,,,,,,,,,,,,,,,,,,,,,,,,,,,,,,,,,,,,,,,,,,,,,,,,,,,,,
2100,2100,398,384,379,371,392,363,401,364,420,383,386,600,678,600,544,600,656,536,469,417,400,410,409,408,431,381,374,411,397,387,397,341,780,407,559,663,,,,,,,,,,,,,,,,,,,,,,,,,,,,,,,,,,,,,,,,,,,,,,,,,,,,,,,,,,,,,,,,,,,,,,,,,,
552,442,395,380,375,378,397,364,403,364,424,381,382,600,690,600,541,600,647,544,459,413,419,397,404,402,432,377,371,405,392,384,387,344,775,396,501,605,,,,,,,,,,,,,,,,,,,,,,,,,,,,,,,,,,,,,,,,,,,,,,,,,,,,,,,,,,,,,,,,,,,,,,,,,,
635,354,398,375,372,376,395,363,404,363,423,382,382,600,688,600,537,600,659,522,463,409,406,409,407,397,442,365,369,406,393,385,384,340,772,388,499,546,,,,,,,,,,,,,,,,,,,,,,,,,,,,,,,,,,,,,,,,,,,,,,,,,,,,,,,,,,,,,,,,,,,,,,,,,,
637,356,399,379,374,380,396,372,404,366,427,386,379,600,682,600,541,600,641,534,465,413,405,403,406,396,429,374,366,404,388,384,387,342,780,382,489,532,,,,,,,,,,,,,,,,,,,,,,,,,,,,,,,,,,,,,,,,,,,,,,,,,,,,,,,,,,,,,,,,,,,,,,,,,,
647,360,396,384,373,378,397,365,403,361,428,382,377,600,683,600,535,600,647,535,471,416,404,402,400,398,432,390,355,410,392,382,389,338,777,390,498,528,,,,,,,,,,,,,,,,,,,,,,,,,,,,,,,,,,,,,,,,,,,,,,,,,,,,,,,,,,,,,,,,,,,,,,,,,,
662,356,391,386,378,377,392,363,407,367,425,381,374,600,681,600,536,600,648,535,463,414,403,404,407,402,432,372,385,401,398,392,408,328,773,390,492,517,,,,,,,,,,,,,,,,,,,,,,,,,,,,,,,,,,,,,,,,,,,,,,,,,,,,,,,,,,,,,,,,,,,,,,,,,,
667,355,390,384,378,375,390,364,406,366,421,381,382,600,677,600,537,600,648,538,460,416,401,399,403,395,433,375,373,415,381,396,375,332,773,388,488,509,,,,,,,,,,,,,,,,,,,,,,,,,,,,,,,,,,,,,,,,,,,,,,,,,,,,,,,,,,,,,,,,,,,,,,,,,,
670,359,396,383,380,376,396,369,403,360,425,371,381,600,690,600,540,600,652,537,464,417,409,404,405,394,429,369,362,406,389,371,382,328,774,391,505,498,,,,,,,,,,,,,,,,,,,,,,,,,,,,,,,,,,,,,,,,,,,,,,,,,,,,,,,,,,,,,,,,,,,,,,,,,,
674,360,390,379,378,380,399,365,403,365,422,375,379,600,680,600,538,600,643,534,465,415,403,405,405,395,425,377,362,402,389,365,385,331,768,387,486,488,,,,,,,,,,,,,,,,,,,,,,,,,,,,,,,,,,,,,,,,,,,,,,,,,,,,,,,,,,,,,,,,,,,,,,,,,,
684,362,393,385,382,379,397,363,407,364,419,389,371,600,677,600,538,600,654,535,457,409,404,401,406,392,425,377,364,401,386,370,383,324,770,387,480,477,,,,,,,,,,,,,,,,,,,,,,,,,,,,,,,,,,,,,,,,,,,,,,,,,,,,,,,,,,,,,,,,,,,,,,,,,,
687,365,394,383,383,381,395,370,399,353,426,377,380,600,675,600,520,600,647,535,458,411,404,402,400,392,424,374,362,399,383,368,382,342,754,384,490,474,,,,,,,,,,,,,,,,,,,,,,,,,,,,,,,,,,,,,,,,,,,,,,,,,,,,,,,,,,,,,,,,,,,,,,,,,,
696,353,394,390,377,378,390,366,407,352,426,382,385,600,672,600,533,600,652,526,462,411,407,405,401,397,427,378,358,398,383,370,389,331,763,382,486,471,,,,,,,,,,,,,,,,,,,,,,,,,,,,,,,,,,,,,,,,,,,,,,,,,,,,,,,,,,,,,,,,,,,,,,,,,,
683,352,387,377,383,375,388,378,398,355,436,367,381,600,669,600,539,600,650,527,464,409,410,402,403,394,423,380,360,395,389,376,380,328,760,380,480,457,,,,,,,,,,,,,,,,,,,,,,,,,,,,,,,,,,,,,,,,,,,,,,,,,,,,,,,,,,,,,,,,,,,,,,,,,,
696,361,377,378,385,375,390,362,413,345,433,373,378,600,676,600,536,600,653,532,465,407,405,402,403,396,424,378,362,401,393,378,383,325,769,381,472,449,,,,,,,,,,,,,,,,,,,,,,,,,,,,,,,,,,,,,,,,,,,,,,,,,,,,,,,,,,,,,,,,,,,,,,,,,,
707,351,389,379,375,374,396,357,401,368,412,371,391,600,675,600,529,600,646,532,462,407,402,403,398,399,421,380,366,405,389,375,384,327,759,382,478,446,,,,,,,,,,,,,,,,,,,,,,,,,,,,,,,,,,,,,,,,,,,,,,,,,,,,,,,,,,,,,,,,,,,,,,,,,,
708,352,388,383,380,378,390,363,395,357,425,377,381,600,689,600,535,600,644,526,458,411,403,404,397,395,423,383,363,399,389,373,388,330,757,386,478,435,,,,,,,,,,,,,,,,,,,,,,,,,,,,,,,,,,,,,,,,,,,,,,,,,,,,,,,,,,,,,,,,,,,,,,,,,,
711,349,390,377,387,374,375,359,399,351,422,378,383,600,673,600,523,600,643,523,454,406,401,404,399,391,427,373,360,396,391,369,390,332,761,389,480,418,,,,,,,,,,,,,,,,,,,,,,,,,,,,,,,,,,,,,,,,,,,,,,,,,,,,,,,,,,,,,,,,,,,,,,,,,,
578,402,600,400,536,388,416,377,402,600,794,359,757,535,370,372,600,651,366,463,396,377,382,374,370,396,596,525,618,358,536,597,386,400,364,410,357,604,,,,,,,,,,,,,,,,,,,,,,,,,,,,,,,,,,,,,,,,,,,,,,,,,,,,,,,,,,,,,,,,,,,,,,,,,,
582,410,600,388,540,371,429,380,402,600,800,359,763,538,372,368,600,655,364,471,399,372,386,376,376,400,600,535,620,362,543,603,385,396,370,407,356,594,,,,,,,,,,,,,,,,,,,,,,,,,,,,,,,,,,,,,,,,,,,,,,,,,,,,,,,,,,,,,,,,,,,,,,,,,,
597,402,600,391,541,371,434,379,413,600,798,358,767,541,368,366,600,655,370,466,397,378,390,378,373,405,607,538,620,361,542,612,384,395,374,414,356,589,,,,,,,,,,,,,,,,,,,,,,,,,,,,,,,,,,,,,,,,,,,,,,,,,,,,,,,,,,,,,,,,,,,,,,,,,,
593,405,600,394,543,377,430,406,385,600,807,352,765,531,378,372,600,656,372,469,395,385,388,377,377,398,606,535,618,367,544,609,390,389,379,417,357,590,,,,,,,,,,,,,,,,,,,,,,,,,,,,,,,,,,,,,,,,,,,,,,,,,,,,,,,,,,,,,,,,,,,,,,,,,,
598,421,600,394,557,370,427,385,408,600,804,358,764,529,377,372,600,659,371,478,395,380,387,385,378,401,597,529,613,370,547,614,389,394,377,414,360,597,,,,,,,,,,,,,,,,,,,,,,,,,,,,,,,,,,,,,,,,,,,,,,,,,,,,,,,,,,,,,,,,,,,,,,,,,,
603,409,600,393,542,374,423,387,401,600,800,360,762,529,377,367,600,660,368,475,400,377,395,373,374,405,599,529,626,357,544,614,383,387,386,408,362,607,,,,,,,,,,,,,,,,,,,,,,,,,,,,,,,,,,,,,,,,,,,,,,,,,,,,,,,,,,,,,,,,,,,,,,,,,,
605,412,600,392,538,371,428,385,402,600,803,364,770,525,375,372,600,660,364,467,395,377,389,374,376,402,605,539,598,373,541,601,406,375,383,402,355,598,,,,,,,,,,,,,,,,,,,,,,,,,,,,,,,,,,,,,,,,,,,,,,,,,,,,,,,,,,,,,,,,,,,,,,,,,,
610,409,600,394,542,367,425,379,404,600,804,363,762,532,374,373,600,661,365,471,388,383,395,380,375,396,603,531,603,364,537,603,390,385,383,414,359,571,,,,,,,,,,,,,,,,,,,,,,,,,,,,,,,,,,,,,,,,,,,,,,,,,,,,,,,,,,,,,,,,,,,,,,,,,,
612,403,600,399,545,368,422,382,401,600,802,365,769,532,383,378,600,660,367,468,390,386,400,376,378,398,614,528,610,369,541,601,386,381,391,400,355,574,,,,,,,,,,,,,,,,,,,,,,,,,,,,,,,,,,,,,,,,,,,,,,,,,,,,,,,,,,,,,,,,,,,,,,,,,,
612,407,600,390,533,367,423,386,406,600,783,363,752,530,373,372,600,649,364,467,393,387,398,379,381,410,590,526,610,375,540,593,382,378,378,412,354,567,,,,,,,,,,,,,,,,,,,,,,,,,,,,,,,,,,,,,,,,,,,,,,,,,,,,,,,,,,,,,,,,,,,,,,,,,,
612,414,600,390,534,373,432,385,407,600,797,365,760,534,373,377,600,654,362,459,394,386,401,383,373,404,593,545,600,368,554,590,386,382,379,414,361,568,,,,,,,,,,,,,,,,,,,,,,,,,,,,,,,,,,,,,,,,,,,,,,,,,,,,,,,,,,,,,,,,,,,,,,,,,,
615,402,600,397,532,372,433,385,394,600,790,373,742,529,372,370,600,652,362,462,393,380,383,370,369,411,591,535,597,382,524,598,383,385,384,414,364,564,,,,,,,,,,,,,,,,,,,,,,,,,,,,,,,,,,,,,,,,,,,,,,,,,,,,,,,,,,,,,,,,,,,,,,,,,,
618,398,600,397,535,374,430,385,402,600,792,353,758,523,384,362,600,656,365,466,395,386,390,381,379,401,601,533,605,367,529,607,385,388,388,416,365,555,,,,,,,,,,,,,,,,,,,,,,,,,,,,,,,,,,,,,,,,,,,,,,,,,,,,,,,,,,,,,,,,,,,,,,,,,,
621,402,600,397,539,369,428,383,406,600,794,352,756,526,383,364,600,660,365,463,390,384,390,380,380,414,583,534,617,373,538,604,393,388,383,419,360,562,,,,,,,,,,,,,,,,,,,,,,,,,,,,,,,,,,,,,,,,,,,,,,,,,,,,,,,,,,,,,,,,,,,,,,,,,,
622,415,600,406,541,377,425,383,412,600,789,356,757,528,377,379,600,670,372,461,398,386,393,388,361,418,599,533,618,362,545,609,400,388,392,426,381,547,,,,,,,,,,,,,,,,,,,,,,,,,,,,,,,,,,,,,,,,,,,,,,,,,,,,,,,,,,,,,,,,,,,,,,,,,,
1100,429,600,418,563,361,436,389,427,600,812,367,779,535,389,382,600,683,373,487,413,390,403,400,367,424,616,546,625,369,563,626,416,395,409,441,393,1100,,,,,,,,,,,,,,,,,,,,,,,,,,,,,,,,,,,,,,,,,,,,,,,,,,,,,,,,,,,,,,,,,,,,,,,,,,
#,raw_col_delta_min,,,,,,,,,,,,,,,,,,,,,,,,,,,,,,,,,,,,,,,,,,,,,,,,,,,,,,,,,,,,,,,,,,,,,,,,,,,,,,,,,,,,,,,,,,,,,,,,,,,,,,,,,,,,,,
-2100,-2100,-414,-421,-385,-389,-393,-410,-371,-414,-409,-428,-395,-717,-600,-540,-600,-863,-600,-350,-320,-376,-381,-373,-398,-415,-383,-394,-408,-370,-388,-399,-376,-757,-344,-360,-570,-1100,,,,,,,,,,,,,,,,,,,,,,,,,,,,,,,,,,,,,,,,,,,,,,,,,,,,,,,,,,,,,,,,,,,,,,,,,,
-2100,-2100,-401,-403,-382,-384,-384,-401,-363,-404,-401,-420,-393,-709,-600,-533,-600,-853,-600,-340,-327,-372,-375,-384,-401,-407,-385,-396,-405,-370,-392,-398,-372,-751,-346,-403,-505,-371,,,,,,,,,,,,,,,,,,,,,,,,,,,,,,,,,,,,,,,,,,,,,,,,,,,,,,,,,,,,,,,,,,,,,,,,,,
-480,-343,-397,-395,-379,-389,-386,-399,-362,-406,-404,-419,-392,-714,-600,-528,-600,-846,-600,-339,-330,-375,-365,-390,-395,-402,-388,-393,-403,-366,-389,-397,-365,-752,-348,-404,-551,-289,,,,,,,,,,,,,,,,,,,,,,,,,,,,,,,,,,,,,,,,,,,,,,,,,,,,,,,,,,,,,,,,,,,,,,,,,,
-435,-418,-390,-388,-377,-382,-382,-399,-361,-404,-401,-418,-392,-711,-600,-528,-600,-848,-600,-363,-320,-364,-383,-382,-397,-397,-375,-392,-399,-371,-389,-400,-366,-750,-345,-399,-563,-339,,,,,,,,,,,,,,,,,,,,,,,,,,,,,,,,,,,,,,,,,,,,,,,,,,,,,,,,,,,,,,,,,,,,,,,,,,
-416,-418,-388,-391,-377,-386,-383,-407,-363,-405,-402,-423,-387,-711,-600,-532,-600,-843,-600,-347,-325,-369,-384,-377,-397,-395,-385,-388,-395,-370,-388,-400,-369,-742,-332,-405,-572,-357,,,,,,,,,,,,,,,,,,,,,,,,,,,,,,,,,,,,,,,,,,,,,,,,,,,,,,,,,,,,,,,,,,,,,,,,,,
-402,-420,-381,-394,-373,-384,-386,-400,-360,-398,-405,-418,-385,-712,-600,-528,-600,-844,-600,-348,-329,-374,-383,-376,-391,-399,-388,-375,-406,-375,-379,-413,-372,-749,-358,-406,-567,-375,,,,,,,,,,,,,,,,,,,,,,,,,,,,,,,,,,,,,,,,,,,,,,,,,,,,,,,,,,,,,,,,,,,,,,,,,,
-393,-417,-376,-396,-376,-383,-379,-397,-362,-404,-402,-417,-383,-708,-600,-529,-600,-842,-600,-348,-323,-370,-383,-377,-398,-404,-387,-387,-391,-392,-399,-409,-359,-763,-355,-404,-565,-380,,,,,,,,,,,,,,,,,,,,,,,,,,,,,,,,,,,,,,,,,,,,,,,,,,,,,,,,,,,,,,,,,,,,,,,,,,
-384,-413,-375,-393,-374,-383,-375,-398,-361,-403,-399,-416,-390,-709,-600,-532,-600,-853,-600,-349,-319,-372,-383,-375,-395,-395,-389,-390,-395,-368,-408,-381,-381,-746,-356,-403,-563,-384,,,,,,,,,,,,,,,,,,,,,,,,,,,,,,,,,,,,,,,,,,,,,,,,,,,,,,,,,,,,,,,,,,,,,,,,,,
-376,-415,-380,-390,-376,-383,-382,-400,-359,-407,-391,-408,-390,-713,-600,-538,-600,-854,-600,-350,-324,-373,-390,-378,-398,-396,-385,-385,-392,-374,-390,-392,-365,-739,-358,-408,-545,-392,,,,,,,,,,,,,,,,,,,,,,,,,,,,,,,,,,,,,,,,,,,,,,,,,,,,,,,,,,,,,,,,,,,,,,,,,,
-369,-414,-374,-386,-373,-386,-385,-399,-357,-403,-398,-412,-388,-707,-600,-530,-600,-837,-600,-349,-327,-371,-384,-378,-399,-398,-383,-392,-392,-371,-392,-384,-370,-733,-362,-403,-550,-390,,,,,,,,,,,,,,,,,,,,,,,,,,,,,,,,,,,,,,,,,,,,,,,,,,,,,,,,,,,,,,,,,,,,,,,,,,
-368,-415,-378,-390,-378,-385,-382,-405,-351,-410,-396,-405,-392,-714,-600,-531,-600,-846,-600,-349,-323,-366,-383,-375,-402,-395,-381,-396,-394,-368,-390,-389,-367,-735,-357,-401,-553,-392,,,,,,,,,,,,,,,,,,,,,,,,,,,,,,,,,,,,,,,,,,,,,,,,,,,,,,,,,,,,,,,,,,,,,,,,,,
-362,-416,-380,-390,-378,-386,-379,-401,-354,-397,-393,-415,-388,-707,-600,-519,-600,-839,-600,-350,-323,-368,-384,-375,-395,-395,-382,-391,-393,-364,-386,-387,-365,-725,-369,-400,-552,-396,,,,,,,,,,,,,,,,,,,,,,,,,,,,,,,,,,,,,,,,,,,,,,,,,,,,,,,,,,,,,,,,,,,,,,,,,,
-350,-418,-378,-379,-391,-382,-375,-409,-350,-409,-397,-418,-392,-705,-600,-522,-600,-832,-600,-343,-325,-368,-387,-380,-396,-401,-383,-393,-390,-363,-386,-390,-372,-737,-351,-399,-559,-406,,,,,,,,,,,,,,,,,,,,,,,,,,,,,,,,,,,,,,,,,,,,,,,,,,,,,,,,,,,,,,,,,,,,,,,,,,
-351,-405,-370,-385,-376,-380,-374,-397,-366,-401,-385,-421,-391,-704,-600,-526,-600,-830,-600,-345,-327,-367,-388,-377,-399,-394,-380,-397,-389,-363,-393,-393,-363,-732,-349,-397,-553,-410,,,,,,,,,,,,,,,,,,,,,,,,,,,,,,,,,,,,,,,,,,,,,,,,,,,,,,,,,,,,,,,,,,,,,,,,,,
-360,-385,-380,-396,-369,-379,-377,-407,-341,-415,-404,-407,-388,-702,-600,-534,-600,-832,-600,-350,-329,-364,-384,-377,-397,-398,-381,-394,-391,-368,-397,-395,-366,-732,-353,-397,-546,-415,,,,,,,,,,,,,,,,,,,,,,,,,,,,,,,,,,,,,,,,,,,,,,,,,,,,,,,,,,,,,,,,,,,,,,,,,,
-349,-406,-373,-388,-371,-378,-384,-399,-344,-395,-411,-405,-379,-714,-600,-534,-600,-829,-600,-350,-328,-364,-380,-378,-390,-400,-379,-394,-398,-369,-392,-392,-369,-731,-346,-394,-551,-423,,,,,,,,,,,,,,,,,,,,,,,,,,,,,,,,,,,,,,,,,,,,,,,,,,,,,,,,,,,,,,,,,,,,,,,,,,
-334,-406,-373,-392,-378,-385,-377,-394,-351,-403,-393,-413,-392,-711,-600,-549,-600,-842,-600,-342,-323,-368,-379,-378,-391,-395,-381,-397,-391,-367,-392,-389,-371,-731,-345,-399,-548,-430,,,,,,,,,,,,,,,,,,,,,,,,,,,,,,,,,,,,,,,,,,,,,,,,,,,,,,,,,,,,,,,,,,,,,,,,,,
-330,-402,-376,-387,-361,-376,-390,-397,-351,-402,-391,-414,-392,-704,-600,-531,-600,-825,-600,-340,-317,-363,-377,-381,-393,-392,-383,-389,-387,-366,-392,-384,-375,-730,-351,-400,-551,-436,,,,,,,,,,,,,,,,,,,,,,,,,,,,,,,,,,,,,,,,,,,,,,,,,,,,,,,,,,,,,,,,,,,,,,,,,,
-295,-362,-535,-381,-600,-382,-385,-383,-379,-782,-600,-770,-382,-641,-387,-367,-677,-600,-392,-333,-342,-390,-358,-366,-416,-373,-510,-595,-511,-780,-600,-538,-375,-365,-411,-405,-423,-532,,,,,,,,,,,,,,,,,,,,,,,,,,,,,,,,,,,,,,,,,,,,,,,,,,,,,,,,,,,,,,,,,,,,,,,,,,
-307,-370,-525,-388,-600,-389,-373,-398,-370,-787,-600,-772,-386,-642,-389,-362,-678,-600,-392,-338,-345,-385,-361,-369,-422,-378,-512,-605,-516,-786,-600,-545,-375,-385,-395,-404,-426,-541,,,,,,,,,,,,,,,,,,,,,,,,,,,,,,,,,,,,,,,,,,,,,,,,,,,,,,,,,,,,,,,,,,,,,,,,,,
-287,-363,-533,-372,-600,-378,-366,-406,-362,-790,-600,-772,-387,-646,-386,-364,-680,-600,-390,-334,-342,-392,-365,-371,-420,-383,-517,-606,-518,-785,-600,-556,-376,-383,-400,-410,-429,-546,,,,,,,,,,,,,,,,,,,,,,,,,,,,,,,,,,,,,,,,,,,,,,,,,,,,,,,,,,,,,,,,,,,,,,,,,,
-279,-363,-544,-377,-600,-392,-377,-389,-384,-775,-600,-779,-384,-634,-389,-377,-679,-600,-393,-336,-340,-396,-366,-369,-422,-376,-516,-604,-514,-793,-600,-553,-379,-390,-395,-412,-431,-558,,,,,,,,,,,,,,,,,,,,,,,,,,,,,,,,,,,,,,,,,,,,,,,,,,,,,,,,,,,,,,,,,,,,,,,,,,
-275,-358,-552,-376,-600,-406,-372,-400,-374,-780,-600,-772,-384,-635,-390,-371,-681,-600,-394,-345,-341,-392,-362,-376,-424,-377,-512,-597,-512,-796,-600,-557,-379,-383,-407,-412,-432,-569,,,,,,,,,,,,,,,,,,,,,,,,,,,,,,,,,,,,,,,,,,,,,,,,,,,,,,,,,,,,,,,,,,,,,,,,,,
-275,-369,-533,-375,-600,-389,-369,-398,-369,-781,-600,-763,-382,-636,-392,-364,-677,-600,-393,-340,-345,-389,-369,-366,-419,-381,-512,-602,-500,-804,-600,-543,-389,-388,-403,-406,-431,-588,,,,,,,,,,,,,,,,,,,,,,,,,,,,,,,,,,,,,,,,,,,,,,,,,,,,,,,,,,,,,,,,,,,,,,,,,,
-271,-370,-537,-373,-600,-386,-375,-394,-370,-775,-600,-766,-376,-646,-391,-369,-674,-600,-389,-335,-338,-385,-364,-369,-421,-378,-525,-601,-506,-789,-600,-554,-364,-402,-406,-403,-424,-578,,,,,,,,,,,,,,,,,,,,,,,,,,,,,,,,,,,,,,,,,,,,,,,,,,,,,,,,,,,,,,,,,,,,,,,,,,
-266,-367,-534,-374,-600,-380,-371,-389,-371,-775,-600,-769,-381,-642,-391,-369,-679,-600,-390,-335,-332,-390,-371,-371,-421,-373,-515,-603,-508,-782,-600,-552,-370,-390,-397,-399,-423,-594,,,,,,,,,,,,,,,,,,,,,,,,,,,,,,,,,,,,,,,,,,,,,,,,,,,,,,,,,,,,,,,,,,,,,,,,,,
-262,-360,-529,-378,-600,-381,-365,-393,-370,-772,-600,-770,-386,-643,-400,-375,-682,-600,-391,-334,-334,-392,-373,-369,-425,-377,-511,-613,-514,-789,-600,-554,-366,-390,-385,-431,-425,-575,,,,,,,,,,,,,,,,,,,,,,,,,,,,,,,,,,,,,,,,,,,,,,,,,,,,,,,,,,,,,,,,,,,,,,,,,,
-263,-361,-532,-377,-600,-379,-367,-397,-375,-759,-600,-759,-384,-632,-391,-371,-671,-600,-388,-334,-339,-392,-371,-372,-423,-388,-514,-587,-518,-787,-600,-549,-372,-377,-399,-415,-425,-567,,,,,,,,,,,,,,,,,,,,,,,,,,,,,,,,,,,,,,,,,,,,,,,,,,,,,,,,,,,,,,,,,,,,,,,,,,
-255,-368,-536,-379,-600,-381,-375,-396,-374,-774,-600,-770,-387,-632,-394,-378,-682,-600,-385,-326,-338,-392,-373,-376,-427,-368,-519,-587,-524,-788,-600,-570,-377,-379,-395,-422,-436,-569,,,,,,,,,,,,,,,,,,,,,,,,,,,,,,,,,,,,,,,,,,,,,,,,,,,,,,,,,,,,,,,,,,,,,,,,,,
-259,-358,-530,-381,-600,-379,-374,-394,-363,-768,-600,-747,-400,-629,-394,-370,-679,-600,-384,-329,-338,-387,-354,-361,-420,-376,-516,-591,-508,-776,-600,-558,-378,-375,-405,-420,-441,-574,,,,,,,,,,,,,,,,,,,,,,,,,,,,,,,,,,,,,,,,,,,,,,,,,,,,,,,,,,,,,,,,,,,,,,,,,,
-254,-355,-533,-378,-600,-382,-369,-394,-370,-778,-600,-761,-383,-636,-393,-375,-676,-600,-387,-332,-338,-391,-361,-369,-428,-375,-516,-601,-504,-789,-600,-559,-376,-376,-415,-421,-440,-571,,,,,,,,,,,,,,,,,,,,,,,,,,,,,,,,,,,,,,,,,,,,,,,,,,,,,,,,,,,,,,,,,,,,,,,,,,
-249,-359,-545,-379,-600,-383,-369,-392,-373,-786,-600,-765,-378,-641,-394,-374,-681,-600,-387,-329,-332,-390,-360,-367,-431,-363,-520,-599,-516,-796,-600,-553,-382,-381,-408,-421,-433,-586,,,,,,,,,,,,,,,,,,,,,,,,,,,,,,,,,,,,,,,,,,,,,,,,,,,,,,,,,,,,,,,,,,,,,,,,,,
-247,-370,-550,-386,-600,-401,-367,-397,-380,-794,-600,-772,-378,-643,-396,-381,-681,-600,-390,-342,-338,-391,-364,-376,-427,-381,-510,-601,-513,-787,-600,-556,-382,-384,-413,-429,-456,-576,,,,,,,,,,,,,,,,,,,,,,,,,,,,,,,,,,,,,,,,,,,,,,,,,,,,,,,,,,,,,,,,,,,,,,,,,,
-1100,-397,-590,-395,-600,-407,-377,-408,-390,-818,-600,-796,-388,-654,-410,-389,-697,-600,-409,-329,-355,-396,-368,-379,-446,-387,-527,-615,-517,-803,-600,-572,-373,-404,-437,-436,-451,-1100,,,,,,,,,,,,,,,,,,,,,,,,,,,,,,,,,,,,,,,,,,,,,,,,,,,,,,,,,,,,,,,,,,,,,,,,,,
#,line_max,,,,,,,,,,,,,,,,,,,,,,,,,,,,,,,,,,,,,,,,,,,,,,,,,,,,,,,,,,,,,,,,,,,,,,,,,,,,,,,,,,,,,,,,,,,,,,,,,,,,,,,,,,,,,,
35000,35000,35000,35000,35000,35000,35000,35000,35000,35000,35000,35000,35000,35000,35000,35000,35000,35000,35000,35000,35000,35000,35000,35000,35000,35000,35000,35000,35000,35000,35000,35000,35000,35000,35000,35000,35000,35000,35000,35000,35000,35000,35000,35000,35000,35000,35000,35000,35000,35000,35000,35000,35000,35000,35000,35000,35000,35000,35000,35000,35000,35000,35000,35000,35000,35000,35000,35000,35000,35000,35000,35000,35000,35000,35000,35000,35000,35000,35000,35000,35000,35000,35000,35000,35000,35000,35000,35000,35000,35000,35000,35000,35000,35000,35000,35000,35000,35000,35000,35000,35000,35000,35000,35000,35000,35000,35000,35000,35000,35000,35000,35000
#,line_min,,,,,,,,,,,,,,,,,,,,,,,,,,,,,,,,,,,,,,,,,,,,,,,,,,,,,,,,,,,,,,,,,,,,,,,,,,,,,,,,,,,,,,,,,,,,,,,,,,,,,,,,,,,,,,
2000,2000,2000,2000,2000,2000,2000,2000,2000,2000,2000,2000,2000,2000,2000,2000,2000,2000,2000,2000,2000,2000,2000,2000,2000,2000,2000,2000,2000,2000,2000,2000,2000,2000,2000,2000,2000,2000,2000,2000,2000,2000,2000,2000,2000,2000,2000,2000,2000,2000,2000,2000,2000,2000,2000,2000,2000,2000,2000,2000,2000,2000,2000,2000,2000,2000,2000,2000,2000,2000,2000,2000,2000,2000,2000,2000,2000,2000,2000,2000,2000,2000,2000,2000,2000,2000,2000,2000,2000,2000,2000,2000,2000,2000,2000,2000,2000,2000,2000,2000,2000,2000,2000,2000,2000,2000,2000,2000,2000,2000,2000,2000
#,full_max,,,,,,,,,,,,,,,,,,,,,,,,,,,,,,,,,,,,,,,,,,,,,,,,,,,,,,,,,,,,,,,,,,,,,,,,,,,,,,,,,,,,,,,,,,,,,,,,,,,,,,,,,,,,,,
4142,4087,4216,4182,4202,4189,4170,4170,4154,4181,4168,4205,4155,4147,3853,4159,3985,4129,3765,4038,4145,4227,4244,4261,4321,4306,4295,4322,4325,4316,4316,4327,4330,4323,4141,4360,4417,4431,4611,,,,,,,,,,,,,,,,,,,,,,,,,,,,,,,,,,,,,,,,,,,,,,,,,,,,,,,,,,,,,,,,,,,,,,,,,
4600,4600,4108,4097,4111,4125,4105,4102,4075,4130,4085,4122,4110,4067,3773,4080,3910,4080,3703,3962,4095,4156,4181,4186,4223,4207,4220,4237,4234,4246,4262,4269,4236,4258,4044,4265,4244,4316,4460,,,,,,,,,,,,,,,,,,,,,,,,,,,,,,,,,,,,,,,,,,,,,,,,,,,,,,,,,,,,,,,,,,,,,,,,,
4002,4018,4070,4059,4075,4087,4063,4067,4044,4097,4065,4090,4085,4044,3735,4057,3888,4057,3682,3945,4080,4108,4143,4175,4211,4198,4195,4214,4210,4221,4236,4237,4223,4228,4007,4252,4218,4221,4397,,,,,,,,,,,,,,,,,,,,,,,,,,,,,,,,,,,,,,,,,,,,,,,,,,,,,,,,,,,,,,,,,,,,,,,,,
4012,4110,4050,4049,4055,4072,4050,4063,4038,4090,4051,4090,4074,4036,3721,4061,3888,4052,3680,3959,4057,4098,4171,4174,4215,4197,4191,4228,4221,4225,4238,4240,4230,4232,3995,4241,4226,4187,4316,,,,,,,,,,,,,,,,,,,,,,,,,,,,,,,,,,,,,,,,,,,,,,,,,,,,,,,,,,,,,,,,,,,,,,,,,
3974,4094,4039,4044,4052,4062,4045,4051,4028,4078,4045,4074,4069,4036,3712,4033,3876,4045,3666,3915,4050,4090,4140,4150,4189,4166,4171,4191,4200,4206,4205,4215,4203,4210,3987,4243,4226,4180,4289,,,,,,,,,,,,,,,,,,,,,,,,,,,,,,,,,,,,,,,,,,,,,,,,,,,,,,,,,,,,,,,,,,,,,,,,,
3950,4094,4043,4044,4063,4073,4050,4049,4039,4082,4056,4081,4076,4037,3719,4029,3883,4050,3667,3915,4056,4089,4143,4147,4183,4165,4175,4207,4226,4214,4203,4227,4204,4227,3988,4238,4215,4183,4275,,,,,,,,,,,,,,,,,,,,,,,,,,,,,,,,,,,,,,,,,,,,,,,,,,,,,,,,,,,,,,,,,,,,,,,,,
3931,4089,4044,4046,4058,4072,4045,4045,4042,4085,4062,4084,4078,4043,3724,4031,3877,4052,3657,3917,4047,4090,4139,4143,4184,4167,4171,4208,4211,4222,4198,4212,4203,4225,3996,4221,4200,4179,4266,,,,,,,,,,,,,,,,,,,,,,,,,,,,,,,,,,,,,,,,,,,,,,,,,,,,,,,,,,,,,,,,,,,,,,,,,
3931,4089,4053,4058,4068,4080,4060,4063,4063,4106,4077,4098,4096,4056,3738,4037,3883,4073,3661,3916,4052,4101,4145,4143,4182,4173,4176,4210,4214,4212,4213,4218,4222,4202,4007,4222,4198,4182,4270,,,,,,,,,,,,,,,,,,,,,,,,,,,,,,,,,,,,,,,,,,,,,,,,,,,,,,,,,,,,,,,,,,,,,,,,,
3919,4082,4058,4056,4077,4083,4064,4063,4068,4112,4072,4105,4106,4060,3737,4046,3884,4077,3655,3915,4056,4107,4146,4152,4195,4184,4182,4213,4217,4215,4196,4218,4207,4177,4000,4210,4194,4196,4274,,,,,,,,,,,,,,,,,,,,,,,,,,,,,,,,,,,,,,,,,,,,,,,,,,,,,,,,,,,,,,,,,,,,,,,,,
3893,4056,4041,4033,4053,4071,4049,4043,4044,4097,4065,4084,4092,4051,3726,4032,3877,4066,3657,3904,4039,4094,4123,4129,4181,4164,4163,4195,4199,4196,4178,4201,4187,4155,3985,4186,4166,4159,4232,,,,,,,,,,,,,,,,,,,,,,,,,,,,,,,,,,,,,,,,,,,,,,,,,,,,,,,,,,,,,,,,,,,,,,,,,
3883,4042,4026,4020,4031,4049,4029,4025,4015,4074,4045,4063,4083,4044,3713,4016,3852,4050,3627,3893,4035,4079,4132,4140,4183,4169,4166,4198,4201,4198,4184,4206,4189,4163,3966,4187,4177,4136,4198,,,,,,,,,,,,,,,,,,,,,,,,,,,,,,,,,,,,,,,,,,,,,,,,,,,,,,,,,,,,,,,,,,,,,,,,,
3852,4029,4018,4005,4021,4038,4014,4014,4007,4058,4029,4060,4063,4032,3706,4005,3850,4039,3612,3880,4001,4070,4089,4092,4133,4129,4119,4143,4148,4144,4141,4149,4135,4110,3962,4138,4123,4123,4179,,,,,,,,,,,,,,,,,,,,,,,,,,,,,,,,,,,,,,,,,,,,,,,,,,,,,,,,,,,,,,,,,,,,,,,,,
3847,4040,4008,4011,4030,4031,4013,4012,4002,4054,4018,4053,4055,4021,3706,3995,3834,4030,3612,3871,4007,4053,4078,4084,4122,4112,4111,4145,4147,4141,4148,4146,4133,4114,3943,4139,4123,4116,4164,,,,,,,,,,,,,,,,,,,,,,,,,,,,,,,,,,,,,,,,,,,,,,,,,,,,,,,,,,,,,,,,,,,,,,,,,
3837,4013,3986,3990,4004,4017,3994,3988,3992,4026,3998,4037,4033,3998,3681,3978,3815,4016,3608,3868,3989,4028,4061,4073,4107,4103,4100,4130,4133,4130,4130,4131,4123,4100,3929,4125,4110,4097,4131,,,,,,,,,,,,,,,,,,,,,,,,,,,,,,,,,,,,,,,,,,,,,,,,,,,,,,,,,,,,,,,,,,,,,,,,,
3838,4010,4006,3997,4008,4025,4002,3986,3981,4033,3997,4030,4029,3992,3677,3981,3818,4019,3611,3867,3978,4034,4063,4075,4113,4108,4104,4145,4151,4141,4123,4144,4130,4107,3929,4134,4122,4092,4137,,,,,,,,,,,,,,,,,,,,,,,,,,,,,,,,,,,,,,,,,,,,,,,,,,,,,,,,,,,,,,,,,,,,,,,,,
3813,4016,3995,4002,4010,4019,3994,3981,3976,4023,4006,4019,4023,3997,3673,3970,3815,4012,3598,3858,3964,4033,4057,4060,4104,4097,4093,4132,4140,4127,4114,4129,4121,4097,3923,4124,4110,4095,4124,,,,,,,,,,,,,,,,,,,,,,,,,,,,,,,,,,,,,,,,,,,,,,,,,,,,,,,,,,,,,,,,,,,,,,,,,
3800,4019,3994,3996,4014,4017,3984,3979,3974,4018,3985,4020,4015,3980,3662,3980,3810,4023,3592,3849,3951,4025,4047,4053,4094,4090,4088,4121,4125,4117,4105,4121,4111,4089,3919,4122,4105,4088,4116,,,,,,,,,,,,,,,,,,,,,,,,,,,,,,,,,,,,,,,,,,,,,,,,,,,,,,,,,,,,,,,,,,,,,,,,,
3773,3983,3959,3961,3974,3996,3973,3957,3942,3985,3954,3985,3987,3948,3632,3938,3778,3978,3570,3827,3928,3995,4019,4027,4072,4058,4057,4091,4093,4085,4078,4098,4089,4060,3898,4091,4080,4062,4061,,,,,,,,,,,,,,,,,,,,,,,,,,,,,,,,,,,,,,,,,,,,,,,,,,,,,,,,,,,,,,,,,,,,,,,,,
3974,4074,4104,3948,3952,4115,4100,4118,4110,4136,3745,4149,3883,4145,4023,4036,4049,3745,4001,3988,4085,4117,4101,4125,4088,4094,4116,4196,4108,4240,3917,4079,4177,4209,4219,4196,4183,4128,4125,,,,,,,,,,,,,,,,,,,,,,,,,,,,,,,,,,,,,,,,,,,,,,,,,,,,,,,,,,,,,,,,,,,,,,,,,
4014,4121,4157,4001,3998,4156,4131,4169,4143,4184,3777,4188,3918,4191,4057,4065,4079,3785,4046,4024,4107,4142,4138,4168,4120,4115,4136,4232,4134,4275,3954,4102,4216,4256,4246,4231,4226,4169,4139,,,,,,,,,,,,,,,,,,,,,,,,,,,,,,,,,,,,,,,,,,,,,,,,,,,,,,,,,,,,,,,,,,,,,,,,,
3981,4108,4145,3982,3981,4152,4134,4176,4146,4193,3778,4185,3912,4192,4058,4052,4050,3778,4038,4022,4095,4139,4138,4172,4122,4096,4126,4231,4130,4275,3950,4086,4215,4245,4240,4223,4221,4162,4129,,,,,,,,,,,,,,,,,,,,,,,,,,,,,,,,,,,,,,,,,,,,,,,,,,,,,,,,,,,,,,,,,,,,,,,,,
3978,4101,4153,3987,3986,4164,4140,4179,4167,4185,3784,4207,3921,4200,4061,4063,4054,3789,4042,4030,4108,4145,4152,4176,4129,4107,4131,4241,4152,4286,3962,4093,4224,4251,4240,4238,4227,4177,4135,,,,,,,,,,,,,,,,,,,,,,,,,,,,,,,,,,,,,,,,,,,,,,,,,,,,,,,,,,,,,,,,,,,,,,,,,
3991,4120,4177,3998,3999,4199,4158,4192,4167,4201,3795,4214,3936,4216,4070,4071,4072,3801,4049,4039,4139,4156,4166,4193,4135,4111,4137,4250,4157,4305,3963,4103,4230,4264,4256,4245,4241,4183,4135,,,,,,,,,,,,,,,,,,,,,,,,,,,,,,,,,,,,,,,,,,,,,,,,,,,,,,,,,,,,,,,,,,,,,,,,,
3985,4114,4156,3991,4001,4175,4145,4177,4159,4200,3801,4207,3925,4218,4066,4077,4076,3801,4053,4035,4124,4152,4161,4190,4132,4119,4142,4247,4146,4301,3960,4105,4236,4262,4246,4240,4239,4187,4119,,,,,,,,,,,,,,,,,,,,,,,,,,,,,,,,,,,,,,,,,,,,,,,,,,,,,,,,,,,,,,,,,,,,,,,,,
3975,4111,4145,3986,3998,4167,4136,4173,4157,4197,3799,4207,3928,4221,4067,4071,4078,3798,4049,4034,4118,4146,4157,4191,4142,4126,4142,4244,4159,4296,3954,4107,4219,4271,4241,4232,4231,4172,4115,,,,,,,,,,,,,,,,,,,,,,,,,,,,,,,,,,,,,,,,,,,,,,,,,,,,,,,,,,,,,,,,,,,,,,,,,
3982,4119,4164,4000,4010,4180,4153,4198,4175,4210,3814,4225,3935,4224,4076,4084,4078,3809,4064,4045,4131,4161,4178,4209,4157,4135,4147,4268,4160,4301,3965,4118,4229,4276,4260,4252,4259,4206,4123,,,,,,,,,,,,,,,,,,,,,,,,,,,,,,,,,,,,,,,,,,,,,,,,,,,,,,,,,,,,,,,,,,,,,,,,,
3996,4140,4184,4014,4021,4196,4168,4206,4190,4225,3831,4243,3949,4243,4094,4095,4096,3822,4085,4061,4145,4172,4187,4215,4168,4144,4163,4277,4179,4312,3981,4129,4242,4294,4276,4282,4253,4196,4127,,,,,,,,,,,,,,,,,,,,,,,,,,,,,,,,,,,,,,,,,,,,,,,,,,,,,,,,,,,,,,,,,,,,,,,,,
3937,4080,4119,3968,3959,4123,4096,4132,4132,4154,3774,4173,3897,4174,4041,4041,4040,3769,4027,4007,4088,4115,4121,4169,4103,4091,4113,4214,4134,4265,3927,4087,4180,4228,4207,4200,4190,4137,4067,,,,,,,,,,,,,,,,,,,,,,,,,,,,,,,,,,,,,,,,,,,,,,,,,,,,,,,,,,,,,,,,,,,,,,,,,
3940,4089,4116,3974,3968,4127,4104,4139,4135,4157,3764,4181,3910,4174,4048,4049,4053,3768,4030,4014,4094,4128,4132,4167,4105,4101,4127,4207,4129,4259,3932,4109,4179,4223,4216,4207,4201,4140,4082,,,,,,,,,,,,,,,,,,,,,,,,,,,,,,,,,,,,,,,,,,,,,,,,,,,,,,,,,,,,,,,,,,,,,,,,,
3912,4070,4095,3947,3950,4098,4084,4119,4119,4139,3746,4154,3900,4156,4020,4023,4026,3748,4002,3989,4068,4105,4103,4148,4086,4082,4105,4183,4113,4230,3916,4077,4155,4201,4190,4180,4177,4120,4043,,,,,,,,,,,,,,,,,,,,,,,,,,,,,,,,,,,,,,,,,,,,,,,,,,,,,,,,,,,,,,,,,,,,,,,,,
3933,4095,4120,3976,3977,4122,4110,4150,4153,4168,3772,4182,3916,4180,4048,4053,4046,3768,4021,4006,4093,4139,4123,4160,4108,4114,4128,4206,4124,4249,3937,4104,4184,4225,4219,4209,4204,4142,4081,,,,,,,,,,,,,,,,,,,,,,,,,,,,,,,,,,,,,,,,,,,,,,,,,,,,,,,,,,,,,,,,,,,,,,,,,
3960,4120,4145,4005,4002,4150,4140,4173,4180,4188,3789,4201,3938,4201,4069,4074,4076,3779,4043,4025,4115,4148,4142,4171,4139,4140,4169,4239,4152,4276,3963,4136,4208,4253,4246,4240,4233,4172,4113,,,,,,,,,,,,,,,,,,,,,,,,,,,,,,,,,,,,,,,,,,,,,,,,,,,,,,,,,,,,,,,,,,,,,,,,,
3975,4141,4169,4025,4023,4170,4156,4189,4191,4199,3793,4204,3945,4203,4084,4083,4090,3781,4063,4050,4127,4160,4152,4175,4156,4141,4166,4244,4164,4291,3974,4152,4232,4263,4258,4251,4249,4188,4102,,,,,,,,,,,,,,,,,,,,,,,,,,,,,,,,,,,,,,,,,,,,,,,,,,,,,,,,,,,,,,,,,,,,,,,,,
4159,4275,4310,4161,4147,4322,4286,4315,4312,4339,3916,4346,4070,4345,4219,4221,4209,3905,4193,4175,4247,4285,4294,4317,4287,4257,4289,4396,4294,4430,4098,4280,4375,4422,4411,4399,4403,4345,4284,,,,,,,,,,,,,,,,,,,,,,,,,,,,,,,,,,,,,,,,,,,,,,,,,,,,,,,,,,,,,,,,,,,,,,,,,
#,full_min,,,,,,,,,,,,,,,,,,,,,,,,,,,,,,,,,,,,,,,,,,,,,,,,,,,,,,,,,,,,,,,,,,,,,,,,,,,,,,,,,,,,,,,,,,,,,,,,,,,,,,,,,,,,,,
2676,2604,2695,2710,2691,2675,2661,2678,2632,2658,2652,2616,2632,2594,2343,2602,2451,2601,2308,2564,2594,2697,2708,2710,2730,2754,2725,2761,2746,2721,2745,2752,2740,2746,2545,2792,2841,2851,2990,,,,,,,,,,,,,,,,,,,,,,,,,,,,,,,,,,,,,,,,,,,,,,,,,,,,,,,,,,,,,,,,,,,,,,,,,
1350,1350,2611,2630,2623,2609,2589,2615,2574,2599,2600,2565,2577,2543,2302,2563,2411,2580,2272,2527,2563,2650,2662,2687,2702,2701,2674,2714,2688,2669,2700,2714,2704,2701,2502,2740,2725,2739,2888,,,,,,,,,,,,,,,,,,,,,,,,,,,,,,,,,,,,,,,,,,,,,,,,,,,,,,,,,,,,,,,,,,,,,,,,,
2563,2568,2582,2610,2602,2591,2572,2594,2562,2584,2587,2558,2560,2538,2289,2554,2401,2571,2273,2532,2559,2645,2656,2702,2705,2710,2678,2720,2696,2673,2711,2700,2699,2694,2495,2724,2716,2691,2825,,,,,,,,,,,,,,,,,,,,,,,,,,,,,,,,,,,,,,,,,,,,,,,,,,,,,,,,,,,,,,,,,,,,,,,,,
2534,2615,2577,2586,2590,2589,2572,2586,2560,2588,2587,2559,2562,2553,2286,2555,2421,2571,2280,2544,2553,2643,2659,2684,2692,2702,2683,2726,2720,2684,2710,2699,2701,2694,2483,2713,2704,2657,2741,,,,,,,,,,,,,,,,,,,,,,,,,,,,,,,,,,,,,,,,,,,,,,,,,,,,,,,,,,,,,,,,,,,,,,,,,
2506,2609,2560,2565,2580,2573,2565,2580,2543,2578,2578,2570,2554,2551,2281,2556,2407,2565,2274,2521,2553,2640,2668,2675,2678,2690,2671,2707,2708,2671,2708,2686,2684,2682,2465,2686,2684,2637,2709,,,,,,,,,,,,,,,,,,,,,,,,,,,,,,,,,,,,,,,,,,,,,,,,,,,,,,,,,,,,,,,,,,,,,,,,,
2516,2612,2563,2580,2591,2582,2578,2596,2555,2600,2587,2589,2572,2562,2300,2570,2417,2575,2279,2532,2565,2653,2665,2680,2688,2702,2681,2713,2729,2682,2723,2711,2695,2688,2468,2670,2676,2636,2707,,,,,,,,,,,,,,,,,,,,,,,,,,,,,,,,,,,,,,,,,,,,,,,,,,,,,,,,,,,,,,,,,,,,,,,,,
2501,2600,2565,2580,2582,2578,2576,2599,2562,2615,2589,2586,2571,2564,2298,2569,2417,2571,2275,2532,2559,2644,2654,2658,2675,2697,2682,2711,2689,2676,2683,2691,2673,2676,2459,2660,2673,2631,2693,,,,,,,,,,,,,,,,,,,,,,,,,,,,,,,,,,,,,,,,,,,,,,,,,,,,,,,,,,,,,,,,,,,,,,,,,
2490,2586,2559,2579,2595,2580,2572,2601,2580,2622,2611,2582,2568,2561,2297,2567,2416,2565,2278,2535,2563,2651,2663,2662,2679,2699,2684,2714,2684,2664,2686,2687,2688,2669,2461,2662,2675,2628,2685,,,,,,,,,,,,,,,,,,,,,,,,,,,,,,,,,,,,,,,,,,,,,,,,,,,,,,,,,,,,,,,,,,,,,,,,,
2498,2608,2566,2589,2607,2596,2580,2616,2596,2627,2611,2592,2578,2574,2309,2577,2426,2577,2287,2547,2576,2657,2665,2670,2682,2716,2691,2726,2693,2672,2685,2696,2680,2680,2470,2668,2682,2651,2699,,,,,,,,,,,,,,,,,,,,,,,,,,,,,,,,,,,,,,,,,,,,,,,,,,,,,,,,,,,,,,,,,,,,,,,,,
2472,2594,2546,2573,2582,2570,2555,2582,2560,2600,2591,2560,2571,2544,2287,2556,2398,2551,2271,2517,2547,2632,2636,2636,2652,2682,2664,2695,2665,2640,2655,2667,2652,2646,2451,2636,2660,2618,2665,,,,,,,,,,,,,,,,,,,,,,,,,,,,,,,,,,,,,,,,,,,,,,,,,,,,,,,,,,,,,,,,,,,,,,,,,
2469,2580,2535,2568,2570,2561,2548,2571,2545,2581,2580,2545,2562,2525,2268,2539,2384,2538,2255,2502,2540,2627,2636,2634,2641,2665,2642,2674,2668,2631,2659,2646,2639,2638,2432,2626,2647,2603,2645,,,,,,,,,,,,,,,,,,,,,,,,,,,,,,,,,,,,,,,,,,,,,,,,,,,,,,,,,,,,,,,,,,,,,,,,,
2444,2572,2519,2556,2559,2551,2536,2568,2534,2567,2566,2542,2548,2514,2254,2529,2386,2531,2248,2490,2531,2614,2628,2633,2653,2662,2634,2666,2661,2629,2660,2646,2641,2643,2440,2627,2647,2609,2644,,,,,,,,,,,,,,,,,,,,,,,,,,,,,,,,,,,,,,,,,,,,,,,,,,,,,,,,,,,,,,,,,,,,,,,,,
2439,2580,2524,2565,2574,2558,2556,2578,2533,2570,2568,2546,2547,2523,2259,2531,2378,2533,2244,2496,2541,2634,2642,2648,2661,2676,2642,2666,2669,2640,2670,2668,2662,2664,2449,2654,2655,2595,2643,,,,,,,,,,,,,,,,,,,,,,,,,,,,,,,,,,,,,,,,,,,,,,,,,,,,,,,,,,,,,,,,,,,,,,,,,
2434,2568,2521,2559,2559,2555,2554,2574,2541,2567,2567,2554,2549,2522,2258,2523,2376,2527,2241,2481,2535,2629,2639,2646,2657,2664,2637,2676,2668,2643,2660,2671,2663,2661,2456,2654,2650,2600,2623,,,,,,,,,,,,,,,,,,,,,,,,,,,,,,,,,,,,,,,,,,,,,,,,,,,,,,,,,,,,,,,,,,,,,,,,,
2403,2567,2532,2555,2562,2567,2557,2575,2534,2578,2561,2537,2548,2515,2256,2523,2372,2525,2240,2481,2530,2616,2631,2637,2646,2673,2638,2675,2667,2644,2653,2667,2654,2653,2450,2644,2645,2609,2623,,,,,,,,,,,,,,,,,,,,,,,,,,,,,,,,,,,,,,,,,,,,,,,,,,,,,,,,,,,,,,,,,,,,,,,,,
2369,2567,2512,2552,2569,2560,2548,2568,2531,2561,2564,2535,2541,2514,2255,2515,2370,2523,2230,2476,2516,2607,2616,2621,2640,2669,2643,2669,2656,2629,2648,2656,2644,2638,2444,2637,2637,2595,2605,,,,,,,,,,,,,,,,,,,,,,,,,,,,,,,,,,,,,,,,,,,,,,,,,,,,,,,,,,,,,,,,,,,,,,,,,
2361,2562,2514,2552,2556,2545,2538,2556,2524,2555,2545,2533,2528,2506,2245,2517,2359,2523,2220,2461,2510,2599,2611,2613,2618,2656,2632,2662,2641,2621,2635,2648,2629,2623,2433,2632,2631,2593,2590,,,,,,,,,,,,,,,,,,,,,,,,,,,,,,,,,,,,,,,,,,,,,,,,,,,,,,,,,,,,,,,,,,,,,,,,,
2344,2540,2490,2525,2527,2523,2520,2527,2490,2519,2516,2497,2510,2482,2218,2476,2335,2485,2207,2437,2485,2569,2573,2580,2589,2622,2601,2631,2612,2588,2601,2613,2598,2599,2409,2599,2613,2566,2556,,,,,,,,,,,,,,,,,,,,,,,,,,,,,,,,,,,,,,,,,,,,,,,,,,,,,,,,,,,,,,,,,,,,,,,,,
2494,2573,2629,2480,2473,2609,2623,2624,2625,2647,2337,2663,2485,2642,2594,2590,2580,2344,2583,2588,2637,2662,2671,2680,2683,2661,2671,2676,2677,2681,2545,2676,2663,2659,2692,2667,2680,2648,2683,,,,,,,,,,,,,,,,,,,,,,,,,,,,,,,,,,,,,,,,,,,,,,,,,,,,,,,,,,,,,,,,,,,,,,,,,
2521,2605,2666,2516,2498,2641,2646,2656,2647,2684,2356,2691,2511,2667,2620,2613,2606,2364,2613,2619,2669,2688,2695,2711,2710,2696,2692,2706,2706,2724,2570,2693,2683,2704,2702,2687,2698,2670,2704,,,,,,,,,,,,,,,,,,,,,,,,,,,,,,,,,,,,,,,,,,,,,,,,,,,,,,,,,,,,,,,,,,,,,,,,,
2493,2593,2644,2492,2490,2632,2632,2644,2644,2683,2352,2686,2495,2656,2614,2603,2604,2352,2598,2607,2657,2678,2690,2696,2706,2687,2685,2683,2696,2709,2560,2689,2666,2684,2681,2665,2676,2647,2683,,,,,,,,,,,,,,,,,,,,,,,,,,,,,,,,,,,,,,,,,,,,,,,,,,,,,,,,,,,,,,,,,,,,,,,,,
2496,2611,2650,2506,2507,2650,2638,2651,2668,2681,2353,2708,2507,2675,2635,2622,2620,2368,2619,2620,2670,2701,2701,2710,2724,2702,2699,2693,2716,2710,2577,2715,2668,2683,2678,2659,2674,2643,2692,,,,,,,,,,,,,,,,,,,,,,,,,,,,,,,,,,,,,,,,,,,,,,,,,,,,,,,,,,,,,,,,,,,,,,,,,
2498,2618,2679,2523,2521,2674,2655,2662,2661,2698,2366,2708,2514,2685,2642,2630,2629,2374,2630,2632,2682,2714,2710,2723,2738,2707,2705,2697,2726,2713,2584,2718,2677,2695,2693,2670,2681,2657,2700,,,,,,,,,,,,,,,,,,,,,,,,,,,,,,,,,,,,,,,,,,,,,,,,,,,,,,,,,,,,,,,,,,,,,,,,,
2499,2620,2674,2522,2521,2663,2656,2661,2670,2704,2366,2706,2524,2690,2649,2638,2632,2379,2638,2641,2688,2716,2721,2739,2745,2710,2712,2705,2727,2724,2589,2717,2682,2698,2691,2677,2684,2659,2705,,,,,,,,,,,,,,,,,,,,,,,,,,,,,,,,,,,,,,,,,,,,,,,,,,,,,,,,,,,,,,,,,,,,,,,,,
2487,2613,2679,2518,2516,2650,2651,2654,2660,2690,2361,2706,2517,2696,2648,2628,2617,2379,2627,2632,2679,2708,2724,2726,2740,2711,2704,2691,2737,2713,2591,2718,2673,2715,2695,2675,2683,2659,2704,,,,,,,,,,,,,,,,,,,,,,,,,,,,,,,,,,,,,,,,,,,,,,,,,,,,,,,,,,,,,,,,,,,,,,,,,
2482,2612,2685,2521,2525,2655,2652,2663,2663,2702,2372,2714,2521,2703,2655,2632,2624,2384,2635,2630,2680,2713,2726,2734,2748,2716,2714,2713,2744,2729,2592,2739,2691,2722,2712,2696,2711,2696,2715,,,,,,,,,,,,,,,,,,,,,,,,,,,,,,,,,,,,,,,,,,,,,,,,,,,,,,,,,,,,,,,,,,,,,,,,,
2489,2620,2690,2533,2534,2672,2664,2678,2678,2720,2380,2721,2529,2712,2667,2640,2641,2390,2643,2630,2692,2737,2745,2750,2757,2723,2723,2735,2730,2739,2603,2739,2704,2734,2715,2716,2708,2691,2714,,,,,,,,,,,,,,,,,,,,,,,,,,,,,,,,,,,,,,,,,,,,,,,,,,,,,,,,,,,,,,,,,,,,,,,,,
2419,2552,2620,2468,2461,2592,2590,2607,2610,2650,2338,2647,2465,2626,2586,2567,2566,2321,2569,2567,2620,2663,2664,2674,2680,2655,2650,2651,2685,2670,2523,2681,2643,2661,2650,2641,2635,2575,2579,,,,,,,,,,,,,,,,,,,,,,,,,,,,,,,,,,,,,,,,,,,,,,,,,,,,,,,,,,,,,,,,,,,,,,,,,
2439,2565,2641,2492,2479,2613,2617,2623,2628,2671,2337,2666,2485,2649,2607,2576,2584,2337,2583,2592,2634,2681,2683,2697,2698,2675,2681,2668,2710,2690,2564,2714,2655,2677,2668,2655,2663,2590,2592,,,,,,,,,,,,,,,,,,,,,,,,,,,,,,,,,,,,,,,,,,,,,,,,,,,,,,,,,,,,,,,,,,,,,,,,,
2416,2547,2618,2473,2453,2583,2595,2603,2610,2641,2310,2644,2473,2628,2588,2564,2561,2314,2552,2567,2617,2654,2664,2674,2677,2653,2655,2640,2672,2657,2551,2678,2625,2650,2641,2626,2632,2607,2626,,,,,,,,,,,,,,,,,,,,,,,,,,,,,,,,,,,,,,,,,,,,,,,,,,,,,,,,,,,,,,,,,,,,,,,,,
2432,2567,2635,2488,2476,2607,2607,2621,2634,2660,2322,2656,2485,2652,2600,2581,2578,2329,2564,2587,2629,2666,2677,2692,2690,2671,2674,2669,2688,2687,2565,2698,2652,2675,2670,2652,2662,2638,2628,,,,,,,,,,,,,,,,,,,,,,,,,,,,,,,,,,,,,,,,,,,,,,,,,,,,,,,,,,,,,,,,,,,,,,,,,
2447,2590,2653,2495,2499,2621,2621,2634,2641,2672,2346,2671,2496,2657,2608,2589,2591,2340,2582,2600,2643,2678,2689,2703,2700,2682,2698,2689,2709,2705,2585,2715,2674,2707,2691,2669,2682,2662,2645,,,,,,,,,,,,,,,,,,,,,,,,,,,,,,,,,,,,,,,,,,,,,,,,,,,,,,,,,,,,,,,,,,,,,,,,,
2464,2611,2674,2519,2519,2645,2640,2653,2668,2687,2365,2686,2507,2672,2621,2601,2606,2352,2604,2622,2665,2704,2700,2722,2720,2686,2701,2737,2723,2751,2601,2729,2718,2743,2729,2702,2725,2694,2676,,,,,,,,,,,,,,,,,,,,,,,,,,,,,,,,,,,,,,,,,,,,,,,,,,,,,,,,,,,,,,,,,,,,,,,,,
2611,2737,2796,2626,2626,2768,2748,2769,2766,2793,2453,2779,2595,2753,2702,2699,2701,2436,2677,2692,2757,2795,2806,2810,2820,2782,2799,2859,2812,2885,2702,2836,2827,2856,2865,2819,2862,2802,2806,,,,,,,,,,,,,,,,,,,,,,,,,,,,,,,,,,,,,,,,,,,,,,,,,,,,,,,,,,,,,,,,,,,,,,,,,
#,full_row_delta_max,,,,,,,,,,,,,,,,,,,,,,,,,,,,,,,,,,,,,,,,,,,,,,,,,,,,,,,,,,,,,,,,,,,,,,,,,,,,,,,,,,,,,,,,,,,,,,,,,,,,,,,,,,,,,,
15000,15000,12000,12000,12000,12000,12000,12000,12000,12000,12000,12000,12000,12000,12000,12000,12000,40000,12000,12000,12000,12000,12000,12000,12000,12000,12000,12000,12000,12000,12000,12000,15000,,,,,,,,,,,,,,,,,,,,,,,,,,,,,,,,,,,,,,,,,,,,,,,,,,,,,,,,,,,,,,,,,,,,,,,,,,,,,,,
#,full_row_delta_min,,,,,,,,,,,,,,,,,,,,,,,,,,,,,,,,,,,,,,,,,,,,,,,,,,,,,,,,,,,,,,,,,,,,,,,,,,,,,,,,,,,,,,,,,,,,,,,,,,,,,,,,,,,,,,
-15000,-15000,-12000,-12000,-12000,-12000,-12000,-12000,-12000,-12000,-12000,-12000,-12000,-12000,-12000,-12000,-12000,-40000,-12000,-12000,-12000,-12000,-12000,-12000,-12000,-12000,-12000,-12000,-12000,-12000,-12000,-12000,-15000,,,,,,,,,,,,,,,,,,,,,,,,,,,,,,,,,,,,,,,,,,,,,,,,,,,,,,,,,,,,,,,,,,,,,,,,,,,,,,,
#,full_col_delta_max,,,,,,,,,,,,,,,,,,,,,,,,,,,,,,,,,,,,,,,,,,,,,,,,,,,,,,,,,,,,,,,,,,,,,,,,,,,,,,,,,,,,,,,,,,,,,,,,,,,,,,,,,,,,,,
25094,16527,16653,13218,15476,12726,13915,12729,13735,16092,20411,12592,19041,19297,18259,16746,19249,21341,17557,17084,14675,13530,13559,13354,13254,13620,17307,15324,16388,13147,15686,16498,13222,12214,19991,13690,14748,19400,,,,,,,,,,,,,,,,,,,,,,,,,,,,,,,,,,,,,,,,,,,,,,,,,,,,,,,,,,,,,,,,,,,,,,,,,,
#,full_col_delta_min,,,,,,,,,,,,,,,,,,,,,,,,,,,,,,,,,,,,,,,,,,,,,,,,,,,,,,,,,,,,,,,,,,,,,,,,,,,,,,,,,,,,,,,,,,,,,,,,,,,,,,,,,,,,,,
-25094,-16527,-16653,-13218,-15476,-12726,-13915,-12729,-13735,-16092,-20411,-12592,-19041,-19297,-18259,-16746,-19249,-21341,-17557,-17084,-14675,-13530,-13559,-13354,-13254,-13620,-17307,-15324,-16388,-13147,-15686,-16498,-13222,-12214,-19991,-13690,-14748,-19400,,,,,,,,,,,,,,,,,,,,,,,,,,,,,,,,,,,,,,,,,,,,,,,,,,,,,,,,,,,,,,,,,,,,,,,,,,
