0 0 0 0 
0 0 0 0 
0 0 0 0 
0 0 0 0 
0 0 0 0 
0 0 0 0 
0 0 0 0 
0 0 0 0 
0 0 0 0 
0 0 0 0 
0.000935235468205065 -1.07189380287309e-05 -5.53496738575632e-06 -1.73947128701002e-07 
0.00115704815834761 -1.25551014207304e-05 -6.87696183376829e-06 3.24625742953444e-10 
0.00134636438451707 -1.34760866785655e-05 -8.1398175098002e-06 1.18996304365737e-07 
0.0015589795075357 -1.29715226648841e-05 -9.13137046154588e-06 1.814084811258e-07 
0.00182648736517876 -9.61335172178224e-06 -9.76911906036548e-06 2.15871452269312e-07 
0.00213603978045285 -3.85143721359782e-06 -9.74452905211365e-06 2.13594049114363e-07 
0.0024283854290843 2.4796806883387e-06 -9.20859110919992e-06 2.3174008845217e-07 
0.00268035172484815 8.79428898770129e-06 -8.25174083729507e-06 1.86172783855909e-07 
0.00284116249531507 1.33485636979458e-05 -7.26795269656577e-06 1.80636945401602e-07 
0.00286059407517314 1.4829779502179e-05 -6.24306903773686e-06 1.58337726929858e-07 
0.00275586894713342 1.36583012135816e-05 -5.58335614186944e-06 1.72530931763504e-07 
0.00260392413474619 1.18206526167342e-05 -5.02313650940778e-06 1.4603151043957e-07 
0.00245081284083426 9.6429812401766e-06 -4.53543952971813e-06 1.85206289415873e-07 
0.00233595864847302 7.66890752856852e-06 -4.14010355598293e-06 2.30369181508649e-07 
0.00228051980957389 6.17800105828792e-06 -3.86127248930279e-06 2.8333690238469e-07 
0.00230584526434541 5.27397060068324e-06 -3.63374510925496e-06 3.18815779110082e-07 
0.00240767491050065 4.52040740128723e-06 -3.590533424358e-06 4.05137512871079e-07 
0.00256673712283373 4.07016113967984e-06 -3.64836978405947e-06 4.8864080781641e-07 
0.002760776784271 3.87855789085734e-06 -3.67496159014991e-06 5.71363784729328e-07 
0.00296574598178267 3.83824180971715e-06 -3.71919009012345e-06 6.34440425528737e-07 
0.00313855218701065 3.73735178982315e-06 -3.77501055481844e-06 6.99602423992474e-07 
0.00325405388139188 3.63462686436833e-06 -3.79027687813505e-06 7.44843760003278e-07 
0.0033037206158042 3.45909916177334e-06 -3.76588377548615e-06 7.73410704368871e-07 
0.00328140542842448 3.17239801006508e-06 -3.76491220777098e-06 7.59197121169564e-07 
0.00319344387389719 2.63703987002373e-06 -3.73552620658302e-06 7.34486832243419e-07 
0.00310882646590471 2.43389376919367e-06 -3.69317876902642e-06 7.27622420981788e-07 
0.00308859348297119 2.33072728406114e-06 -3.66899575965363e-06 7.14005864210776e-07 
0.00318597164005041 2.52126415034581e-06 -3.68301311937103e-06 7.25165193671273e-07 
0.00346664944663644 2.9994043870829e-06 -3.72267527382064e-06 8.2447985505496e-07 
0.00402805302292109 4.10802158512524e-06 -3.85572548111668e-06 9.79965420810913e-07 
0.00496387714520097 5.12112274009269e-06 -4.18229228671407e-06 1.22549511161196e-06 
0.00641918834298849 6.61723515804624e-06 -4.65976245322963e-06 1.58524255766679e-06 
0.00862596835941076 8.38053256302373e-06 -5.4728843679186e-06 2.07205152946699e-06 
0.0118235787376761 1.07989390016883e-05 -6.49693583909539e-06 2.6353466182627e-06 
0.0162622332572937 1.27536350191804e-05 -7.96170297689969e-06 3.62373384632519e-06 
0.022106796503067 1.45087806231459e-05 -9.27360179048264e-06 4.76465766041656e-06 
0.0293257702142 1.56070836965227e-05 -1.01953137345845e-05 6.07012407272123e-06 
0.0376729294657707 1.65222081704997e-05 -1.06273946585134e-05 7.25786139810225e-06 
0.0468091778457165 1.72378131537698e-05 -1.0651125194272e-05 8.42806548462249e-06 
0.0562719628214836 1.63389649969758e-05 -9.02029933058657e-06 9.21946138987551e-06 
0.0655102431774139 1.33868006741977e-05 -7.48093270885875e-06 9.2560330813285e-06 
0.0741325542330742 8.55284724821104e-06 -4.57753458249499e-06 9.33736464503454e-06 
0.0819422751665115 4.07072093366878e-06 -1.89662409866287e-06 9.10291055333801e-06 
0.0890078023076057 -4.87964462081436e-06 6.59711929529294e-07 8.66352456796449e-06 
0.0950958058238029 -1.37533133965917e-05 2.2772396732762e-06 7.98738255980425e-06 
0.100297138094902 -2.17798060475616e-05 4.14739133702824e-06 7.90782451076666e-06 
0.104766063392162 -2.84995658148546e-05 4.26514407081413e-06 7.24821984476876e-06 
0.108607172966003 -3.38637946697418e-05 4.92704612042871e-06 6.93601850798586e-06 
0.111691027879715 -3.73866605514195e-05 5.92541482546949e-06 6.78838296153117e-06 
0.114439912140369 -3.87705840694252e-05 6.64894014335005e-06 6.63177070236998e-06 
0.116830825805664 -3.97183393943124e-05 7.9858718891046e-06 6.63274931866908e-06 
0.118973948061466 -3.75917406927329e-05 9.61780369834742e-06 6.59169791106251e-06 
0.120837233960629 -3.76952812075615e-05 9.6305666374974e-06 6.38012352283113e-06 
0.122451916337013 -3.28179448843002e-05 1.06122715806123e-05 5.67437109566526e-06 
0.123745568096638 -2.93341599899577e-05 1.26910854305606e-05 5.32681951881386e-06 
0.124817036092281 -2.62296325672651e-05 1.38464811243466e-05 4.73358659291989e-06 
0.125584304332733 -2.7072208467871e-05 1.50237829075195e-05 4.15274871556903e-06 
0.126097619533539 -2.92141230602283e-05 1.62705218826886e-05 3.39726102538407e-06 
0.126459360122681 -3.39932958013378e-05 1.65019155247137e-05 3.14799558509549e-06 
0.126690909266472 -3.6100231227465e-05 1.62350752361817e-05 2.50456992034742e-06 
0.126959413290024 -3.91256289731245e-05 1.66413101396756e-05 2.39865107687365e-06 
0.127210095524788 -3.75803065253422e-05 1.67856396728894e-05 1.72377121998579e-06 
0.127587497234344 -3.63975595973898e-05 1.70883522514487e-05 1.33863647988619e-06 
0.127962484955788 -3.60234735126141e-05 1.78125028469367e-05 1.22569042559917e-06 
0.128234431147575 -3.55762349499855e-05 1.86802935786545e-05 9.96253220364451e-07 
0.128375291824341 -3.26896479236893e-05 1.79755043063778e-05 3.51111026475337e-07 
0.128496959805489 -3.35462063958403e-05 1.7216651031049e-05 -4.50043842192827e-07 
0.128405511379242 -3.16632140311413e-05 1.84712898771977e-05 -1.09409540982597e-06 
0.1282107681036 -3.25926957884803e-05 1.71979645529063e-05 -2.05342075787485e-06 
0.128089860081673 -3.64504121534992e-05 1.52904449350899e-05 -2.34939761867281e-06 
0.127737388014793 -4.01132238039281e-05 1.29120044221054e-05 -2.74533908850572e-06 
0.12739922106266 -4.54404034826439e-05 1.19859068945516e-05 -2.24013979277515e-06 
0.127029970288277 -5.19635068485513e-05 9.16850240173517e-06 -1.81517475539295e-06 
0.126655757427216 -5.1957704272354e-05 8.9491149992682e-06 -1.09573511508643e-06 
0.126099616289139 -5.3176478104433e-05 8.08926142781274e-06 -7.34530999579874e-07 
0.125649988651276 -5.10562422277872e-05 9.26382017496508e-06 -1.03014394881029e-06 
0.125027492642403 -4.4616488594329e-05 9.4316292233998e-06 -1.33290120629681e-06 
0.124400019645691 -3.92054098483641e-05 9.92356399365235e-06 -1.92511674868001e-06 
0.123673111200333 -3.90128443541471e-05 8.91710715222871e-06 -2.76189780379354e-06 
0.12295063585043 -3.74264272977598e-05 8.06360458227573e-06 -3.61665752279805e-06 
0.122140720486641 -3.81435493181925e-05 5.87655085837469e-06 -3.73874263459584e-06 
0.121309846639633 -4.14090609410778e-05 3.13461782752711e-06 -3.72708768736629e-06 
0.120304264128208 -4.38809329352807e-05 8.79203753356705e-07 -3.31586875290668e-06 
0.119242012500763 -4.33185996371321e-05 -6.23374489805428e-07 -2.85067631011771e-06 
0.118051424622536 -4.35497204307467e-05 -1.7489804804427e-06 -2.7781895823864e-06 
0.116890326142311 -4.43400240328629e-05 -2.56456314673414e-06 -2.49469007940206e-06 
0.115760497748852 -4.41917218267918e-05 -3.87980844607227e-06 -2.3280110781343e-06 
0.114810951054096 -4.38432689406909e-05 -3.45171929438948e-06 -2.79617711385072e-06 
0.114025101065636 -4.38114875578322e-05 -3.82804455512087e-06 -3.60097806151316e-06 
0.113401465117931 -3.72135546058416e-05 -3.56133523382596e-06 -3.28094210999552e-06 
0.112936161458492 -3.26516965287738e-05 -3.72886688637664e-06 -3.71279816135939e-06 
0.112412430346012 -2.5970346541726e-05 -3.02307216770714e-06 -4.14895612266264e-06 
0.111954264342785 -2.0186698748148e-05 -3.98168367610197e-06 -4.11608289141441e-06 
0.111267976462841 -1.56755704665557e-05 -3.65552227776789e-06 -3.74594696950226e-06 
0.110434338450432 -1.61402658704901e-05 -3.77998867406859e-06 -4.46153626398882e-06 
0.109194703400135 -1.06773877632804e-05 -4.83349458590965e-06 -4.3537215788092e-06 
0.107773885130882 -6.81439087202307e-06 -5.47585023014108e-06 -4.39879431723966e-06 
0.105955801904202 -5.55012002223521e-06 -7.4805775511777e-06 -4.50662264483981e-06 
0.10401850938797 -7.10838946815784e-07 -1.09289048850769e-05 -4.40267831436358e-06 
0.101992689073086 3.67790835298365e-06 -1.35861673697946e-05 -3.56840769200062e-06 
0.0999151468276978 2.26686950099975e-07 -1.50901068991516e-05 -3.52113715962332e-06 
0.0978285595774651 -1.8166520021623e-06 -1.66583486134186e-05 -3.25793689626153e-06 
0.0958710983395576 5.10079757987114e-07 -1.8864193407353e-05 -2.8297044991632e-06 
0.0939496606588364 2.5440731405979e-06 -1.87783261935692e-05 -3.04977470477752e-06 
0.092147558927536 5.8130231082032e-06 -2.03767649509246e-05 -3.64267066288448e-06 
0.090506337583065 1.34628871819586e-05 -2.07618613785598e-05 -3.89538354284014e-06 
0.0888880789279938 1.99821733986028e-05 -2.08334531635046e-05 -4.2417086660862e-06 
0.0873594656586647 3.09083079628181e-05 -2.01786588149844e-05 -4.72366900794441e-06 
0.0857647210359573 3.71240130334627e-05 -2.03879444597987e-05 -4.96621487400262e-06 
0.0839772000908852 4.54682594863698e-05 -1.98085381271085e-05 -5.30896431882866e-06 
0.0821409150958061 5.61664346605539e-05 -1.91996368812397e-05 -5.42354200661066e-06 
0.080201767385006 6.209006824065e-05 -2.0507408407866e-05 -5.73469742448651e-06 
0.078038789331913 6.32684677839279e-05 -2.10555263038259e-05 -5.4916617955314e-06 
0.0759337469935417 7.04002595739439e-05 -2.23496554099256e-05 -4.81697088616784e-06 
0.0736990720033646 7.42852571420372e-05 -2.32911443163175e-05 -4.17042565459269e-06 
0.0713829472661018 7.64188371249475e-05 -2.56128168985015e-05 -3.59689215656545e-06 
0.0690568313002586 8.19530905573629e-05 -2.6749055905384e-05 -2.80176982414559e-06 
0.0666846036911011 9.06606583157554e-05 -2.72304241661914e-05 -2.08342407859163e-06 
0.0641915500164032 9.75954026216641e-05 -2.7820289687952e-05 -1.74394392615795e-06 
0.0616970658302307 0.000104849583294708 -2.81249285762897e-05 -9.90531134448247e-07 
0.0591717958450317 0.000112109781184699 -2.78314892057097e-05 -2.20779639903412e-07 
0.0565796121954918 0.000123839257867076 -2.77435483440058e-05 7.81938922500558e-07 
0.0540069043636322 0.000133859837660566 -2.71385215455666e-05 1.71420640526776e-06 
0.0513964965939522 0.000145594720379449 -2.56052899203496e-05 2.4718826807657e-06 
0.0489152260124683 0.000160471754497848 -2.39432429225417e-05 3.1283402677218e-06 
0.0464209280908108 0.000176768910023384 -2.15067448152695e-05 3.85186058338149e-06 
0.043978538364172 0.000191345781786367 -1.87337354873307e-05 4.22895118390443e-06 
0.0414729043841362 0.000207763441721909 -1.58099428517744e-05 4.35288211519946e-06 
0.0390252023935318 0.000221991780563258 -1.30831203932757e-05 4.81334654978127e-06 
0.036536917090416 0.000234973253100179 -1.07993464553147e-05 5.14738712809049e-06 
0.0340326689183712 0.00024840616970323 -7.76408887759317e-06 5.17782928000088e-06 
0.0314373970031738 0.000261136592598632 -4.1579414755688e-06 5.17133412358817e-06 
0.0288654677569866 0.000272729463176802 -1.61543894705574e-07 4.83024450659286e-06 
0.0262719783931971 0.000282650726148859 4.22441371483728e-06 4.14710257246043e-06 
0.0237089116126299 0.000292144191917032 9.41482994676335e-06 3.16082287099562e-06 
0.0212243553251028 0.000297582766506821 1.43417664730805e-05 1.94479275705817e-06 
0.0189082566648722 0.000300456886179745 1.93527212104527e-05 7.15309738552605e-07 
0.0167167317122221 0.000298477127216756 2.37423791986657e-05 -6.38765982330369e-07 
0.0146670052781701 0.000293420685920864 2.78136794804595e-05 -2.12614190786553e-06 
0.0127146588638425 0.000282125431112945 3.07169611915015e-05 -3.50304094354215e-06 
0.0108694154769182 0.000265848211711273 3.25163273373619e-05 -4.8608121687721e-06 
0.00911982730031013 0.000242962763877586 3.2655199902365e-05 -5.93944150750758e-06 
0.00749605102464557 0.000215375606785528 3.11352923745289e-05 -6.58986527923844e-06 
0.00601113867014647 0.00018405620357953 2.81088541669305e-05 -6.78918468111078e-06 
0.00467773852869868 0.000151745567563921 2.41291709244251e-05 -6.59127454127884e-06 
0.00351850409060717 0.000119803393317852 1.95645970961777e-05 -5.8736850405694e-06 
0.00256183347664773 9.14338670554571e-05 1.51203848872683e-05 -4.97332257509697e-06 
0.0017904118867591 6.75717965350486e-05 1.11978224595077e-05 -4.02393607146223e-06 
0.0011957025853917 4.85530254081823e-05 8.04220326244831e-06 -3.1415779631061e-06 
0.000767518591601402 3.42055682267528e-05 5.73021179661737e-06 -2.39757332565205e-06 
0.000458194874227047 2.35105580941308e-05 3.91509274777491e-06 -1.79505241248989e-06 
0.000240526278503239 1.62034521054011e-05 2.74454305326799e-06 -1.4010973927725e-06 
9.72477500909008e-05 1.13070573206642e-05 2.00962449525832e-06 -1.1235575811952e-06 
3.79738980882394e-06 7.71703525970224e-06 1.43119950735127e-06 -8.84054202288098e-07 
-6.56488773529418e-05 5.07375762026641e-06 9.58106511461665e-07 -7.24509789051808e-07 
-0.000106248713564128 3.55932866114017e-06 7.73358124206425e-07 -6.35982587482431e-07 
-0.000126795697724447 2.43383624365379e-06 5.96361928728584e-07 -5.13040845362411e-07 
-0.000145997037179768 1.42117858104029e-06 4.4732823312188e-07 -4.49564282689607e-07 
-0.000156025533215143 1.02239084753819e-06 4.21855474996846e-07 -4.04503367690268e-07 
-0.000164356999448501 6.65191976167989e-07 3.778123129905e-07 -3.52648470425265e-07 
-0.000167757854796946 5.23266749041795e-07 4.22772444608199e-07 -2.95770405500662e-07 
0 0 0 0 
0 0 0 0 
0 0 0 0 
0 0 0 0 
0 0 0 0 
0 0 0 0 
0 0 0 0 
0 0 0 0 
0 0 0 0 
0 0 0 0 
0 0 0 0 
0 0 0 0 
0 0 0 0 
0 0 0 0 
99.8486862182617 0.123207397758961 0.0176218505948782 0.00490814819931984 
