0 0 0 0 
0 0 0 0 
0 0 0 0 
0 0 0 0 
0 0 0 0 
0 0 0 0 
0 0 0 0 
0 0 0 0 
0 0 0 0 
0 0 0 0 
0.000777422334067523 -7.92806094978005e-05 1.56444148160517e-05 -2.37132690017461e-06 
0.000883406028151512 -7.57956513552926e-05 1.50364485307364e-05 -2.63466267824697e-06 
0.0010028489632532 -6.82423415128142e-05 1.56348723976407e-05 -3.38097061103326e-06 
0.00114553398452699 -5.40626897418406e-05 1.64441917149816e-05 -4.19561320086359e-06 
0.00141173345036805 -3.3587002690183e-05 1.71784104168182e-05 -4.73369345854735e-06 
0.00179653579834849 -9.32814873522148e-06 1.70101830008207e-05 -4.90306319989031e-06 
0.00217272294685245 1.27098110169754e-05 1.6233467249549e-05 -4.48875744041288e-06 
0.00251317676156759 2.87008861050708e-05 1.46511019920581e-05 -3.96847826777957e-06 
0.00275341258384287 3.66950152965728e-05 1.24533034977503e-05 -3.10987411467067e-06 
0.00279606855474412 3.61923703167122e-05 1.03969996416708e-05 -2.54853875958361e-06 
0.00265782908536494 3.11462936224416e-05 9.19988815439865e-06 -1.96156906895339e-06 
0.00246583018451929 2.78778024949133e-05 8.34678394312505e-06 -1.93283312910353e-06 
0.00226546940393746 2.5503200959065e-05 7.77717195887817e-06 -1.86705267424259e-06 
0.00211738492362201 2.33175760513404e-05 7.36603715267847e-06 -1.78440370746102e-06 
0.0020314110442996 2.17060096474597e-05 7.03897239873186e-06 -1.7669417502475e-06 
0.00204063556157053 2.12214945349842e-05 6.73212707624771e-06 -1.72193358594086e-06 
0.00213591638021171 2.04867374122841e-05 6.56318616165663e-06 -1.73801527125761e-06 
0.00227497844025493 1.95011671166867e-05 6.30323256700649e-06 -1.71303020124469e-06 
0.00245859450660646 1.89064867299749e-05 6.11108771408908e-06 -1.67251164384652e-06 
0.00266747595742345 1.9398910808377e-05 5.74589785173885e-06 -1.64450750617107e-06 
0.0028271502815187 1.86109446076443e-05 5.57520525035216e-06 -1.73937621639197e-06 
0.00291841826401651 1.81731593329459e-05 5.32352351001464e-06 -1.57727606620028e-06 
0.00295025715604424 1.72506406670436e-05 5.43343367098714e-06 -1.56834141762374e-06 
0.00288939592428505 1.76217545231339e-05 5.98628639636445e-06 -1.62454819019331e-06 
0.0027437771204859 1.85347125807311e-05 6.88018417349667e-06 -1.90366404240194e-06 
0.00263124750927091 2.05696724151494e-05 7.47914418752771e-06 -1.93373102774785e-06 
0.0026017518248409 2.09037552849622e-05 7.69892449170584e-06 -2.0474221855693e-06 
0.00271798018366098 2.16410517168697e-05 7.29575731384102e-06 -2.05861897484283e-06 
0.00304193934425712 2.13654893741477e-05 6.30551085123443e-06 -2.02313867703197e-06 
0.00366113381460309 2.01697584998328e-05 5.02230705023976e-06 -1.90083710549516e-06 
0.00461830664426088 1.81803570740158e-05 3.84460372515605e-06 -2.05103083317226e-06 
0.00609090132638812 1.76321664184798e-05 2.85668261312821e-06 -2.38446091316291e-06 
0.00829653814435005 1.77064721356146e-05 2.20260608330136e-06 -2.73984574050701e-06 
0.0114885605871677 1.82688781933393e-05 1.50537607623846e-06 -3.28830651596945e-06 
0.0159032605588436 1.66319841810036e-05 4.40407745827542e-07 -4.16300053984742e-06 
0.0217481721192598 1.45288431667723e-05 -8.91753700216213e-07 -5.08985613123514e-06 
0.029007313773036 1.31716351461364e-05 -2.60491515291505e-06 -6.15588669461431e-06 
0.0374099314212799 1.07798723547603e-05 -4.67611107524135e-06 -6.93150650477037e-06 
0.0466445833444595 6.02108912062249e-06 -6.72385976940859e-06 -7.54861548557528e-06 
0.0562633015215397 2.48036553784914e-06 -9.55052655626787e-06 -7.23125367585453e-06 
0.0655833184719086 -1.12890274976962e-05 -1.11430063043372e-05 -6.76831132295774e-06 
0.0742280706763268 -3.01584859698778e-05 -1.19325959531125e-05 -5.38479253009427e-06 
0.0820988491177559 -4.75930828542914e-05 -1.23325035019661e-05 -5.00897613164852e-06 
0.0890536829829216 -7.44665449019521e-05 -1.18681527965236e-05 -4.42766804553685e-06 
0.0949519723653793 -0.000105389546661172 -9.64790433499729e-06 -4.64566255686805e-06 
0.0999763235449791 -0.000125082457088865 -8.66257141751703e-06 -5.37663072464056e-06 
0.104312479496002 -0.000140188189106993 -7.81934977567289e-06 -5.52115170648904e-06 
0.108044542372227 -0.000150622581713833 -6.53060897093383e-06 -5.19523564435076e-06 
0.111140631139278 -0.000147602244396694 -6.36999220660073e-06 -5.08382527186768e-06 
0.113916955888271 -0.000134712041472085 -7.2551915764052e-06 -4.19234720538952e-06 
0.116354666650295 -0.000121077835501637 -8.39324457047042e-06 -3.0029275421839e-06 
0.11846923828125 -0.000102317186247092 -9.10161907086149e-06 -3.06211654788058e-06 
0.120149791240692 -9.22733670449816e-05 -1.03273796412395e-05 -2.47215621129726e-06 
0.121664881706238 -7.63192801969126e-05 -1.11664912765264e-05 -1.61608795679058e-06 
0.122834704816341 -6.3643696194049e-05 -1.152734785137e-05 -2.39749306274462e-06 
0.12378915399313 -5.33827005710918e-05 -1.18183297672658e-05 -2.60204228652583e-06 
0.124511405825615 -5.0338807341177e-05 -1.26824106700951e-05 -1.66542463375663e-06 
0.125033289194107 -4.55242807220202e-05 -1.32023697005934e-05 -1.20413210424886e-06 
0.125431373715401 -4.3013827962568e-05 -1.31957949633943e-05 -1.64229277288541e-06 
0.125875800848007 -3.84699706046376e-05 -1.34217661980074e-05 -5.95187486851501e-07 
0.126270771026611 -4.15091162722092e-05 -1.3921922800364e-05 8.12782445791527e-07 
0.126797586679459 -3.69718254660256e-05 -1.332901774731e-05 9.6118446890614e-07 
0.127387315034866 -4.10148386436049e-05 -1.37450879265089e-05 1.79147536982782e-06 
0.127950429916382 -4.65484808955807e-05 -1.40352331072791e-05 2.14273131859954e-06 
0.128372296690941 -5.48593889106996e-05 -1.34804176923353e-05 3.30198781739455e-06 
0.128781169652939 -5.88279290241189e-05 -1.12765783342184e-05 3.13781242766709e-06 
0.128939121961594 -7.5755589932669e-05 -1.05569461084087e-05 4.40450094174594e-06 
0.129037544131279 -7.70861806813627e-05 -8.46559669298586e-06 5.09170286022709e-06 
0.128763183951378 -0.000101725338026881 -6.58802719044616e-06 5.86795476920088e-06 
0.128502413630486 -0.000127718769363128 -4.97302153235069e-06 4.18403715229942e-06 
0.128102764487267 -0.000152388180140406 -4.50507332061534e-06 4.31732178185484e-06 
0.12778528034687 -0.000167398611665703 -3.44943032359879e-06 3.21126071867184e-06 
0.127379521727562 -0.000191993749467656 -2.44633042711939e-06 8.04038052137912e-07 
0.127308920025826 -0.000187025376362726 -2.39606424656813e-06 -7.98220639808278e-07 
0.127001389861107 -0.00019008586241398 -2.08027472581307e-06 -5.16029047048505e-07 
0.126786276698112 -0.000181917057489045 -1.76298601672897e-06 -7.52225389533123e-07 
0.126382350921631 -0.000172525033121929 -7.56757742692571e-07 -1.30212697513343e-06 
0.125894799828529 -0.000161987511091866 -8.50239587180113e-07 -5.8536909364193e-07 
0.125114113092422 -0.000168360260431655 3.17920950010375e-07 1.16753618328858e-07 
0.124274618923664 -0.000173201042343862 6.05633317718457e-07 6.95192170496739e-07 
0.123311385512352 -0.00017781974747777 1.82205303644878e-06 7.39605184207903e-07 
0.122274339199066 -0.000191473605809733 1.80649544745393e-06 7.49554430967692e-07 
0.121096953749657 -0.000199135523871519 3.42851240020536e-06 6.07040703926032e-07 
0.119860865175724 -0.000202788360184059 4.13321913583786e-06 7.49354001072788e-07 
0.118625029921532 -0.00019352107483428 6.0714160099451e-06 6.39804966340307e-07 
0.117432273924351 -0.000195007407455705 7.14205771146226e-06 6.04351555466565e-07 
0.116264194250107 -0.000187430036021397 7.77982677391265e-06 1.61721379754454e-06 
0.11543108522892 -0.000171818304806948 8.29169766802806e-06 2.24263521886314e-06 
0.11472924053669 -0.000159341201651841 8.94744243851164e-06 3.02227704196412e-06 
0.114262439310551 -0.00014212068344932 8.27634994493565e-06 3.65587970918568e-06 
0.113762833178043 -0.000129506050143391 8.08768618298927e-06 4.44113538833335e-06 
0.113293319940567 -0.000117880663310643 8.61180706124287e-06 5.16013869855669e-06 
0.112744465470314 -0.000116804105346091 8.45870818011463e-06 5.91676734984503e-06 
0.111944496631622 -0.000113475907710381 8.81628056959016e-06 7.02474653735408e-06 
0.110815338790417 -0.000118616204417776 1.00186298368499e-05 6.54215136819403e-06 
0.109392695128918 -0.000114138347271364 1.06264978967374e-05 4.95647100251517e-06 
0.107697442173958 -0.000114603441033978 1.26230788737303e-05 4.10814209317323e-06 
0.105511017143726 -0.000123221354442649 1.43064316944219e-05 2.71263706963509e-06 
0.103348217904568 -0.000121184013551101 1.39280082294135e-05 6.56101633467188e-07 
0.101184047758579 -0.000118021773232613 1.28270130517194e-05 7.13034751242958e-08 
0.098985381424427 -0.000114814938569907 1.29853215184994e-05 -2.12646735775479e-08 
0.0969054475426674 -9.59894532570615e-05 1.19296591947204e-05 -2.00004569705925e-06 
0.0950597301125526 -7.37876616767608e-05 1.05557664937805e-05 -1.82396570380661e-06 
0.0933231860399246 -4.34267312812153e-05 1.14449685497675e-05 -1.85619410331128e-06 
0.0915801301598549 -1.71779574884567e-05 1.24161979329074e-05 -1.30323303437763e-06 
0.0900036990642548 1.41913760671741e-05 1.26421527966158e-05 -2.6426238264321e-07 
0.0883755534887314 4.10574903071392e-05 1.26684535644017e-05 9.23438051358971e-07 
0.0868956223130226 8.00468260422349e-05 1.35816835609148e-05 1.13852263439185e-06 
0.0851675197482109 0.000108849868411198 1.35357558974647e-05 2.29871670853754e-06 
0.0833435356616974 0.000149491912452504 1.42885673994897e-05 2.96621283268905e-06 
0.0814638361334801 0.000196922628674656 1.47231221490074e-05 2.89201580017107e-06 
0.0792288333177567 0.000232686114031821 1.54418594320305e-05 2.09788026950264e-06 
0.0766367316246033 0.000265522277913988 1.57024114741944e-05 1.13101975784957e-06 
0.0741741359233856 0.000305233872495592 1.59910377988126e-05 -7.07991887338721e-07 
0.0715004578232765 0.000339427788276225 1.59234568855027e-05 -1.41851944590599e-06 
0.0686585232615471 0.000366521795513108 1.51395015564049e-05 -2.48337300945423e-06 
0.0659864842891693 0.000403129932237789 1.47952250699745e-05 -2.22487869905308e-06 
0.0633602142333984 0.000449677667347714 1.35070458782138e-05 -2.60188130596362e-06 
0.0605961419641972 0.000495026004500687 1.21115817819373e-05 -2.96822963719023e-06 
0.057892169803381 0.000543797505088151 9.88251122180372e-06 -4.04629918193677e-06 
0.0551818609237671 0.000595275952946395 8.57113536767429e-06 -4.50575589638902e-06 
0.0524876080453396 0.000652025686576962 6.86113480696804e-06 -5.15169358550338e-06 
0.0498035214841366 0.000703358324244618 5.71107284486061e-06 -5.96605514147086e-06 
0.0470844693481922 0.000754860986489803 4.43411863670917e-06 -5.57074872631347e-06 
0.0445559471845627 0.00080942694330588 3.44568138643808e-06 -5.98341239310685e-06 
0.0421043261885643 0.000863029737956822 2.25329881686775e-06 -6.56816700939089e-06 
0.0397543087601662 0.000912501302082092 1.87643706794915e-07 -7.07556773704709e-06 
0.0374819226562977 0.000960787700023502 -1.93161849892931e-06 -6.36049662716687e-06 
0.035416878759861 0.00100254663266242 -3.9776509765943e-06 -6.47440128886956e-06 
0.0333463773131371 0.00103179051075131 -5.79076868234552e-06 -5.82873826715513e-06 
0.0314007997512817 0.00105628930032253 -7.60618513595546e-06 -4.66730307380203e-06 
0.0294504519551992 0.00106649508234113 -8.65928359417012e-06 -4.21171171183232e-06 
0.0275486297905445 0.00106384011451155 -9.62853027886013e-06 -3.51071003024117e-06 
0.0255454052239656 0.00104648480191827 -9.7790280051413e-06 -1.37002734845737e-06 
0.0236017070710659 0.00101981812622398 -9.61642035690602e-06 7.23823632142739e-07 
0.0215602926909924 0.000974473543465137 -9.2026320999139e-06 3.4539884836704e-06 
0.0195156838744879 0.000918978999834508 -8.55318376125069e-06 7.43259761293302e-06 
0.0173474308103323 0.000847788120154291 -7.08577999830595e-06 1.15307484520599e-05 
0.0151818860322237 0.000765008735470474 -5.3345320338849e-06 1.41083055495983e-05 
0.0128613654524088 0.00066918070660904 -3.22461846735678e-06 1.60412164404988e-05 
0.0106129702180624 0.000572210119571537 -9.60722331910802e-07 1.73224780155579e-05 
0.0084396218881011 0.000473540392704308 1.33509377064911e-06 1.7117039533332e-05 
0.00648829992860556 0.000381662393920124 3.53995051227685e-06 1.54117915371899e-05 
0.00474956352263689 0.000301668827887625 5.2790292102145e-06 1.30288553918945e-05 
0.00334091437980533 0.0002363926905673 6.80021139487508e-06 1.05916042230092e-05 
0.00216840580105782 0.000181360956048593 8.29613691166742e-06 7.49545688449871e-06 
0.00130656093824655 0.000140486707095988 9.55811719904887e-06 4.77346702609793e-06 
0.000622920575551689 0.000109727974631824 1.04216296676896e-05 2.63111314779962e-06 
0.000151828891830519 8.7040891230572e-05 1.12280222310801e-05 9.83025188361353e-07 
-0.000179850088898093 7.08030420355499e-05 1.1509946489241e-05 -2.62768622860676e-07 
-0.000363271654350683 5.96872341702692e-05 1.13441183202667e-05 -1.15578461645782e-06 
-0.000493186467792839 5.17481639690232e-05 1.10053215394146e-05 -1.57080671669974e-06 
-0.000538932159543037 4.64641525468323e-05 1.05808903754223e-05 -1.76452715550113e-06 
-0.000586622511036694 4.1695537220221e-05 9.82500478130532e-06 -1.8858735302274e-06 
-0.000579714484047145 3.77152791770641e-05 9.23101015359862e-06 -2.00258796212438e-06 
-0.00060681882314384 3.38965510309208e-05 8.80221887200605e-06 -1.92553488886915e-06 
-0.000604954664595425 3.06715010083281e-05 8.44757505547022e-06 -1.91684785022517e-06 
-0.000613376265391707 2.81037555396324e-05 8.06684238341404e-06 -1.84578300377325e-06 
-0.000585293513722718 2.61612276517553e-05 7.80992468207842e-06 -1.88717035598529e-06 
-0.000565990805625916 2.50492194027174e-05 7.51319703340414e-06 -1.86103761734557e-06 
-0.000545369635801762 2.31056492339121e-05 7.18921683073859e-06 -2.22809535443957e-06 
0 0 0 0 
0 0 0 0 
0 0 0 0 
0 0 0 0 
0 0 0 0 
0 0 0 0 
0 0 0 0 
0 0 0 0 
0 0 0 0 
0 0 0 0 
0 0 0 0 
0 0 0 0 
0 0 0 0 
0 0 0 0 
99.5328979492188 0.442607462406158 0.0121749648824334 0.00600007409229875 
