0 0 0 0 
0 0 0 0 
0 0 0 0 
0 0 0 0 
0 0 0 0 
0 0 0 0 
0 0 0 0 
0 0 0 0 
0 0 0 0 
0 0 0 0 
0.0015025760512799 -0.000121986551675946 2.20736837945879e-05 -2.96426082968537e-06 
0.00180608138907701 -0.000130985368741676 3.1110812415136e-05 -5.76857019041199e-06 
0.00212367926724255 -0.00013160367961973 4.11657856602687e-05 -8.35766877571587e-06 
0.0025424687191844 -0.000129322201246396 5.04049894516356e-05 -1.09628063000855e-05 
0.00323252310045063 -0.000118627482152078 5.75173326069489e-05 -1.28482161017018e-05 
0.0041293865069747 -0.00010047549585579 6.28417765256017e-05 -1.38217010317021e-05 
0.00512962695211172 -7.85769952926785e-05 6.51812079013325e-05 -1.38887917273678e-05 
0.00617642467841506 -5.59051768505014e-05 6.41344813629985e-05 -1.34338069983642e-05 
0.00716639216989279 -3.46981360053178e-05 6.08445552643389e-05 -1.22521096272976e-05 
0.00783452671021223 -1.77366800926393e-05 5.72500066482462e-05 -1.11777117126621e-05 
0.00821490399539471 -5.98158339926158e-06 5.29919780092314e-05 -1.02833537312108e-05 
0.00840646401047707 3.09135430143215e-06 4.89989652123768e-05 -9.62119338510092e-06 
0.00839697476476431 1.03054462670116e-05 4.59648945252411e-05 -9.04405260371277e-06 
0.00825814809650183 1.6307638361468e-05 4.34514113294426e-05 -8.48820855026133e-06 
0.00806891545653343 2.06389904633397e-05 4.1265731852036e-05 -8.02512931841193e-06 
0.00785231962800026 2.41559209825937e-05 3.95695460611023e-05 -7.67261917644646e-06 
0.00763121386989951 2.70142518274952e-05 3.83402402803767e-05 -7.26882535673212e-06 
0.0074319327250123 2.90588650386781e-05 3.73544498870615e-05 -7.06908895153902e-06 
0.00721707474440336 3.05314497381914e-05 3.6898440157529e-05 -6.83694406689028e-06 
0.00701317377388477 3.20005528919864e-05 3.65246451110579e-05 -6.62485172142624e-06 
0.00679966248571873 3.29265094478615e-05 3.63407780241687e-05 -6.50033280180651e-06 
0.0065770810469985 3.35508484567981e-05 3.62066748493817e-05 -6.63366790831788e-06 
0.00635375268757343 3.44687250617426e-05 3.60817903128918e-05 -6.64204844724736e-06 
0.00614372966811061 3.54801377397962e-05 3.56677592208143e-05 -6.84155338603887e-06 
0.00593650666996837 3.62566170224454e-05 3.51346861862112e-05 -7.05299316905439e-06 
0.00571701256558299 3.63649087375961e-05 3.47422646882478e-05 -7.14716452421271e-06 
0.00552254775539041 3.6522662412608e-05 3.44260188285261e-05 -7.16507429388002e-06 
0.00539567554369569 3.72784197679721e-05 3.39349135174416e-05 -6.99203383192071e-06 
0.0053102015517652 3.76496464014053e-05 3.36119301209692e-05 -6.73128306516446e-06 
0.00528279831632972 3.8307458453346e-05 3.36778721248265e-05 -6.45607133265003e-06 
0.00537037663161755 4.00616954721045e-05 3.3877953683259e-05 -6.16103534412105e-06 
0.00553980004042387 4.19605457864236e-05 3.42081075359602e-05 -5.80853156861849e-06 
0.00575419189408422 4.34790999861434e-05 3.48663597833365e-05 -5.55666520085651e-06 
0.0060388226993382 4.55899134976789e-05 3.56665004801471e-05 -5.45494958714698e-06 
0.00638571288436651 4.7605612053303e-05 3.66935673810076e-05 -5.23407061336911e-06 
0.00678447866812348 4.98387562402058e-05 3.78067998099141e-05 -5.04074796481291e-06 
0.00722371088340878 5.22429872944485e-05 3.92286856367718e-05 -4.84122756461147e-06 
0.00768340099602938 5.45331677130889e-05 4.12129411415663e-05 -4.82978202853701e-06 
0.00814494770020247 5.65218142583035e-05 4.35848123743199e-05 -4.73620229968219e-06 
0.00859533529728651 5.87523973081261e-05 4.56802190456074e-05 -4.68628604721744e-06 
0.00900587905198336 6.00982639298309e-05 4.75623819511384e-05 -4.60851333627943e-06 
0.00938419159501791 6.11430805292912e-05 4.91280625283252e-05 -4.6330956138263e-06 
0.00973910372704268 6.23459709458984e-05 5.03208466398064e-05 -4.46519698016346e-06 
0.0101062934845686 6.36115728411824e-05 5.10158861288801e-05 -4.27185341322911e-06 
0.0104466341435909 6.4395455410704e-05 5.19097702635918e-05 -4.28338307756349e-06 
0.0108130294829607 6.5834610722959e-05 5.2549185056705e-05 -4.29099509346997e-06 
0.0111965965479612 6.73144677421078e-05 5.30089855601545e-05 -4.29095280196634e-06 
0.0115969935432076 6.86982020852156e-05 5.29488825122826e-05 -4.32478054790408e-06 
0.0120078409090638 7.00212694937363e-05 5.26988696947228e-05 -4.36725940744509e-06 
0.0124404160305858 7.14407142368145e-05 5.23253729625139e-05 -4.23909341407125e-06 
0.0128951603546739 7.28034283383749e-05 5.21624060638715e-05 -4.11779410569579e-06 
0.0133628882467747 7.38675298634917e-05 5.21594702149741e-05 -3.9743381421431e-06 
0.0138967446982861 7.51387342461385e-05 5.22937625646591e-05 -3.79138259631873e-06 
0.0144836315885186 7.61168339522555e-05 5.25550567544997e-05 -3.59893851964443e-06 
0.0151891373097897 7.75271182646975e-05 5.28228410985321e-05 -3.39489338330168e-06 
0.0159934107214212 7.8521370596718e-05 5.33257880306337e-05 -3.32523927681905e-06 
0.0169576182961464 7.98445253167301e-05 5.37615233042743e-05 -3.13203963742126e-06 
0.017989493906498 7.98214605310932e-05 5.47148665646091e-05 -3.16103501063481e-06 
0.0191020611673594 7.99001500126906e-05 5.57746425329242e-05 -3.28032638208242e-06 
0.0202263053506613 7.84220028435811e-05 5.6896638852777e-05 -3.66127915185643e-06 
0.0213141478598118 7.65361692174338e-05 5.80491578148212e-05 -3.96728091800469e-06 
0.0222377553582191 7.3070295911748e-05 5.86761234444566e-05 -4.43443468611804e-06 
0.0229696240276098 6.92998437443748e-05 5.79903171455953e-05 -4.8443439482071e-06 
0.0233582518994808 6.33151285001077e-05 5.71873752051033e-05 -5.3889875744062e-06 
0.023431446403265 5.86750174988993e-05 5.6132488680305e-05 -5.58592364541255e-06 
0.0231491718441248 5.48073257959913e-05 5.49382748431526e-05 -5.85100588068599e-06 
0.0226028747856617 5.32067388121504e-05 5.39097709406633e-05 -6.15669841863564e-06 
0.0218361020088196 5.32622761966195e-05 5.29606295458507e-05 -6.24850417807465e-06 
0.0209906585514545 5.59276340936776e-05 5.14192834089044e-05 -5.88605234952411e-06 
0.0200877040624619 5.81843232794199e-05 4.97262881253846e-05 -5.62138075110852e-06 
0.0192564353346825 6.1050865042489e-05 4.73577674711123e-05 -4.92025947096408e-06 
0.018504997715354 6.29682908765972e-05 4.5249344111653e-05 -4.14056603403878e-06 
0.0179030578583479 6.43162566120736e-05 4.39832474512514e-05 -3.30195348396956e-06 
0.0174716096371412 6.57860000501387e-05 4.33028508268762e-05 -2.68891858468123e-06 
0.0172368697822094 6.79239310557023e-05 4.25965808972251e-05 -1.9438887193246e-06 
0.0171182341873646 6.95146445650607e-05 4.24048885179218e-05 -1.58163504693221e-06 
0.0171167440712452 7.15353526175022e-05 4.19358475483023e-05 -1.22817721148749e-06 
0.0171895828098059 7.30157044017687e-05 4.10435895901173e-05 -9.66775132837938e-07 
0.0173028651624918 7.35831272322685e-05 4.0003884350881e-05 -6.96279983003478e-07 
0.0174678135663271 7.40402247174643e-05 3.88374392059632e-05 -4.52258433369934e-07 
0.0177692659199238 7.49355967855081e-05 3.72489703295287e-05 -2.48540203529046e-07 
0.018235644325614 7.58491878514178e-05 3.59141049557365e-05 3.14875677531745e-07 
0.0191183220595121 8.02803333499469e-05 3.47815257555339e-05 1.07664675397245e-06 
0.0207603350281715 8.92834868864156e-05 3.30243055941537e-05 2.35190236708149e-06 
0.023878775537014 0.000106838830106426 3.28510031977203e-05 4.09965332437423e-06 
0.0296103861182928 0.000136571412440389 3.52319766534492e-05 7.91439470049227e-06 
0.0389270819723606 0.000176564950379543 3.80011442757677e-05 1.31139649965917e-05 
0.0529183633625507 0.000221327281906269 4.32092965638731e-05 2.04595035029342e-05 
0.0718463510274887 0.000260207161772996 4.81922361359466e-05 2.78422448900528e-05 
0.0948581323027611 0.00027748174034059 4.938022539136e-05 3.46970482496545e-05 
0.119886741042137 0.000259034248301759 4.91546452394687e-05 3.89899723813869e-05 
0.144672036170959 0.000207256496651098 4.74649896204937e-05 4.0162485674955e-05 
0.166308537125587 0.000118887641292531 4.91241953568533e-05 3.66676031262614e-05 
0.183610618114471 2.26910797209712e-05 5.01418253406882e-05 3.1460847822018e-05 
0.196063444018364 -6.62868551444262e-05 4.96273132739589e-05 2.70347809419036e-05 
0.203704312443733 -0.000142934964969754 4.74932494398672e-05 2.04405005206354e-05 
0.207438722252846 -0.000204349067644216 4.82366995129269e-05 1.35934378704405e-05 
0.208742573857307 -0.000238232503761537 4.03301528422162e-05 9.82493747869739e-06 
0.208037808537483 -0.000259338645264506 3.04648965538945e-05 6.30066870144219e-06 
0.205763697624207 -0.00027573702391237 2.32145521295024e-05 1.86998681783734e-06 
0.20254947245121 -0.000282881228486076 1.31309971038718e-05 4.2781908859979e-07 
0.198898360133171 -0.000275933445664123 -2.24737846110656e-06 2.97388328363013e-06 
0.194573104381561 -0.000273015990387648 -1.69420800375519e-05 2.62759613178787e-06 
0.190182104706764 -0.000271531811449677 -3.18132588290609e-05 2.62946241491591e-06 
0.185580283403397 -0.000264983013039455 -4.29248393629678e-05 3.7961244743201e-06 
0.181204408407211 -0.000251285790000111 -5.06054057041183e-05 2.3067614165484e-06 
0.176693096756935 -0.000241907328017987 -5.27229785802774e-05 -9.777465947991e-07 
0.172318339347839 -0.000225503637921065 -5.12705992150586e-05 -4.60628280052333e-06 
0.167960748076439 -0.000204868774744682 -4.7134129999904e-05 -7.02443412592402e-06 
0.163483873009682 -0.000184836942935362 -4.60890951217152e-05 -1.19150226964848e-05 
0.158786326646805 -0.000162573574925773 -4.40853109466843e-05 -1.29013933474198e-05 
0.153915658593178 -0.000135660578962415 -4.33192035416141e-05 -1.55909201566828e-05 
0.149117946624756 -0.000105644852737896 -4.4025346142007e-05 -1.77425772562856e-05 
0.143864393234253 -7.28599989088252e-05 -4.17921946791466e-05 -1.92402894754196e-05 
0.138824239373207 -3.39533180522267e-05 -3.81864774681162e-05 -2.0766045054188e-05 
0.133801952004433 4.8100268941198e-06 -3.42182975145988e-05 -2.32978509302484e-05 
0.128918394446373 4.63530377601273e-05 -3.15815959766041e-05 -2.39672863244778e-05 
0.123947113752365 9.32583134272136e-05 -3.14426833938342e-05 -2.21539012272842e-05 
0.118921890854836 0.00013931276043877 -3.39332218572963e-05 -2.19241683225846e-05 
0.113677695393562 0.000185083335964009 -3.57055796484929e-05 -2.02252522285562e-05 
0.108169861137867 0.000229440178372897 -3.64438928954769e-05 -2.0278070223867e-05 
0.10237904638052 0.000270673510385677 -3.42362545779906e-05 -2.01601014850894e-05 
0.0964225009083748 0.000307317910483107 -2.87896418740274e-05 -2.13258281291928e-05 
0.0904960036277771 0.000345519656548277 -2.17965189222014e-05 -2.20520778384525e-05 
0.0846074000000954 0.000381681107683107 -1.57282975123962e-05 -2.20765086851316e-05 
0.0787761211395264 0.00041679127025418 -1.07010073406855e-05 -2.07519042305648e-05 
0.0732732564210892 0.000453671702416614 -8.42577446746873e-06 -1.92436364159221e-05 
0.0680362209677696 0.000491829065140337 -6.03226226303377e-06 -1.66410591191379e-05 
0.0630919262766838 0.000525062263477594 -4.60398177892785e-06 -1.36387461679988e-05 
0.0584746189415455 0.000553937628865242 -5.96373229200253e-06 -1.05995732155861e-05 
0.0542970709502697 0.000578321458306164 -1.14389795271563e-05 -6.66031382934307e-06 
0.0502003319561481 0.000591880292631686 -1.77650363184512e-05 -2.88667661152431e-06 
0.046049490571022 0.000591895717661828 -2.40222052525496e-05 1.57162207869987e-06 
0.0420455038547516 0.000581545173190534 -3.12620759359561e-05 6.04403885517968e-06 
0.0379808656871319 0.000558207044377923 -3.70257548638619e-05 9.95690970739815e-06 
0.0339177623391151 0.000524084898643196 -4.099756188225e-05 1.26518953038612e-05 
0.0300038792192936 0.000481416005641222 -4.43523458670825e-05 1.44382956932532e-05 
0.0263205617666245 0.000433189503382891 -4.82921532238834e-05 1.48299304782995e-05 
0.0226870663464069 0.000380062352633104 -5.04808849655092e-05 1.43739043778623e-05 
0.019212931394577 0.00032479310175404 -5.03636329085566e-05 1.31632941702264e-05 
0.0159163810312748 0.000269669049885124 -4.76532477478031e-05 1.1968446415267e-05 
0.0128582818433642 0.000217464155866764 -4.30309883086011e-05 1.02857911770116e-05 
0.0101509001106024 0.000170761384651996 -3.73766233678907e-05 8.60992076923139e-06 
0.00779986334964633 0.000129407431813888 -3.11138537654188e-05 6.52050357530243e-06 
0.00586759997531772 9.61367913987488e-05 -2.48669421125669e-05 4.87248962599551e-06 
0.00431556673720479 6.95739072398283e-05 -1.90505870705238e-05 3.34673541146913e-06 
0.00310697639361024 4.86225762870163e-05 -1.38804489324684e-05 2.17774345401267e-06 
0.00220197788439691 3.35093391186092e-05 -9.70282599155325e-06 1.05853723653127e-06 
0.00154914171434939 2.27734781219624e-05 -6.51502296022954e-06 6.69525547891681e-07 
0.00108888966497034 1.50845089592622e-05 -4.64224103779998e-06 2.76721237923994e-07 
0.000751884595956653 9.79166179604363e-06 -3.64393554264097e-06 -7.76735209484514e-09 
0.000539868313353509 6.46661101200152e-06 -3.51169546775054e-06 5.6465129461003e-08 
0.000395830313209444 3.88815396945574e-06 -3.52545566784102e-06 2.48035945560332e-07 
0.000298896542517468 2.0360214421089e-06 -3.84285203836043e-06 4.60547340708217e-07 
0.000247842923272401 8.72538066687412e-07 -4.31481521445676e-06 6.93434515142144e-07 
0.000217224529478699 5.89649630455824e-07 -4.70795157525572e-06 8.98022221917927e-07 
0.00021039012062829 2.96766216933975e-07 -5.01108252137783e-06 1.00383033441176e-06 
0.000204735508305021 4.73773951625844e-07 -5.1506267482182e-06 1.04501964415249e-06 
0.00019796981359832 5.66929600154253e-07 -4.98954932481865e-06 9.10270102849609e-07 
0.000206808821531013 6.26917767476698e-07 -4.76796731163631e-06 8.83597181200457e-07 
0.000164017925271764 2.62083773350241e-07 -4.00523731514113e-06 4.10009135975997e-07 
0 0 0 0 
0 0 0 0 
0 0 0 0 
0 0 0 0 
0 0 0 0 
0 0 0 0 
0 0 0 0 
0 0 0 0 
0 0 0 0 
0 0 0 0 
0 0 0 0 
0 0 0 0 
0 0 0 0 
0 0 0 0 
99.6758041381836 0.249947190284729 0.0518622882664204 0.0149558885022998 
