0 0 0 0 
0 0 0 0 
0 0 0 0 
0 0 0 0 
0 0 0 0 
0 0 0 0 
0 0 0 0 
0 0 0 0 
0 0 0 0 
0 0 0 0 
0.0022962405346334 -0.000156811089254916 1.0205638318439e-05 1.14080658022431e-05 
0.00275294855237007 -0.000179901937372051 1.06817324194708e-05 1.65553246915806e-05 
0.00320023554377258 -0.000193112704437226 1.17483104986604e-05 2.25682106247405e-05 
0.00367593253031373 -0.000200889422558248 1.26757850011927e-05 2.86472040897934e-05 
0.0043119890615344 -0.000196013133972883 1.39593685162254e-05 3.38914142048452e-05 
0.00507258623838425 -0.000177135429112241 1.54523859237088e-05 3.81528407160658e-05 
0.00587623519822955 -0.00014909278252162 1.63845597853651e-05 4.05378887080587e-05 
0.00671043246984482 -0.000117134317406453 1.63101922225906e-05 4.07247389375698e-05 
0.00751474732533097 -8.31397483125329e-05 1.57127251441125e-05 3.88051303161774e-05 
0.00808223895728588 -5.31947880517691e-05 1.4479051969829e-05 3.60590202035382e-05 
0.00841626431792974 -3.07586051349062e-05 1.26596141853952e-05 3.25862638419494e-05 
0.00857477448880672 -1.31811657411163e-05 1.11390872916672e-05 2.93527718895348e-05 
0.00854207202792168 1.00594991181424e-06 9.96340077108471e-06 2.68926341959741e-05 
0.00837087165564299 1.09325774246827e-05 9.3671487775282e-06 2.49263011937728e-05 
0.00813394784927368 1.79536727955565e-05 8.96497658686712e-06 2.3448661522707e-05 
0.0078788073733449 2.33822374866577e-05 8.74854868015973e-06 2.22999442485161e-05 
0.00763019686564803 2.78940497082658e-05 8.70190615387401e-06 2.12964059755905e-05 
0.0073993862606585 3.12151132675353e-05 8.74282250151737e-06 2.04667412617709e-05 
0.00717518664896488 3.40643091476522e-05 8.80376319400966e-06 1.97782737814123e-05 
0.00694591458886862 3.65502455679234e-05 8.79894196259556e-06 1.9332263036631e-05 
0.00670947320759296 3.85512976208702e-05 8.90779028850375e-06 1.89629281521775e-05 
0.00646974984556437 4.01037104893476e-05 8.92776915861759e-06 1.88338890438899e-05 
0.006221704185009 4.16684088122565e-05 9.14859720069217e-06 1.86959405255038e-05 
0.00599273201078176 4.35515103163198e-05 9.24543110158993e-06 1.85199605766684e-05 
0.00576313771307468 4.47365928266663e-05 9.39020719670225e-06 1.82795611181064e-05 
0.00554082402959466 4.59406765003223e-05 9.47938042372698e-06 1.80373917828547e-05 
0.00533757638186216 4.68963080493268e-05 9.68838958215201e-06 1.78310456249164e-05 
0.00519274407997727 4.82246941828635e-05 9.69722441368503e-06 1.75582790689077e-05 
0.00509322155267 4.87442302983254e-05 9.70845940173604e-06 1.72932723216945e-05 
0.00507352873682976 4.98787849210203e-05 9.75176681095036e-06 1.70546572917374e-05 
0.00513836275786161 5.14178318553604e-05 9.99164512904827e-06 1.69039121828973e-05 
0.00528155965730548 5.34618920937646e-05 1.01682389868074e-05 1.66571244335501e-05 
0.00547997234389186 5.53634999960195e-05 1.05513208836783e-05 1.64576413226314e-05 
0.00574447400867939 5.75615849811584e-05 1.10199598566396e-05 1.6392086763517e-05 
0.00607891986146569 5.98172446188983e-05 1.16286528282217e-05 1.63286986207822e-05 
0.0064717666245997 6.18880585534498e-05 1.24408761621453e-05 1.62437554536154e-05 
0.00692263105884194 6.3577237597201e-05 1.34051342683961e-05 1.62432734214235e-05 
0.00739296246320009 6.50340734864585e-05 1.45554640766932e-05 1.64348221005639e-05 
0.00786745920777321 6.62777238176204e-05 1.58198963617906e-05 1.66408444783883e-05 
0.00832769833505154 6.68769716867246e-05 1.70899347722298e-05 1.67582402355038e-05 
0.00874381698668003 6.67818021611311e-05 1.81483574124286e-05 1.67974721989594e-05 
0.00912239961326122 6.64737235638313e-05 1.91166254808195e-05 1.67976268130587e-05 
0.00947372894734144 6.64331673760898e-05 2.01314251171425e-05 1.67117996170418e-05 
0.00981297995895147 6.66903433739208e-05 2.12010399991414e-05 1.66134977916954e-05 
0.0101376157253981 6.72865207889117e-05 2.21824211621424e-05 1.6623322153464e-05 
0.0104693090543151 6.82194513501599e-05 2.30353689403273e-05 1.66231748153223e-05 
0.0108132464811206 6.93256297381595e-05 2.38227275985992e-05 1.65631590789417e-05 
0.0111751137301326 6.99522497598082e-05 2.4245644453913e-05 1.64248704095371e-05 
0.0115598356351256 7.07394428900443e-05 2.4390525140916e-05 1.61266580107622e-05 
0.011958641000092 7.13027184247039e-05 2.44784951064503e-05 1.58862549142214e-05 
0.0123919360339642 7.2059643571265e-05 2.46198615059257e-05 1.57068188855192e-05 
0.0128478240221739 7.25616337149404e-05 2.48912238021148e-05 1.55666057253256e-05 
0.0133585538715124 7.33085762476549e-05 2.52308873314178e-05 1.53632026922423e-05 
0.0139305936172605 7.32739135855809e-05 2.56481162068667e-05 1.51890189954429e-05 
0.014608240686357 7.35915746190585e-05 2.61729801422916e-05 1.49302431964315e-05 
0.0153915481641889 7.31746185920201e-05 2.66825245489599e-05 1.47939526868868e-05 
0.0163083858788013 7.23846897017211e-05 2.73701098194579e-05 1.46682868944481e-05 
0.0173153225332499 7.05049242242239e-05 2.80609438050305e-05 1.4942422239983e-05 
0.0184138510376215 6.87784922774881e-05 2.86891263385769e-05 1.53821474668803e-05 
0.0195382572710514 6.48390996502712e-05 2.92003369395388e-05 1.60819545271806e-05 
0.0206247735768557 5.99487138970289e-05 2.99621824524365e-05 1.6900043192436e-05 
0.0215737074613571 5.29917233507149e-05 2.98567902063951e-05 1.77929432538804e-05 
0.0223361160606146 4.51325140602421e-05 2.91146352537908e-05 1.8182530766353e-05 
0.0227685198187828 3.45017688232474e-05 2.830934136e-05 1.87639197974931e-05 
0.0228724032640457 2.56316307059024e-05 2.7321357265464e-05 1.90846185432747e-05 
0.0226260349154472 1.79808812390547e-05 2.58691834460478e-05 1.9355507902219e-05 
0.0221061464399099 1.50141122503555e-05 2.46770159719745e-05 1.94206004380248e-05 
0.0213467162102461 1.56112564582145e-05 2.37377007579198e-05 1.934772808454e-05 
0.0204709190875292 1.96452056115959e-05 2.28917597269174e-05 1.87637670023832e-05 
0.0195471160113811 2.48134801950073e-05 2.21354075620184e-05 1.79458875209093e-05 
0.0186919216066599 3.14870885631535e-05 2.16024818655569e-05 1.643242467253e-05 
0.0179022196680307 3.60455378540792e-05 2.13809689739719e-05 1.50967671288527e-05 
0.0172783862799406 3.97290641558357e-05 2.14938791032182e-05 1.39047579068574e-05 
0.0168228931725025 4.40818621427752e-05 2.1741561795352e-05 1.28597785078455e-05 
0.0165481772273779 4.87335673824418e-05 2.20321799133671e-05 1.19039850687841e-05 
0.0163885038346052 5.2712726755999e-05 2.24013238039333e-05 1.14587573989411e-05 
0.016354912891984 5.75655249122065e-05 2.24138439079979e-05 1.09008951767464e-05 
0.0163945928215981 6.10355637036264e-05 2.22680373553885e-05 1.03748898254707e-05 
0.0165005885064602 6.38264318695292e-05 2.21102418436203e-05 9.68813037616201e-06 
0.0166612043976784 6.57105192658491e-05 2.17726192204282e-05 8.92905882210471e-06 
0.0169478971511126 6.77710995660163e-05 2.08662168006413e-05 8.0518393588136e-06 
0.0174049586057663 7.05504135112278e-05 2.02220926439622e-05 6.83937332723872e-06 
0.0182267632335424 7.76955785113387e-05 1.98515026568202e-05 5.32182048118557e-06 
0.0197673421353102 9.06620771274902e-05 1.959600194823e-05 2.89111630991101e-06 
0.0226867850869894 0.000116762734251097 2.12196664506337e-05 -2.9910418675172e-07 
0.028072252869606 0.000161300107720308 2.62678440776654e-05 -5.44061413165764e-06 
0.0368925146758556 0.000221831011003815 3.41809209203348e-05 -1.30152639030712e-05 
0.0503162816166878 0.000292944168904796 4.67530044261366e-05 -2.28151293413248e-05 
0.0686951577663422 0.000357448763679713 5.99735576543026e-05 -3.289455344202e-05 
0.091325081884861 0.000392980873584747 7.04011836205609e-05 -4.26571277785115e-05 
0.116361297667027 0.000379225326469168 7.85375741543248e-05 -4.87033248646185e-05 
0.141458585858345 0.000317115773214027 8.12146390671842e-05 -4.93543157062959e-05 
0.163803592324257 0.000197394052520394 7.98268447397277e-05 -4.19480129494332e-05 
0.181917905807495 6.60914229229093e-05 7.39849710953422e-05 -3.1891369872028e-05 
0.195178285241127 -5.71372584090568e-05 6.74075708957389e-05 -2.23805673158495e-05 
0.203504383563995 -0.000167466030688956 5.7664296036819e-05 -1.17273402793217e-05 
0.207771882414818 -0.000258118554484099 4.90216261823662e-05 -6.07366359872685e-07 
0.20936393737793 -0.000307854876155034 3.71401802112814e-05 3.86610281566391e-06 
0.208907186985016 -0.000339578982675448 2.72877332463395e-05 5.29768067281111e-06 
0.206757724285126 -0.00036738469498232 1.78501122718444e-05 9.02910687727854e-06 
0.203571617603302 -0.000380870507797226 7.14919997335528e-06 9.20860657060985e-06 
0.199899762868881 -0.000372709706425667 -1.1361855740688e-06 2.79009395853791e-06 
0.195596158504486 -0.000369561312254518 -1.01634741440648e-05 -1.59085050199792e-06 
0.191165536642075 -0.000371106929378584 -2.02962655748706e-05 -5.38022550244932e-06 
0.18662728369236 -0.000361303158570081 -2.66844290308654e-05 -9.93675712379627e-06 
0.182255789637566 -0.000340858037816361 -3.0698054615641e-05 -1.23337276818347e-05 
0.177849039435387 -0.00032498047221452 -3.51925518771168e-05 -1.00128945632605e-05 
0.173492282629013 -0.000299505278235301 -3.68634500773624e-05 -6.24796075499034e-06 
0.16910794377327 -0.000264195201452821 -3.77655051124748e-05 -2.04472280529444e-06 
0.164584591984749 -0.000230590812861919 -4.18976378568914e-05 1.49999073073559e-06 
0.159819781780243 -0.000194393913261592 -4.27122467954177e-05 3.47873219652683e-06 
0.154834181070328 -0.000155931542394683 -4.44177167082671e-05 5.22584969075979e-06 
0.149949908256531 -0.000112999681732617 -4.73307409265544e-05 6.51793789074873e-06 
0.144640207290649 -6.88790969434194e-05 -4.57567002740689e-05 8.28573683975264e-06 
0.139439523220062 -1.95823504327564e-05 -4.37479720858391e-05 1.17298905024654e-05 
0.1343634724617 2.79403284366708e-05 -4.37350026913919e-05 1.4866473065922e-05 
0.129364386200905 8.07099204394035e-05 -4.34769026469439e-05 1.64399425557349e-05 
0.124166831374168 0.000135921378387138 -4.20463766204193e-05 1.41321816045092e-05 
0.118965178728104 0.000187857265700586 -4.39813957200386e-05 1.2017558219668e-05 
0.113600805401802 0.000240596200455911 -4.4517877540784e-05 8.62432170833927e-06 
0.107968494296074 0.000293102872092277 -4.52732419944368e-05 7.61737965149223e-06 
0.102073803544044 0.000340375932864845 -4.45007681264542e-05 8.36072831589263e-06 
0.096117876470089 0.000384765357011929 -4.36948066635523e-05 1.17005602078279e-05 
0.0901200547814369 0.000432137196185067 -4.1020022763405e-05 1.57260892592603e-05 
0.0841229036450386 0.00047561404062435 -3.85660096071661e-05 1.95314405573299e-05 
0.0781486257910728 0.000518854532856494 -3.5176366509404e-05 2.1671758076991e-05 
0.0724911242723465 0.00056705076713115 -3.2540276151849e-05 2.21162281377474e-05 
0.0670346617698669 0.000618711928837001 -2.79526957456255e-05 2.24200484808534e-05 
0.0618930272758007 0.000668247055727988 -2.40227855101693e-05 2.17745491681853e-05 
0.0570872388780117 0.000717087357770652 -2.0192923329887e-05 1.99510923266644e-05 
0.052666749805212 0.000762127921916544 -1.71856918314006e-05 1.64769644470653e-05 
0.0483543276786804 0.00079459190601483 -1.44242203532485e-05 1.26534841911052e-05 
0.0441040433943272 0.000814109924249351 -1.18331709018094e-05 7.71516988606891e-06 
0.0399935953319073 0.000819662469439209 -9.53624294197652e-06 2.19724165617663e-06 
0.0358756072819233 0.000808531825896353 -7.07400204191799e-06 -2.60940942098387e-06 
0.0318588539958 0.000781569222453982 -4.52850326837506e-06 -6.87319152348209e-06 
0.0280355252325535 0.000740842951927334 -2.0127922653046e-06 -1.08919875856373e-05 
0.0244485419243574 0.000685847247950733 -1.03414765817433e-06 -1.43962770380313e-05 
0.0210134088993073 0.000618725374806672 -6.10615586538188e-07 -1.71159445017111e-05 
0.0178222600370646 0.00054326665122062 -1.41141822496138e-06 -1.8887465557782e-05 
0.0148011026903987 0.000463153381133452 -2.24545578930702e-06 -1.95302854990587e-05 
0.0120608592405915 0.000382671365514398 -3.18055913339776e-06 -1.91730614460539e-05 
0.00963424611836672 0.000308189366478473 -4.06813569497899e-06 -1.80875704245409e-05 
0.00751031842082739 0.00023982222774066 -4.50166953669395e-06 -1.59801475092536e-05 
0.0057587344199419 0.000182332441909239 -4.33095920016058e-06 -1.37128399728681e-05 
0.0043539428152144 0.00013525495887734 -3.70422912965296e-06 -1.1222508874198e-05 
0.003218415658921 9.72881680354476e-05 -3.42963016919384e-06 -8.47025330585893e-06 
0.00235030660405755 6.84819533489645e-05 -2.68359326582868e-06 -6.09523431194248e-06 
0.00172020762693137 4.79235386592336e-05 -2.15269528780482e-06 -4.47587899543578e-06 
0.00125666591338813 3.380545967957e-05 -1.71778367530351e-06 -3.21712741424562e-06 
0.000908569258172065 2.35069364862284e-05 -1.29895954614767e-06 -2.05016817744763e-06 
0.00069915410131216 1.81154991878429e-05 -4.86059320792265e-07 -1.2381232181724e-06 
0.000582524866331369 1.55271882249508e-05 1.40154199357312e-07 2.09986254162686e-07 
0.000519262335728854 1.56529113155557e-05 1.4441304756474e-06 2.43416729972523e-06 
0.00051553372759372 1.79119524545968e-05 3.46833076037001e-06 5.63880621484714e-06 
0.00057709647808224 2.47745847445913e-05 5.98805991103291e-06 1.0044133887277e-05 
0.000682977959513664 3.44248837791383e-05 9.46398722589947e-06 1.60030795086641e-05 
0.000814794271718711 4.72006031486671e-05 1.42165708894026e-05 2.37059302889975e-05 
0.000995094887912273 6.34563111816533e-05 2.01082693820354e-05 3.33828538714442e-05 
0.00119641004130244 8.08422264526598e-05 2.63537494902266e-05 4.36045411333907e-05 
0.00142394611611962 0.000101803765574005 3.43545034411363e-05 5.7148023188347e-05 
0 0 0 0 
0 0 0 0 
0 0 0 0 
0 0 0 0 
0 0 0 0 
0 0 0 0 
0 0 0 0 
0 0 0 0 
0 0 0 0 
0 0 0 0 
0 0 0 0 
0 0 0 0 
0 0 0 0 
0 0 0 0 
99.5864639282227 0.343240141868591 0.0354101769626141 0.024490574374795 
