0 0 0 0 
0 0 0 0 
0 0 0 0 
0 0 0 0 
0 0 0 0 
0 0 0 0 
0 0 0 0 
0 0 0 0 
0 0 0 0 
0 0 0 0 
0.00160292920190841 -0.000344224768923596 -3.13516247842927e-05 -1.77380952663952e-05 
0.00198228657245636 -0.000352863455191255 -3.35562544933055e-05 -1.84593009180389e-05 
0.0023311828263104 -0.000328949186950922 -3.54038129444234e-05 -2.03546314878622e-05 
0.00287648756057024 -0.00028103549266234 -3.81181271222886e-05 -2.15578766074032e-05 
0.00369065743871033 -0.000197162939002737 -3.9501963328803e-05 -2.17544911720324e-05 
0.00458769546821713 -0.000103049475001171 -4.11517430620734e-05 -2.10905473068124e-05 
0.00558464368805289 -9.34904528548941e-06 -4.21343975176569e-05 -1.90245755220531e-05 
0.00648354180157185 6.19719066889957e-05 -4.21679142164066e-05 -1.58457678480772e-05 
0.00714131258428097 0.000101857272966299 -4.11840992455836e-05 -1.2397318641888e-05 
0.00744219683110714 0.000109144115413073 -4.09851818403695e-05 -9.254293217964e-06 
0.00741405598819256 9.34808776946738e-05 -4.07402330893092e-05 -7.26716689314344e-06 
0.00720168184489012 7.25983554730192e-05 -4.08901760238223e-05 -5.87379781791242e-06 
0.00693627959117293 6.05563436693046e-05 -4.14134628954343e-05 -4.74681155537837e-06 
0.00660835346207023 4.64587319584098e-05 -4.15111862821504e-05 -4.03278681915253e-06 
0.00625759642571211 3.43523934134282e-05 -4.10648935940117e-05 -3.33431648869009e-06 
0.00595707027241588 2.91323322016979e-05 -4.04533457185607e-05 -2.63934225586127e-06 
0.00572230713441968 2.70112650468946e-05 -3.93167792935856e-05 -2.16371154238004e-06 
0.00547230057418346 2.56851308222394e-05 -3.79500052076764e-05 -1.94539688891382e-06 
0.00522161507979035 2.35078823607182e-05 -3.61753882316407e-05 -1.87732916856476e-06 
0.00501629011705518 2.3142096324591e-05 -3.45900371030439e-05 -1.80461620402639e-06 
0.00482184905558825 2.51813071372453e-05 -3.25341861753259e-05 -1.71280191807455e-06 
0.00458419090136886 2.7083910026704e-05 -3.07565242110286e-05 -1.67064570177899e-06 
0.00432901969179511 2.63628917309688e-05 -2.91165306407493e-05 -2.03813010557496e-06 
0.00405699945986271 2.9357614039327e-05 -2.86856811726466e-05 -2.3822249204386e-06 
0.00369001715444028 3.46653541782871e-05 -2.88291339529678e-05 -3.70966495211178e-06 
0.00331563036888838 3.63273320544977e-05 -2.90040406980552e-05 -4.65741140942555e-06 
0.00308101065456867 4.04626807721797e-05 -2.80342774203746e-05 -5.17903072250192e-06 
0.00292347138747573 4.1350085666636e-05 -2.62944795395015e-05 -5.1128949962731e-06 
0.00288212345913053 4.28711355198175e-05 -2.36186751862988e-05 -5.00085297971964e-06 
0.00298686348833144 4.01020952267572e-05 -2.08102737815352e-05 -4.16510192735586e-06 
0.00318165845237672 4.29146275564563e-05 -1.78452974068932e-05 -3.68051769328304e-06 
0.00331445853225887 4.1255792893935e-05 -1.59164974320447e-05 -3.27815064338211e-06 
0.00351682188920677 4.56812012998853e-05 -1.46336196849006e-05 -3.03700335280155e-06 
0.003721893299371 4.76591158076189e-05 -1.33759385789745e-05 -2.80575227407098e-06 
0.00396852940320969 5.16845102538355e-05 -1.19456544780405e-05 -2.54331894211646e-06 
0.00424097757786512 5.03144692629576e-05 -1.11063072836259e-05 -2.56343787441438e-06 
0.00459093879908323 5.14267921971623e-05 -1.04930986708496e-05 -2.63920992438216e-06 
0.00495366007089615 5.11565849592444e-05 -9.53555900196079e-06 -2.52933000410849e-06 
0.00533446902409196 5.39328502782155e-05 -9.25951189856278e-06 -2.5667338832136e-06 
0.00567452935501933 4.83396797790192e-05 -9.17670968192397e-06 -2.86443832919758e-06 
0.0060092662461102 4.21227960032411e-05 -8.80611241882434e-06 -3.0119597340672e-06 
0.00626732595264912 3.46215674653649e-05 -8.35521768749459e-06 -2.81489656117628e-06 
0.00650740321725607 2.67342438746709e-05 -8.13524275145028e-06 -3.11190092361358e-06 
0.00674038706347346 1.46975835377816e-05 -7.30533747628215e-06 -3.2232951525657e-06 
0.00699682347476482 7.36386164135183e-06 -5.88685543334577e-06 -3.25105929732672e-06 
0.007282470818609 1.96356859305524e-06 -4.32620981882792e-06 -3.14623775921063e-06 
0.00759468972682953 -1.18867376386333e-06 -2.76529181064689e-06 -3.52909842149529e-06 
0.00792361423373222 -4.50472225566045e-06 -7.1213798946701e-07 -3.58754914486781e-06 
0.00826201308518648 -4.90752927362337e-06 1.09432505723817e-06 -3.59077580469602e-06 
0.00864738412201405 -2.15627801480878e-06 2.97119163406023e-06 -3.50850564245775e-06 
0.00904469937086105 2.80767517324421e-06 4.88093655803823e-06 -3.37573032993532e-06 
0.00946447160094976 5.63803951081354e-06 6.73077693136293e-06 -3.41737541020848e-06 
0.00991504918783903 8.80876632436411e-06 8.20336299511837e-06 -3.51180688085151e-06 
0.0104749435558915 1.56363694259198e-05 9.68023323366651e-06 -3.7781062474096e-06 
0.0111612882465124 2.33614300668705e-05 1.14510912680998e-05 -4.08465302825789e-06 
0.0119353691115975 2.78163188340841e-05 1.36024636958609e-05 -4.2729748201964e-06 
0.012881213799119 3.07584377878811e-05 1.63499680638779e-05 -4.47184493168606e-06 
0.0139781320467591 3.60125122824684e-05 1.94185922737233e-05 -4.65370885649463e-06 
0.0151184387505054 3.62754326488357e-05 2.27469117817236e-05 -4.80334165331442e-06 
0.0162895079702139 3.73441216652282e-05 2.58389864029596e-05 -4.97494147566613e-06 
0.0174682345241308 3.98215015593451e-05 2.87464226857992e-05 -5.17206581207574e-06 
0.0185479521751404 5.00079440826084e-05 3.08125672745518e-05 -5.46129058420775e-06 
0.0194104183465242 5.28290547663346e-05 3.29030372085981e-05 -5.755901838711e-06 
0.0200133342295885 5.84244044148363e-05 3.39660255121998e-05 -6.36470394965727e-06 
0.0201900992542505 6.21792860329151e-05 3.37793135258835e-05 -6.6148809310107e-06 
0.0200311057269573 6.50067231617868e-05 3.27572015521582e-05 -7.06993023413816e-06 
0.0194590240716934 5.5630207498325e-05 3.13643031404354e-05 -6.97588939146954e-06 
0.0186578817665577 5.34266109752934e-05 2.87291677523172e-05 -7.154495051509e-06 
0.0177037175744772 4.39151954196859e-05 2.67642953986069e-05 -6.504818884423e-06 
0.0167733207345009 2.93162065645447e-05 2.47673087869771e-05 -6.67814674670808e-06 
0.0158668737858534 1.55094949150225e-05 2.31655540119391e-05 -6.54760015095235e-06 
0.0151805402711034 7.4485392360657e-06 2.19218782149255e-05 -6.48185050522443e-06 
0.0146335726603866 -3.48981393472059e-06 2.10203306778567e-05 -6.28305951977381e-06 
0.0142773352563381 -9.00495524547296e-06 1.96917335415492e-05 -6.53005690764985e-06 
0.0140606723725796 -1.31329088617349e-05 1.93900505109923e-05 -6.35030710327555e-06 
0.0139903742820024 -1.84110740519827e-05 1.89072507055243e-05 -6.29914393357467e-06 
0.0140139143913984 -1.96921155293239e-05 1.84353921213187e-05 -6.43966131974594e-06 
0.0141118559986353 -2.36506730288966e-05 1.84014206752181e-05 -6.69044129608665e-06 
0.0142682828009129 -3.13013151753694e-05 1.91502858797321e-05 -6.80529001328978e-06 
0.0145253278315067 -3.85046732844785e-05 1.97566732822452e-05 -6.51382197247585e-06 
0.0148768685758114 -4.62545031041373e-05 2.0612460502889e-05 -6.75488308843342e-06 
0.0153525788336992 -5.56297673028894e-05 2.23405677388655e-05 -6.66930918669095e-06 
0.0161075443029404 -6.53728930046782e-05 2.48960332100978e-05 -6.42850591248134e-06 
0.0174514148384333 -7.20801835996099e-05 2.91283940896392e-05 -5.88136708756792e-06 
0.0199715960770845 -7.77227178332396e-05 3.66472413588781e-05 -5.79008064960362e-06 
0.0245872102677822 -9.98953546513803e-05 5.01215108670294e-05 -5.2922364375263e-06 
0.0325082205235958 -0.000146789723658003 7.01291355653666e-05 -4.94041159981862e-06 
0.0448585860431194 -0.000216967877349816 9.50656467466615e-05 -5.03895716974512e-06 
0.0621164105832577 -0.000328518741298467 0.000120517826871946 -5.22592154084123e-06 
0.0838282704353333 -0.000475220556836575 0.000142549484735355 -5.47821537111304e-06 
0.108386382460594 -0.00068202376132831 0.000154190041939728 -4.11430937674595e-06 
0.133166953921318 -0.000907517736777663 0.000149740735650994 -2.7895116545551e-06 
0.155882149934769 -0.00114411185495555 0.000133502879180014 -4.10308132359205e-07 
0.174414277076721 -0.00136390759143978 0.000109106287709437 3.70810357708251e-06 
0.187870934605598 -0.00157331174705178 7.7503289503511e-05 6.36008144283551e-06 
0.196568712592125 -0.00168343784753233 4.72753781650681e-05 6.99921611158061e-06 
0.201329693198204 -0.00176264974288642 2.144883001165e-05 7.85244901635451e-06 
0.202790826559067 -0.00182696618139744 -2.0649247289839e-06 7.72585644881474e-06 
0.202461823821068 -0.0018364314455539 -1.58128368639154e-05 8.70433814270655e-06 
0.200969040393829 -0.001797542325221 -2.32375696214149e-05 1.09339925984386e-05 
0.19808129966259 -0.0017736570443958 -3.32586132572033e-05 1.22556593851186e-05 
0.194848641753197 -0.00166911003179848 -4.06544895668048e-05 1.32185814436525e-05 
0.191398307681084 -0.00156393821816891 -4.14874230045825e-05 1.53540404426167e-05 
0.187800720334053 -0.00141491077374667 -5.01128160976805e-05 1.39483854582068e-05 
0.183970615267754 -0.0012814155779779 -5.7448422012385e-05 1.31026718008798e-05 
0.180412814021111 -0.00113412330392748 -5.87860158702824e-05 1.26060795082594e-05 
0.176578670740128 -0.00102474121376872 -5.91908683418296e-05 1.25217447930481e-05 
0.173161789774895 -0.000848556868731976 -6.00286803091876e-05 1.01294608612079e-05 
0.169237524271011 -0.0007171809556894 -5.70520387555007e-05 8.665584573464e-06 
0.165202647447586 -0.000518173270393163 -5.51107223145664e-05 5.40107066626661e-06 
0.16118648648262 -0.000278477964457124 -5.29134231328499e-05 2.24667701331782e-06 
0.156680703163147 -6.94699774612673e-05 -4.90561324113514e-05 -2.37978815675888e-06 
0.151536792516708 0.000127495150081813 -4.78790207125712e-05 -7.25619565855595e-06 
0.146678879857063 0.000356856122380123 -4.44262113887817e-05 -1.35733071147115e-05 
0.141472414135933 0.000552485580556095 -3.75440031348262e-05 -1.70880612131441e-05 
0.135942682623863 0.000723206030670553 -2.93543798761675e-05 -1.99156456801575e-05 
0.130568161606789 0.000930031877942383 -2.31549092859495e-05 -2.21659101953264e-05 
0.125357806682587 0.00118344929069281 -1.5230756616802e-05 -2.25823187065544e-05 
0.119938813149929 0.00143973506055772 -9.16064982448006e-06 -2.12327595363604e-05 
0.114456526935101 0.00169186852872372 -4.74259331895155e-06 -2.13929488381837e-05 
0.109004639089108 0.00196113460697234 -2.08249798561155e-06 -2.13629464269616e-05 
0.103643581271172 0.00224623596295714 1.83908559847623e-06 -2.08793389901984e-05 
0.0981643795967102 0.0024979580193758 5.12494716531364e-06 -2.02642822841881e-05 
0.0925875082612038 0.00273770908825099 7.52294135963893e-06 -1.99540318135405e-05 
0.0873541161417961 0.00299271591939032 8.52052744448883e-06 -1.93369651242392e-05 
0.0821923911571503 0.00323149957694113 9.91146771411877e-06 -1.84100936166942e-05 
0.0772780552506447 0.00346400216221809 1.15767497845809e-05 -1.59452629304724e-05 
0.0723847970366478 0.00367207382805645 1.22632727652672e-05 -1.27048288049991e-05 
0.0678667649626732 0.00385438068769872 1.26984941744013e-05 -9.2177169790375e-06 
0.0634742453694344 0.0039872326888144 1.40902266139165e-05 -4.3820878090628e-06 
0.0594070665538311 0.00409597251564264 1.39001003844896e-05 1.08430128875625e-06 
0.0552848950028419 0.00413768691942096 1.18511279652012e-05 4.8553752094449e-06 
0.0513838455080986 0.00413462333381176 9.6380053946632e-06 9.98163250187645e-06 
0.0472811199724674 0.00405305158346891 7.65347158449003e-06 1.54603894770844e-05 
0.0432814732193947 0.00392864691093564 4.46254080088693e-06 1.99810310732573e-05 
0.0391139350831509 0.00372678693383932 1.50135406329355e-06 2.45403170993086e-05 
0.0350184254348278 0.00346863199956715 -1.01323758272542e-08 2.9248658393044e-05 
0.0308591481298208 0.00315959169529378 -1.36068740630435e-06 3.24879292747937e-05 
0.0267356485128403 0.00281114503741264 -3.07912114294595e-06 3.29631184285972e-05 
0.0224445834755898 0.00241859327070415 -4.08516189054353e-06 3.24308421113528e-05 
0.0183492880314589 0.0020221050363034 -5.32027979716077e-06 2.98771028610645e-05 
0.0144710512831807 0.0016432044794783 -6.70349345455179e-06 2.59397984336829e-05 
0.010983519256115 0.00129673222545534 -8.94253389560618e-06 2.06553322641412e-05 
0.00801807269454002 0.00100111402571201 -1.14073836812167e-05 1.51347912833444e-05 
0.00560332182794809 0.000761043629609048 -1.49365705510718e-05 9.29708039620891e-06 
0.00368848582729697 0.000573072291444987 -1.75023924384732e-05 3.84326449420769e-06 
0.00225518830120564 0.000428278057370335 -1.93175656022504e-05 -1.77491500608085e-07 
0.00117648637387902 0.000321212544804439 -2.12801423913334e-05 -4.55274812338757e-06 
0.000427965627750382 0.000242378358962014 -2.17261967918603e-05 -7.15831174602499e-06 
1.69845134223578e-05 0.000192820429219864 -2.04930984182283e-05 -8.28831980470568e-06 
-0.000311538606183603 0.0001561849785503 -2.03599520318676e-05 -9.12165342015214e-06 
-0.000509721809066832 0.000130129701574333 -2.03850140678696e-05 -9.84199414233444e-06 
-0.000578037928789854 0.000107904772448819 -1.89125930774026e-05 -9.41787857300369e-06 
-0.000652016140520573 9.21351092983969e-05 -1.7939188182936e-05 -9.29365796764614e-06 
-0.000743192911613733 8.0130404967349e-05 -1.78299815161154e-05 -9.53045946516795e-06 
-0.000746968318708241 6.89290318405256e-05 -1.68100104929181e-05 -9.09243954083649e-06 
-0.000704890524502844 6.36752229183912e-05 -1.56684691319242e-05 -8.76645299285883e-06 
-0.000732900633011013 5.6534874602221e-05 -1.52097591126221e-05 -8.58609837450786e-06 
-0.000736606074497104 4.95348831464071e-05 -1.46826578202308e-05 -8.1263806350762e-06 
-0.000709909247234464 4.04609854740556e-05 -1.37799816002371e-05 -7.7668782978435e-06 
-0.000843378773424774 1.43677980304346e-05 -1.29658101286623e-05 -7.87051976658404e-06 
0 0 0 0 
0 0 0 0 
0 0 0 0 
0 0 0 0 
0 0 0 0 
0 0 0 0 
0 0 0 0 
0 0 0 0 
0 0 0 0 
0 0 0 0 
0 0 0 0 
0 0 0 0 
0 0 0 0 
0 0 0 0 
98.2132110595703 1.70026981830597 0.0492989905178547 0.0146711664274335 
