0 0 0 0 
0 0 0 0 
0 0 0 0 
0 0 0 0 
0 0 0 0 
0 0 0 0 
0 0 0 0 
0 0 0 0 
0 0 0 0 
0 0 0 0 
0.00140128016937524 -2.22882572415983e-05 -1.87850207566953e-06 1.29881564134848e-05 
0.00195502396672964 -3.44230138580315e-05 7.44534133900743e-07 1.74191627593245e-05 
0.00257677445188165 -4.5719036279479e-05 6.00353860136238e-06 2.18493059946923e-05 
0.00321877305395901 -5.61261731490958e-05 1.23502977658063e-05 2.61260920524364e-05 
0.00402417546138167 -6.42196828266606e-05 2.09568061109167e-05 2.96719827019842e-05 
0.00492821587249637 -6.90927045070566e-05 3.16158329951577e-05 3.23762178595643e-05 
0.00583838392049074 -6.89095759298652e-05 4.06793697038665e-05 3.35687873302959e-05 
0.006691072601825 -6.39710851828568e-05 4.68481230200268e-05 3.29727627104148e-05 
0.00747129041701555 -5.38824060640763e-05 4.94637024530675e-05 3.03156211884925e-05 
0.00800324976444244 -4.12271692766808e-05 4.84326119476464e-05 2.66137121798238e-05 
0.00829469319432974 -2.7522843083716e-05 4.35397123510484e-05 2.22964226850308e-05 
0.00841597374528646 -1.53212567965966e-05 3.86809115298092e-05 1.80507595359813e-05 
0.00839220266789198 -5.84902772970963e-06 3.47297864209395e-05 1.46983729791827e-05 
0.00823197327554226 5.82404936722014e-07 3.18343518301845e-05 1.23864010674879e-05 
0.00799703504890203 4.64864751847927e-06 2.98510531138163e-05 1.089150646294e-05 
0.00773365423083305 7.30534975446062e-06 2.87026050500572e-05 9.77902072918369e-06 
0.00747186923399568 9.48127217270667e-06 2.77524013654329e-05 9.03629097592784e-06 
0.0072197075933218 1.07587393358699e-05 2.73126024694648e-05 8.45527847559424e-06 
0.00697549944743514 1.20455224532634e-05 2.68854855676182e-05 8.04659248387907e-06 
0.00673474511131644 1.32581744765048e-05 2.66045353782829e-05 7.6701762736775e-06 
0.00649032695218921 1.44697096402524e-05 2.63873280346161e-05 7.3460437306494e-06 
0.00624004751443863 1.5228081792884e-05 2.64794962276937e-05 7.08735160515062e-06 
0.00599838234484196 1.65109322551871e-05 2.64358004642418e-05 6.86214843881316e-06 
0.00577844167128205 1.75359746208414e-05 2.65331127593527e-05 6.5508606894582e-06 
0.00555061129853129 1.87298392120283e-05 2.64289174083387e-05 6.31011425866745e-06 
0.00531720323488116 1.98290599655593e-05 2.62684443441685e-05 6.04421074967831e-06 
0.0051100212149322 2.07865923584905e-05 2.60977321886458e-05 5.80569485464366e-06 
0.0049488227814436 2.16354565054644e-05 2.57455903920345e-05 5.49556443729671e-06 
0.00482905935496092 2.23755050683394e-05 2.53118214459391e-05 5.30070428794716e-06 
0.00479154381901026 2.32049387705047e-05 2.49205404543318e-05 5.13472286911565e-06 
0.00484208157286048 2.40222088905284e-05 2.47235439019278e-05 5.0897110668302e-06 
0.0049637146294117 2.53056459769141e-05 2.43118756770855e-05 5.03648652738775e-06 
0.00513684190809727 2.67025225184625e-05 2.39925575442612e-05 5.17082753503928e-06 
0.00537294335663319 2.86132271867245e-05 2.36038431467023e-05 5.36143352292129e-06 
0.00567584112286568 3.0689436243847e-05 2.32342044910183e-05 5.58984265808249e-06 
0.0060430015437305 3.32283198076766e-05 2.26535794354277e-05 5.97200869378867e-06 
0.00645412737503648 3.61812781193294e-05 2.21092923311517e-05 6.46911712465226e-06 
0.00689155049622059 3.93980117223691e-05 2.15852287510643e-05 7.17166722097318e-06 
0.00732932612299919 4.21780168835539e-05 2.1299478248693e-05 7.90109879744705e-06 
0.00774520635604858 4.50262123194989e-05 2.07614193641348e-05 8.68532970343949e-06 
0.00812147371470928 4.73681138828397e-05 2.01588263735175e-05 9.4147026175051e-06 
0.00846712104976177 4.93209226988256e-05 1.95447100850288e-05 1.0013503015216e-05 
0.00878156255930662 5.1015227654716e-05 1.89828242582735e-05 1.05686640381464e-05 
0.00908472761511803 5.26110816281289e-05 1.8440347048454e-05 1.1169901881658e-05 
0.00938459485769272 5.38631611561868e-05 1.81415125553031e-05 1.18016378110042e-05 
0.0096966652199626 5.50095355720259e-05 1.79973594640614e-05 1.23450308819884e-05 
0.0100251650437713 5.57399434910621e-05 1.78216232598061e-05 1.30479465951794e-05 
0.0103795081377029 5.60282423975877e-05 1.749852890498e-05 1.36032203954528e-05 
0.010764260776341 5.61254018975887e-05 1.69422219187254e-05 1.40530200951616e-05 
0.0111688831821084 5.58617502974812e-05 1.65303172252607e-05 1.44236037158407e-05 
0.0116060385480523 5.54858488612808e-05 1.61550451593939e-05 1.48424132930813e-05 
0.0120670888572931 5.5207907280419e-05 1.58687707880745e-05 1.52972825162578e-05 
0.0125800268724561 5.49531250726432e-05 1.56757996592205e-05 1.56184851221042e-05 
0.0131486002355814 5.47157724213321e-05 1.55457455548458e-05 1.60097824846162e-05 
0.0138098737224936 5.4637850553263e-05 1.54414192365948e-05 1.6409512682003e-05 
0.014582515694201 5.4293417633744e-05 1.55574634845834e-05 1.67426369444001e-05 
0.0154801225289702 5.37740961590316e-05 1.56698042701464e-05 1.72281488630688e-05 
0.0164771694689989 5.28337659488898e-05 1.60444451466901e-05 1.7951579138753e-05 
0.017564358189702 5.20564753969666e-05 1.64119683176978e-05 1.85673907253658e-05 
0.01869186013937 5.02200091432314e-05 1.6949396012933e-05 1.93340292753419e-05 
0.0197748076170683 4.82503492094111e-05 1.7336204109597e-05 2.04401567316381e-05 
0.0207429174333811 4.46885023848154e-05 1.77964066097047e-05 2.11901115108049e-05 
0.0215229652822018 4.01376273657661e-05 1.7797588952817e-05 2.14822521229507e-05 
0.0220064520835876 3.41495688189752e-05 1.79513099283213e-05 2.19325938815018e-05 
0.0221512895077467 2.90080224658595e-05 1.79331855179043e-05 2.21084483200684e-05 
0.0219396129250526 2.43783670157427e-05 1.81872819666751e-05 2.18947716348339e-05 
0.0214265454560518 2.1892459699302e-05 1.8399292457616e-05 2.13084003917174e-05 
0.0206347163766623 2.1534400730161e-05 1.83982356247725e-05 2.06626973522361e-05 
0.019705381244421 2.31724152399693e-05 1.7654254406807e-05 1.95960874407319e-05 
0.0187216382473707 2.54489696089877e-05 1.65715373441344e-05 1.83973243110813e-05 
0.0177977774292231 2.88783012365457e-05 1.46410211527837e-05 1.69605009432416e-05 
0.0169511307030916 3.21122097375337e-05 1.29839690998779e-05 1.59744140546536e-05 
0.0162946507334709 3.51721828337759e-05 1.17472800411633e-05 1.53079690790037e-05 
0.015792440623045 3.83482256438583e-05 1.1185677976755e-05 1.48061226354912e-05 
0.015458308160305 4.14002643083222e-05 1.08865679067094e-05 1.44079849633272e-05 
0.0152531145140529 4.38579590991139e-05 1.09762704596506e-05 1.4175630894897e-05 
0.0151707194745541 4.6140998165356e-05 1.08538069980568e-05 1.3593829862657e-05 
0.0151706039905548 4.79030750284437e-05 1.02928861451801e-05 1.28542378661223e-05 
0.0152440890669823 4.89553822262678e-05 9.3432945504901e-06 1.22657775136759e-05 
0.0153870796784759 5.00548230775166e-05 8.21268804429565e-06 1.14528957055882e-05 
0.0156494174152613 5.10581739945337e-05 7.17827879270772e-06 1.04271593954763e-05 
0.0160814430564642 5.27150259586051e-05 5.82898474021931e-06 9.41526195674669e-06 
0.0168355256319046 5.68597752135247e-05 4.70574332211982e-06 7.99376357463188e-06 
0.018247090280056 6.50870351819322e-05 2.7490909815242e-06 5.70212023376371e-06 
0.0209242515265942 8.28454867587425e-05 5.70558711388003e-07 2.46195372710645e-06 
0.0258716307580471 0.000115634604298975 -3.33441880684404e-06 -1.56328087541624e-06 
0.0340448915958405 0.000162729149451479 -1.0038174877991e-05 -6.58489807392471e-06 
0.0466127097606659 0.000224607938434929 -1.93167070392519e-05 -1.14845215648529e-05 
0.0640131309628487 0.000288335169898346 -3.03516862913966e-05 -1.62322612595744e-05 
0.0857262164354324 0.00034026411594823 -4.42864402430132e-05 -1.97991448658286e-05 
0.110093921422958 0.000365849089575931 -5.7182609452866e-05 -1.81700779648963e-05 
0.134822815656662 0.000361113052349538 -6.57774144201539e-05 -1.3539225619752e-05 
0.157298132777214 0.000319043960189447 -6.6705651988741e-05 -2.66784491032013e-06 
0.17578062415123 0.000262685323832557 -6.28890848020092e-05 7.47979493098683e-06 
0.189429059624672 0.00020194670651108 -5.86735768592916e-05 1.82334570126841e-05 
0.198239207267761 0.000140358082717285 -5.06725809827913e-05 2.56780949712265e-05 
0.203050002455711 8.56718106660992e-05 -4.01383222197182e-05 3.11881121888291e-05 
0.204961866140366 4.51710911875125e-05 -3.46577580785379e-05 2.91375235974556e-05 
0.204691141843796 1.41578811962972e-05 -3.36601297021843e-05 2.73604946414707e-05 
0.202910825610161 -1.65412184287561e-05 -2.91524411295541e-05 2.4530578230042e-05 
0.200064778327942 -4.027814429719e-05 -2.84337274933932e-05 1.85110275197076e-05 
0.196584030985832 -4.84666888951324e-05 -3.60168050974607e-05 1.19233527584583e-05 
0.192577481269836 -5.88124457863159e-05 -4.13296256738249e-05 5.15686178914621e-06 
0.188637211918831 -7.27738151908852e-05 -4.52323984063696e-05 -2.35308107221499e-06 
0.184503883123398 -7.67385790823027e-05 -4.92790422867984e-05 -7.95793948782375e-06 
0.180530279874802 -7.69012185628526e-05 -5.06359210703522e-05 -1.19261176223517e-05 
0.17660865187645 -8.45129252411425e-05 -4.53104403277393e-05 -1.44241503221565e-05 
0.172761768102646 -8.6658270447515e-05 -3.94918279198464e-05 -1.34848787638475e-05 
0.168858781456947 -8.6151558207348e-05 -3.20753206324298e-05 -1.21845141620724e-05 
0.164885491132736 -9.25231652217917e-05 -2.29658980970271e-05 -1.2946235074196e-05 
0.160639151930809 -9.736653737491e-05 -1.5945968698361e-05 -1.06731067717192e-05 
0.156246528029442 -0.000103917591331992 -8.53948313306319e-06 -9.31917475099908e-06 
0.151960209012032 -0.000112878515210468 -2.56191242442583e-07 -9.36879587243311e-06 
0.147252812981606 -0.000117251009214669 8.3758459368255e-06 -6.64214758216986e-06 
0.142661303281784 -0.000119936798000708 1.78648879227694e-05 -2.94060032501875e-06 
0.138242930173874 -0.000123739388072863 2.85401729342993e-05 -1.62279627602402e-06 
0.13386744260788 -0.000123991252621636 3.68788896594197e-05 -6.25055122327467e-07 
0.129282623529434 -0.000119453929073643 3.94950002373662e-05 -9.5731388682907e-07 
0.12471841275692 -0.000121102457342204 4.19147145294119e-05 -3.24244547300623e-06 
0.119960121810436 -0.000119283242383972 4.220142000122e-05 -5.73014676774619e-06 
0.114987440407276 -0.000119985044875648 4.52997228421737e-05 -7.9859728430165e-06 
0.109827734529972 -0.000121276374557056 4.99467023473699e-05 -8.53241454024101e-06 
0.104611061513424 -0.000125289050629362 5.94608463870827e-05 -7.94891184341395e-06 
0.0993905737996101 -0.000125609323731624 7.00079908710904e-05 -6.45460249870666e-06 
0.0941956713795662 -0.000128041632706299 8.06312673375942e-05 -5.32836384081747e-06 
0.0889620184898376 -0.000127692037494853 8.86696725501679e-05 -4.55708186564152e-06 
0.0838687345385551 -0.000124281374155544 9.60345496423542e-05 -5.77286573388847e-06 
0.0788848623633385 -0.000114359012513887 0.000102116682683118 -7.17002694727853e-06 
0.0740234777331352 -0.000101351950434037 0.000107504602055997 -1.01912728496245e-05 
0.0692952871322632 -8.23870723252185e-05 0.000112001835077535 -1.47066830322728e-05 
0.0646923258900642 -5.62771019758657e-05 0.000114649345050566 -2.03688359761145e-05 
0.0600227452814579 -2.7439742552815e-05 0.000116078372229822 -2.64124537352473e-05 
0.0551460422575474 4.03147259930847e-06 0.00011669556988636 -3.25410546793137e-05 
0.0502282083034515 3.43434439855628e-05 0.000116999675810803 -3.82961698051076e-05 
0.0452261716127396 6.31609800620936e-05 0.000115718568849843 -4.26007027272135e-05 
0.0402474962174892 8.74698816915043e-05 0.000113227230031043 -4.59931434306782e-05 
0.0354097373783588 0.000106326762761455 0.000108563872345258 -4.80037670058664e-05 
0.0308582950383425 0.000118020230729599 0.000100803379609715 -4.9049143854063e-05 
0.0265158154070377 0.000124271071399562 8.9785666204989e-05 -4.87363286083564e-05 
0.0224301032721996 0.000122817276860587 7.76673914515413e-05 -4.71031999040861e-05 
0.0186252612620592 0.000116723553219344 6.43689636490308e-05 -4.41631564171985e-05 
0.0152023481205106 0.000106299783510622 5.10455283802003e-05 -4.02850891987327e-05 
0.0121540846303105 9.38502780627459e-05 3.8476922782138e-05 -3.58278120984323e-05 
0.00953091960400343 7.98736582510173e-05 2.73044151981594e-05 -3.08006165141705e-05 
0.00735959783196449 6.62150850985199e-05 1.81131254066713e-05 -2.5988489142037e-05 
0.00561330514028668 5.24372117070016e-05 1.14133417810081e-05 -2.11974111152813e-05 
0.00423087924718857 4.00563803850673e-05 6.87807323629386e-06 -1.71063620655332e-05 
0.00318071013316512 2.94748242595233e-05 3.87455384043278e-06 -1.36339813252562e-05 
0.00239147897809744 2.12139802897582e-05 2.00843896891456e-06 -1.08159929368412e-05 
0.00180632842238992 1.55789930431638e-05 1.12993404854933e-06 -8.48588933877181e-06 
0.00138115894515067 1.24217267511995e-05 1.69060888310923e-06 -6.43000066702371e-06 
0.00109582243021578 1.20825916383183e-05 4.05275523007731e-06 -4.29906640420086e-06 
0.000933315488509834 1.47436021507019e-05 9.40099471335998e-06 -2.03945023713459e-06 
0.000863690511323512 2.06062904908322e-05 1.8740745872492e-05 9.36675405682763e-07 
0.000900056271348149 3.05424837279133e-05 3.27917114191223e-05 4.73600903205806e-06 
0.00103118270635605 4.51935302407946e-05 5.25317482242826e-05 9.55180530581856e-06 
0.00125036959070712 6.51349910185672e-05 7.88134930189699e-05 1.57349459186662e-05 
0.00154476275201887 9.06382701941766e-05 0.000112753019493539 2.36090090766083e-05 
0.00193972734268755 0.000122696947073564 0.000155072601046413 3.3193631679751e-05 
0.00235871039330959 0.000156712354510091 0.00019987826817669 4.33769746450707e-05 
0.00290486053563654 0.000199998408788815 0.000257580686593428 5.63181383768097e-05 
0 0 0 0 
0 0 0 0 
0 0 0 0 
0 0 0 0 
0 0 0 0 
0 0 0 0 
0 0 0 0 
0 0 0 0 
0 0 0 0 
0 0 0 0 
0 0 0 0 
0 0 0 0 
0 0 0 0 
0 0 0 0 
99.7697830200195 0.122097209095955 0.0668240860104561 0.0245927274227142 
