0 0 0 0 
0 0 0 0 
0 0 0 0 
0 0 0 0 
0 0 0 0 
0 0 0 0 
0 0 0 0 
0 0 0 0 
0 0 0 0 
0 0 0 0 
0.000701777229551226 -6.01177998760249e-05 1.90708469745005e-05 -4.89034255224396e-06 
0.000802635971922427 -5.66613598493859e-05 1.83598513103789e-05 -5.0564904086059e-06 
0.000889716786332428 -4.6768876927672e-05 1.91582803381607e-05 -5.65880554859177e-06 
0.000981800258159637 -2.92551503662253e-05 2.0271232642699e-05 -6.24562380835414e-06 
0.00117964611854404 -4.53534403277445e-06 2.13351886486635e-05 -6.56920246910886e-06 
0.00149885297287256 2.30543409998063e-05 2.1274425307638e-05 -6.47075421511545e-06 
0.00182648131158203 4.69638289359864e-05 2.04225689230952e-05 -5.86151372772292e-06 
0.00214756629429758 6.26468099653721e-05 1.84760392585304e-05 -5.16311956744175e-06 
0.00239883014000952 6.82076934026554e-05 1.57201393449213e-05 -4.19137586504803e-06 
0.00247817183844745 6.38963829260319e-05 1.31190054162289e-05 -3.48948560713325e-06 
0.00237964442931116 5.5478529247921e-05 1.15585289677256e-05 -2.88911746793019e-06 
0.00221715960651636 4.96538195875473e-05 1.05204799183412e-05 -2.69409133579757e-06 
0.00204441277310252 4.48891187261324e-05 9.88455576589331e-06 -2.44334842136595e-06 
0.00191754195839167 4.09331441915128e-05 9.43825671129161e-06 -2.24011841964966e-06 
0.00184793164953589 3.79296907340176e-05 9.06484910956351e-06 -2.1131841094757e-06 
0.00186870933976024 3.63665494660381e-05 8.73003045853693e-06 -1.96819223674538e-06 
0.00196952815167606 3.51891067111865e-05 8.50872129376512e-06 -1.97003032553766e-06 
0.00211430271156132 3.37142992066219e-05 8.15378643892473e-06 -1.94011954590678e-06 
0.00230186805129051 3.27670604747254e-05 7.89200294093462e-06 -1.9047060959565e-06 
0.00251179467886686 3.30360271618702e-05 7.43099462852115e-06 -1.86484771802498e-06 
0.00267509906552732 3.19561186188366e-05 7.19371792001766e-06 -1.93705204765138e-06 
0.00277226255275309 3.09530696540605e-05 6.89393664288218e-06 -1.75719037542876e-06 
0.00280477269552648 3.00865995086497e-05 7.0012142714404e-06 -1.78391815097712e-06 
0.00273446226492524 3.13788550556637e-05 7.65657750889659e-06 -1.89186653187789e-06 
0.00257847388274968 3.33523603330832e-05 8.81955202203244e-06 -2.13095313483791e-06 
0.00245422986336052 3.63892504537944e-05 9.60909437708324e-06 -2.16499392990954e-06 
0.00242261774837971 3.69349945685826e-05 9.89715044852346e-06 -2.25341727855266e-06 
0.0025404910556972 3.73452166968491e-05 9.41920370678417e-06 -2.21043774217833e-06 
0.00287861633114517 3.56140408257488e-05 8.20804143586429e-06 -2.07772791327443e-06 
0.00351165910251439 3.29813919961452e-05 6.52194967187825e-06 -1.96059318113839e-06 
0.00448165461421013 2.97504284390016e-05 4.95822450830019e-06 -2.08051710615109e-06 
0.00595739157870412 2.87781513179652e-05 3.66184872291342e-06 -2.37469498642895e-06 
0.00815983302891254 2.89929375867359e-05 2.73748582912958e-06 -2.75076649813855e-06 
0.0113416463136673 3.02612261293689e-05 1.81057544068608e-06 -3.29633235196525e-06 
0.0157556273043156 2.86419090116397e-05 3.5978612800136e-07 -4.12663575843908e-06 
0.0215999446809292 2.65598609985318e-05 -1.39410212796065e-06 -5.01795602758648e-06 
0.0288617089390755 2.4765708076302e-05 -3.63508070222451e-06 -5.99285658609006e-06 
0.0372743494808674 2.13283492485061e-05 -6.17760042587179e-06 -6.67921267449856e-06 
0.0465231724083424 1.54200515680714e-05 -8.73885164764943e-06 -7.28024633644964e-06 
0.0561794340610504 8.20372042653617e-06 -1.22983556138934e-05 -6.94888103680569e-06 
0.065556176006794 -9.71231293078745e-06 -1.4366796676768e-05 -6.56358497508336e-06 
0.0742765739560127 -3.3636562875472e-05 -1.55295529111754e-05 -5.51556013306254e-06 
0.0822092965245247 -5.50609584024642e-05 -1.62640317284968e-05 -5.23224343851325e-06 
0.0892561972141266 -8.74473626026884e-05 -1.61070311150979e-05 -4.88918840346741e-06 
0.0952120646834373 -0.000119801676191855 -1.37162187456852e-05 -5.4725769587094e-06 
0.100287362933159 -0.000141820783028379 -1.30148810058017e-05 -6.36067852610722e-06 
0.104637213051319 -0.000156399983097799 -1.21169032354373e-05 -6.81178744343924e-06 
0.108364924788475 -0.00016503783990629 -1.08601843749057e-05 -6.98768280926743e-06 
0.111434891819954 -0.000159966133651324 -1.08872418422834e-05 -7.08735024090856e-06 
0.114189304411411 -0.000146809325087816 -1.20706299640005e-05 -6.24794029135955e-06 
0.116590388119221 -0.000131510401843116 -1.33039147840464e-05 -5.11754706167267e-06 
0.118670113384724 -0.00011182005982846 -1.42033504744177e-05 -4.87619217892643e-06 
0.120341822504997 -0.00010226738959318 -1.54098052007612e-05 -4.07838933824678e-06 
0.121824845671654 -8.53293531690724e-05 -1.6124313333421e-05 -3.04710715681722e-06 
0.122965157032013 -7.11503453203477e-05 -1.61243679031031e-05 -3.28432383867039e-06 
0.123910486698151 -6.10789284110069e-05 -1.60686449817149e-05 -3.05628668684221e-06 
0.12464564293623 -5.95070196141023e-05 -1.66438094311161e-05 -1.88812475698796e-06 
0.125195652246475 -5.7874814956449e-05 -1.70171133504482e-05 -9.64887703958084e-07 
0.125612735748291 -5.71927230339497e-05 -1.65226083481684e-05 -8.67014591676707e-07 
0.126059472560883 -5.34192004124634e-05 -1.64819084602641e-05 2.34460031833805e-07 
0.126484170556068 -5.89529299759306e-05 -1.68926999322139e-05 1.58168984398799e-06 
0.12699256837368 -5.33626807737164e-05 -1.59669507411309e-05 1.89483660051337e-06 
0.127596035599709 -5.85243287787307e-05 -1.63052973221056e-05 2.66798792836198e-06 
0.128179624676704 -6.54481482342817e-05 -1.65438686963171e-05 3.04477862300701e-06 
0.12863202393055 -7.57484740461223e-05 -1.5988853192539e-05 3.93083837479935e-06 
0.129028022289276 -7.80040791141801e-05 -1.34748352138558e-05 3.66350036529184e-06 
0.129238113760948 -9.79056130745448e-05 -1.26619088405278e-05 4.64194863525336e-06 
0.12934572994709 -9.96663293335587e-05 -1.01696232377435e-05 5.2667646741611e-06 
0.129137918353081 -0.000127832478028722 -8.0752333815326e-06 5.83565724809887e-06 
0.128943905234337 -0.000156948779476807 -6.04791466685128e-06 4.58571730632684e-06 
0.128605678677559 -0.00018458254635334 -5.34818309461116e-06 4.64795994048472e-06 
0.12833109498024 -0.000201600618311204 -3.8894895624253e-06 3.79320727006416e-06 
0.127960667014122 -0.000226411473704502 -2.37310155171144e-06 1.71959572980995e-06 
0.127868190407753 -0.000219680325244553 -2.05007199838292e-06 5.16952525231318e-07 
0.127564653754234 -0.000222863454837352 -1.69400277627574e-06 7.57088741920597e-07 
0.127345561981201 -0.000215268155443482 -1.1442771210568e-06 9.40919676395424e-07 
0.126898139715195 -0.000202866009203717 1.1304356206665e-07 5.64120171020477e-07 
0.126383513212204 -0.000191147264558822 3.23226828413681e-07 1.34454057842959e-06 
0.125605151057243 -0.00019706781313289 1.92465199688741e-06 1.89722368304501e-06 
0.124760389328003 -0.000200669193873182 2.90120601675881e-06 2.36781397688901e-06 
0.123794667422771 -0.000204367330297828 4.71742896479554e-06 2.28056433115853e-06 
0.122806243598461 -0.000221189999138005 4.67259951619781e-06 2.25861140279449e-06 
0.121639482676983 -0.000228735429118387 6.30674230706063e-06 1.87512296179193e-06 
0.120411314070225 -0.000232413454796188 6.90928072799579e-06 1.70939722465846e-06 
0.11915211379528 -0.000221834998228587 9.03157160792034e-06 1.63154584242875e-06 
0.117927566170692 -0.000219901325181127 1.02232306744554e-05 1.34646643346059e-06 
0.116736218333244 -0.000210914644412696 1.07934847619617e-05 2.05757555704622e-06 
0.115872234106064 -0.000194174732314423 1.14783970275312e-05 2.84750967693981e-06 
0.115133963525295 -0.000179880444193259 1.2615369996638e-05 3.78586673832615e-06 
0.114625237882137 -0.000160915165906772 1.16681103463634e-05 4.33496188634308e-06 
0.114108897745609 -0.000148341656313278 1.14171916720807e-05 5.11542884851224e-06 
0.113578729331493 -0.000132252636831254 1.26676695799688e-05 5.77797300138627e-06 
0.113005332648754 -0.000129075735458173 1.26932163766469e-05 6.22877769274055e-06 
0.112187936902046 -0.000124430458527058 1.30333473862265e-05 7.01591534379986e-06 
0.111056983470917 -0.000128657266031951 1.46043821587227e-05 6.59824445392587e-06 
0.1096051633358 -0.000121908065921161 1.52906195580726e-05 5.19337800142239e-06 
0.107880391180515 -0.000119122443720698 1.74706565303495e-05 4.12049257647595e-06 
0.105683416128159 -0.000125551945529878 1.94201693375362e-05 2.73547016149678e-06 
0.103497177362442 -0.000121714729175437 1.88594804058084e-05 8.97035249636247e-07 
0.101304285228252 -0.000116353272460401 1.74246997630689e-05 1.86207088859192e-07 
0.0990912243723869 -0.000112122361315414 1.76187550096074e-05 1.58707834430061e-07 
0.096980981528759 -9.27479559322819e-05 1.63401837198762e-05 -1.05290644114575e-06 
0.0950758457183838 -6.76561176078394e-05 1.47745295180357e-05 -8.66078721628583e-07 
0.0932412520051003 -3.12055126414634e-05 1.58903476403793e-05 -8.55601854254928e-07 
0.091410867869854 4.79125446872786e-07 1.71648043760797e-05 -4.62559825109565e-07 
0.0897266939282417 3.85729399567936e-05 1.75924014911288e-05 2.91373112304427e-07 
0.0880072936415672 7.09926171111874e-05 1.75260174728464e-05 1.07189964637655e-06 
0.0864035859704018 0.000117391216917895 1.78888039954472e-05 8.61496744164469e-07 
0.0845775827765465 0.00015222403453663 1.74510732904309e-05 1.41022758270992e-06 
0.0826121121644974 0.000201797709451057 1.77722504304256e-05 1.48476078720705e-06 
0.0805630311369896 0.000260025728493929 1.77195470314473e-05 8.67119979375275e-07 
0.0781882479786873 0.000305126013699919 1.79675371327903e-05 -3.83019710170629e-07 
0.0754745602607727 0.00034595764009282 1.77982601599069e-05 -1.60980346208817e-06 
0.0728557556867599 0.000395995972212404 1.74668675754219e-05 -3.70455791198765e-06 
0.0700459852814674 0.000439127383287996 1.69140093930764e-05 -4.80937933389214e-06 
0.0671038255095482 0.000472328480100259 1.52591292135185e-05 -6.08619893682771e-06 
0.0642924904823303 0.00051774166058749 1.42729168146616e-05 -6.34893012829707e-06 
0.0615116022527218 0.000573246041312814 1.26165969049907e-05 -6.78252217767294e-06 
0.0586139783263206 0.000625652028247714 1.06805755422101e-05 -7.05963202562998e-06 
0.0557847879827023 0.000680326367728412 7.77470722823637e-06 -7.76838351157494e-06 
0.0529362447559834 0.000738865986932069 6.17857449469739e-06 -7.986642231117e-06 
0.0500934645533562 0.000802911352366209 3.95822053178563e-06 -8.34870479593519e-06 
0.0472742319107056 0.00086097652092576 2.24725113184832e-06 -8.87300120666623e-06 
0.0444294437766075 0.000918380857910961 8.03544025984593e-07 -8.22866059024818e-06 
0.0417605303227901 0.000979820033535361 -3.24659140460426e-07 -8.18016451376025e-06 
0.0391770340502262 0.00103959394618869 -1.63634410910163e-06 -8.16090960142901e-06 
0.0367226898670197 0.00109299947507679 -3.68197083844279e-06 -7.78058802097803e-06 
0.0343587137758732 0.00114401464816183 -5.58643432668759e-06 -6.26936162007041e-06 
0.0322161354124546 0.00118792825378478 -7.40197629056638e-06 -5.42981342732674e-06 
0.030109191313386 0.00121685676276684 -8.82367567101028e-06 -3.93919935959275e-06 
0.0281479936093092 0.00123954331502318 -1.01989762697485e-05 -1.9484257336444e-06 
0.0262166857719421 0.00124641403090209 -1.07973764897906e-05 -6.67275628529751e-07 
0.0243656132370234 0.00123903702478856 -1.11955287138699e-05 7.1749155949874e-07 
0.0224544610828161 0.00121485686395317 -1.06376774056116e-05 3.1237125313055e-06 
0.0206238571554422 0.00118058547377586 -9.79006381385261e-06 5.33378442924004e-06 
0.0187415089458227 0.00112558039836586 -8.61215812619776e-06 7.84057010605466e-06 
0.0168780144304037 0.00105956010520458 -7.14386851541349e-06 1.11659210233483e-05 
0.0149297760799527 0.000976123614236712 -4.91098580823746e-06 1.43456545629306e-05 
0.0130017409101129 0.000880852283444256 -2.616174697323e-06 1.60149866132997e-05 
0.0109484111890197 0.000771283404901624 -6.53287060004004e-08 1.69850427482743e-05 
0.00897000078111887 0.000660474703181535 2.58771933658863e-06 1.74192846316146e-05 
0.00706578372046351 0.000548323674593121 5.13330815010704e-06 1.65683522936888e-05 
0.00535658188164234 0.000444680015789345 7.4525901254674e-06 1.45090825753869e-05 
0.0038340212777257 0.000354010553564876 9.3014341473463e-06 1.21028961075353e-05 
0.00259803957305849 0.000280396634479985 1.09132524812594e-05 9.72438647295348e-06 
0.00156377209350467 0.000219094203202985 1.24032330859336e-05 6.7900928115705e-06 
0.000802519090939313 0.000173801425262354 1.37329307108303e-05 4.29196643381147e-06 
0.000199816684471443 0.0001392397825839 1.46152324305149e-05 2.38832217291929e-06 
-0.000219046167330816 0.000114431248221081 1.54303834278835e-05 8.41444318666618e-07 
-0.000508346653077751 9.61568221100606e-05 1.56475362018682e-05 -2.59274116842789e-07 
-0.000660863996017724 8.34016100270674e-05 1.53623241203604e-05 -1.04112075405283e-06 
-0.000763463205657899 7.37093432690017e-05 1.48038734550937e-05 -1.39808048515988e-06 
-0.000793186947703362 6.74107650411315e-05 1.42041108119884e-05 -1.59858882398112e-06 
-0.000815208652056754 6.06446374149527e-05 1.32234190459712e-05 -1.6294167153319e-06 
-0.000791096244938672 5.54012185602915e-05 1.24622174553224e-05 -1.71353315181477e-06 
-0.000798195367679 5.00489295518491e-05 1.18985090011847e-05 -1.59937519583764e-06 
-0.000783362658694386 4.59003204014152e-05 1.14014601422241e-05 -1.60707054419618e-06 
-0.000778606277890503 4.23131205025129e-05 1.08886706584599e-05 -1.53454413975851e-06 
-0.000744837045203894 3.99848649976775e-05 1.05173603515141e-05 -1.59903822805063e-06 
-0.000721185584552586 3.85221574106254e-05 1.00885536085116e-05 -1.61171169565932e-06 
-0.000692945497576147 3.60389421985019e-05 9.67201049206778e-06 -1.89912282166915e-06 
0 0 0 0 
0 0 0 0 
0 0 0 0 
0 0 0 0 
0 0 0 0 
0 0 0 0 
0 0 0 0 
0 0 0 0 
0 0 0 0 
0 0 0 0 
0 0 0 0 
0 0 0 0 
0 0 0 0 
0 0 0 0 
99.4452438354492 0.524354219436646 0.0155463684350252 0.0067707933485508 
