0 0 0 0 
0 0 0 0 
0 0 0 0 
0 0 0 0 
0 0 0 0 
0 0 0 0 
0 0 0 0 
0 0 0 0 
0 0 0 0 
0 0 0 0 
0.0112658338621259 0.000783176685217768 -4.77020694233943e-05 1.70258681464475e-05 
0.0147701064124703 0.000904939195606858 -5.30676479684189e-05 1.54021818161709e-05 
0.0200489200651646 0.000949391862377524 -3.10175673803315e-05 9.87436033028644e-06 
0.0275386068969965 0.000940034980885684 1.08224548966973e-05 3.83042561225011e-06 
0.0394797064363956 0.00081508414587006 8.68574425112456e-05 -2.58916634265915e-06 
0.0538607873022556 0.000624962267465889 0.00017670588567853 -6.21534127276391e-06 
0.0686305686831474 0.000413146248320118 0.000260967557551339 -7.98086512077134e-06 
0.0827414840459824 0.000219658482819796 0.000332949683070183 -7.70852420828305e-06 
0.0946048051118851 8.07737960712984e-05 0.000372284062905237 -5.0030653255817e-06 
0.102301888167858 3.4061220503645e-05 0.000373614311683923 -1.45774674820132e-06 
0.10765577852726 3.05723478959408e-05 0.000353761861333624 4.5184251007413e-08 
0.11248803883791 3.82221442123409e-05 0.000324653956340626 6.38985568457429e-07 
0.116959519684315 3.8638012483716e-05 0.000288690556772053 5.59615557449433e-07 
0.121087186038494 3.59131190634798e-05 0.000248791795456782 1.40619448529833e-07 
0.125210791826248 2.61934437730815e-05 0.000207862482056953 -1.46812317325384e-06 
0.129132583737373 2.16087628359674e-05 0.000168615311849862 -3.15119973492983e-06 
0.133096694946289 1.96867258637212e-05 0.000134868954773992 -4.0272298065247e-06 
0.137301340699196 1.78612881427398e-05 9.72296184045263e-05 -4.85710552311502e-06 
0.141435042023659 1.82222829607781e-05 6.63541432004422e-05 -4.88994601255399e-06 
0.145343169569969 2.32551410590531e-05 3.77560099877883e-05 -3.81997051590588e-06 
0.149123877286911 2.21550526475767e-05 1.25590995594393e-05 -2.0314012090239e-06 
0.152333602309227 2.31537160289008e-05 -1.15576422103914e-05 -8.18294779492135e-07 
0.154982194304466 3.0667597457068e-05 -2.50026951107429e-05 4.10385581517403e-07 
0.157245874404907 2.9460205041687e-05 -3.78657387045678e-05 9.22814422210649e-07 
0.159225285053253 2.42509104282362e-05 -4.75052220281214e-05 1.09110715129646e-06 
0.160953283309937 2.22432645387016e-05 -5.91604512010235e-05 8.95994105576392e-07 
0.162743583321571 2.23469596676296e-05 -7.19623421900906e-05 -9.78143589236424e-07 
0.164629250764847 2.02370738406898e-05 -8.55866819620132e-05 -2.43122622123337e-06 
0.166670247912407 1.54907447722508e-05 -9.36573851504363e-05 -3.57532235284452e-06 
0.168472975492477 1.39503808895824e-05 -0.000101737787190359 -5.51114953850629e-06 
0.169766470789909 2.080647755065e-05 -0.000107743042462971 -7.51945572119439e-06 
0.170311570167542 2.30940186156658e-05 -0.000111228859168477 -8.20472450868692e-06 
0.170205339789391 2.44393522734754e-05 -0.000110712207970209 -9.14530937734526e-06 
0.169489622116089 2.37069325521588e-05 -0.000111550129076932 -8.92959906195756e-06 
0.168052271008492 3.27554917021189e-05 -0.000113406909804326 -9.27445489651291e-06 
0.166426315903664 2.66730967268813e-05 -0.000115627488412429 -8.16288866190007e-06 
0.164566412568092 1.41579994306085e-05 -0.000114492075226735 -7.56586268835235e-06 
0.162243843078613 -1.23147444242022e-07 -0.000112321038614027 -6.38062056168565e-06 
0.159521952271461 -8.2122523963335e-06 -0.000111400317109656 -5.76705451749149e-06 
0.156742826104164 -3.55429547198582e-05 -0.000112121801066678 -4.14038959206664e-06 
0.153465792536736 -5.26423427800182e-05 -0.000107819323602598 -2.18125023820903e-06 
0.149803340435028 -6.60310834064148e-05 -0.000107205160020385 2.12738927984901e-06 
0.145993560552597 -7.87852695793845e-05 -0.000103494952782057 4.26221640736912e-06 
0.141223520040512 -8.42074587126262e-05 -9.88457177300006e-05 6.17031810179469e-06 
0.136048421263695 -7.99339395598508e-05 -8.65702895680442e-05 7.54664824853535e-06 
0.13059888780117 -8.21022913441993e-05 -7.6185999205336e-05 6.69689507049043e-06 
0.125000506639481 -8.05618110462092e-05 -6.15531098446809e-05 5.46178216609405e-06 
0.119157902896404 -8.26214163680561e-05 -5.13191916979849e-05 5.69277699469239e-06 
0.1137830093503 -9.70789405982941e-05 -4.01303914259188e-05 5.45384000361082e-06 
0.108324185013771 -0.000114988644781988 -3.16431032842956e-05 5.8991290643462e-06 
0.102763153612614 -0.000131040462292731 -2.38808697758941e-05 6.75411502015777e-06 
0.0971202626824379 -0.000148022139910609 -1.82860858330969e-05 7.39938604965573e-06 
0.0911681205034256 -0.000154256704263389 -1.42872195283417e-05 7.62520130592748e-06 
0.0850255787372589 -0.000156732421601191 -1.05327135315747e-05 8.23965820018202e-06 
0.0787487104535103 -0.000154314155224711 -7.23316088624415e-06 8.31190936878556e-06 
0.0724430680274963 -0.000147848710184917 -4.07365723731345e-06 8.51844470162177e-06 
0.0662731528282166 -0.000138388975756243 -1.82862754627422e-06 8.22881429485278e-06 
0.0605086088180542 -0.000131774751935154 -7.06575406184129e-07 8.362404514628e-06 
0.0553085170686245 -0.000121670964290388 3.27909532416015e-07 7.73756619310006e-06 
0.0507041923701763 -0.000113255904580001 1.4782206108066e-06 7.75352236814797e-06 
0.0467490963637829 -0.000106393519672565 9.89251134342339e-07 7.59789281801204e-06 
0.0433620885014534 -0.000101807781902608 2.24122527470172e-06 7.35579033062095e-06 
0.0404850617051125 -9.91152483038604e-05 3.58482247975189e-06 7.19478839528165e-06 
0.0379306375980377 -9.50738904066384e-05 5.25879022461595e-06 6.97512405167799e-06 
0.0356987565755844 -9.07283974811435e-05 6.06745243203477e-06 6.96346023687511e-06 
0.0337301231920719 -8.45838367240503e-05 7.38736480343505e-06 6.89821172272786e-06 
0.0319967567920685 -7.96997628640383e-05 7.45498391552246e-06 6.92202866048319e-06 
0.0304322466254234 -7.41478288546205e-05 8.88048271008302e-06 6.75583032716531e-06 
0.0289297830313444 -6.54293835395947e-05 6.96569122737856e-06 6.97772657076712e-06 
0.0275453515350819 -5.84006047574803e-05 6.50024776405189e-06 6.83875578033621e-06 
0.0261986777186394 -5.33709644514602e-05 5.15153169544647e-06 6.83326425132691e-06 
0.0248743910342455 -4.57043897768017e-05 3.93154550692998e-06 6.69443670631154e-06 
0.0235795974731445 -3.77490687242243e-05 2.66515917246579e-06 6.34935304333339e-06 
0.0223944932222366 -3.31368828483392e-05 3.06652214021597e-06 5.78806202611304e-06 
0.0211633834987879 -2.69554657279514e-05 9.31881686483393e-07 5.65257187190582e-06 
0.0199914760887623 -2.07611738005653e-05 5.65668017316057e-07 5.40054452358163e-06 
0.0188563279807568 -1.54179415403632e-05 -3.78409424683923e-07 5.36496736458503e-06 
0.0178358126431704 -1.09026332211215e-05 -1.04416687918274e-06 5.47050603927346e-06 
0.0168838929384947 -6.38777555650449e-06 -2.69407632913499e-06 5.73603892917163e-06 
0.0160352773964405 1.51888457367022e-07 -3.78581330551242e-06 5.84286408411572e-06 
0.0153510887175798 6.09521566730109e-06 -4.30416321250959e-06 5.8767618611455e-06 
0.0147897750139236 1.18374000521726e-05 -5.6129060794774e-06 5.61859451408964e-06 
0.0142858726903796 1.77983238245361e-05 -7.59665590521763e-06 5.83841665502405e-06 
0.0138928703963757 2.26943666348234e-05 -8.1663392847986e-06 5.97524922341108e-06 
0.0136605659499764 2.53018533840077e-05 -7.93810886534629e-06 5.9993171817041e-06 
0.0134608214721084 2.91406668111449e-05 -8.48114632390207e-06 6.05868262937292e-06 
0.0133469197899103 3.18115125992335e-05 -9.19833291845862e-06 6.19789489064715e-06 
0.0133597860112786 3.35212025674991e-05 -9.07270623429213e-06 5.84043709750404e-06 
0.013439224101603 3.58620309270918e-05 -9.36553442443255e-06 5.45588864042656e-06 
0.0136144030839205 3.66268068319187e-05 -9.69071697909385e-06 5.17085936735384e-06 
0.0138310017064214 3.71297683159355e-05 -1.0291285434505e-05 4.96934899274493e-06 
0.0140701867640018 3.72720205632504e-05 -1.01314099083538e-05 4.84864358440973e-06 
0.0143035091459751 3.71295027434826e-05 -1.02353378679254e-05 4.93308607474319e-06 
0.0145249282941222 3.57190911017824e-05 -1.11653343992657e-05 5.20319417773862e-06 
0.0145983016118407 3.75454510503914e-05 -1.17526524263667e-05 5.25371706316946e-06 
0.0146530792117119 3.69928966392763e-05 -1.061967395799e-05 5.20850653629168e-06 
0.0146532822400331 3.71438727597706e-05 -9.25978747545741e-06 5.30296438228106e-06 
0.0145880077034235 3.71106070815586e-05 -9.11637380340835e-06 5.34910986971227e-06 
0.0144751081243157 3.71903988707345e-05 -7.83820541983005e-06 5.41518147656461e-06 
0.0144047755748034 3.32847303070594e-05 -6.20095079284511e-06 5.52181109014782e-06 
0.0143349971622229 3.06571164401248e-05 -5.50105187357985e-06 5.66997414352954e-06 
0.0142806153744459 2.75433849310502e-05 -4.05652235713205e-06 5.46605224371888e-06 
0.0142392553389072 2.51505207415903e-05 -2.06883805731195e-06 5.23931294083013e-06 
0.0142112923786044 2.21438876906177e-05 -3.74083896304001e-07 4.88398109155241e-06 
0.0142304971814156 1.9639008314698e-05 9.65063691182877e-07 4.84081283502746e-06 
0.0142155839130282 1.78847603820032e-05 1.76835101228789e-06 4.94126197736477e-06 
0.0142711326479912 1.44153882501996e-05 3.19000105264422e-06 5.08807806909317e-06 
0.01433349493891 1.07984624264645e-05 4.12879762734519e-06 4.74274384032469e-06 
0.0143892848864198 6.93008723828825e-06 6.63764967612224e-06 5.12123324369895e-06 
0.0144117223098874 3.46378146787174e-06 9.08483798411908e-06 5.13515806233045e-06 
0.0145015027374029 -3.72933072867454e-06 1.32265386127983e-05 5.11650796397589e-06 
0.014411392621696 -7.31184036339982e-06 1.6087189578684e-05 4.87530905957101e-06 
0.0143034709617496 -1.16874552986701e-05 2.02554710995173e-05 5.16699901709217e-06 
0.014242117293179 -1.67717280419311e-05 2.39204928220715e-05 4.62639627585304e-06 
0.014097236096859 -2.175230292778e-05 2.71801618509926e-05 4.73492491437355e-06 
0.0138821257278323 -2.63327001448488e-05 2.97571732517099e-05 4.37120388596668e-06 
0.0137051055207849 -3.3325679396512e-05 3.30879556713626e-05 4.42078999185469e-06 
0.0135130379348993 -4.25136749981903e-05 3.66002823284362e-05 4.03616331823287e-06 
0.0132817812263966 -5.46219052921515e-05 3.98493502871133e-05 3.9050364648574e-06 
0.0130431801080704 -6.76342824590392e-05 4.44057513959706e-05 3.34393462253502e-06 
0.012819210998714 -8.22739166324027e-05 4.90477978019044e-05 3.258665856265e-06 
0.0125998025760055 -9.68872554949485e-05 5.46380470041186e-05 2.68796475211275e-06 
0.0123349893838167 -0.000112285080831498 6.01543215452693e-05 2.67922678176546e-06 
0.0120022008195519 -0.00012631707068067 6.64709223201498e-05 2.4714345272514e-06 
0.0117607768625021 -0.000143381257657893 7.2193841333501e-05 2.36132700592862e-06 
0.0115145985037088 -0.000158547976752743 7.95169689808972e-05 1.65213509717432e-06 
0.0112655758857727 -0.000176627276232466 8.63307432155125e-05 1.21531377317297e-06 
0.0110126556828618 -0.000191435246961191 9.25580825423822e-05 5.81744814098784e-07 
0.0107944905757904 -0.000206375218112953 9.68072126852348e-05 -1.94535431319309e-07 
0.0105214053764939 -0.000219887253479101 0.000101219062344171 -5.53914901502139e-07 
0.0101696867495775 -0.000230043166084215 0.000104017570265569 -7.76777710598253e-07 
0.00979829113930464 -0.000237896325415932 0.000106430597952567 -1.17307376967801e-06 
0.00944339856505394 -0.000246323877945542 0.0001099708606489 -1.04190417005157e-06 
0.00899274367839098 -0.000249874399742112 0.000111701687274035 -7.17558577889577e-07 
0.00843668449670076 -0.000248661643126979 0.000111842527985573 -4.32385803605939e-07 
0.00785716064274311 -0.000243617047090083 0.000110579945612699 3.15819534080219e-07 
0.00718219531700015 -0.000232282487559132 0.000107056694105268 1.48400579291774e-06 
0.00638184603303671 -0.000216718137380667 9.7625124908518e-05 3.18537740895408e-06 
0.00557346595451236 -0.00019781275477726 8.90731898834929e-05 4.73285263069556e-06 
0.00472996756434441 -0.000172566040419042 7.90344129200093e-05 5.92022161072236e-06 
0.00381610379554331 -0.000147727958392352 6.79402801324613e-05 7.13031386112561e-06 
0.00290935928933322 -0.000121272583783139 5.79133557039313e-05 7.94699735706672e-06 
0.002025265712291 -9.33857736526988e-05 5.16025174874812e-05 7.61528508519405e-06 
0.00119580619502813 -6.6864478867501e-05 4.43658827862237e-05 7.10220774635673e-06 
0.000560645537916571 -4.82350988022517e-05 3.99740274588112e-05 6.92695857651415e-06 
3.25796099787112e-05 -2.96799789794022e-05 3.78279873984866e-05 6.41221504338318e-06 
-0.000366588501492515 -1.58784496306907e-05 3.46616834576707e-05 6.35121705272468e-06 
-0.000672223744913936 -5.35089202458039e-06 3.27437301166356e-05 5.77069249629858e-06 
-0.000830754055641592 3.32800163960201e-06 3.22151645377744e-05 5.69268422623281e-06 
-0.00100654177367687 8.73953649715986e-06 3.07545196847059e-05 5.22316940987366e-06 
-0.00112409226130694 1.18211000881274e-05 2.80525218840921e-05 5.05483967572218e-06 
-0.00113795499783009 1.11329864012077e-05 2.70954606094165e-05 4.42114833276719e-06 
-0.00109195243567228 1.13719770524767e-05 2.53442231041845e-05 4.49720027972944e-06 
-0.00109189504291862 8.58439307194203e-06 2.37416934396606e-05 4.40516578237293e-06 
-0.0010603757109493 9.80320419330383e-06 2.1977237338433e-05 4.21203731093556e-06 
-0.00097744632512331 1.01309369711089e-05 2.15352447412442e-05 3.6771505165234e-06 
-0.000951159920077771 1.25536998893949e-05 1.92208644875791e-05 3.63884873877396e-06 
-0.000906376051716506 1.12204752440448e-05 1.81148388946895e-05 3.44182149092376e-06 
-0.000833096506539732 1.10813998617232e-05 1.69558788911672e-05 3.21031143357686e-06 
-0.000790002522990108 1.00923007266829e-05 1.50656305777375e-05 3.27360953633615e-06 
-0.000706713646650314 6.86600924382219e-06 1.48411354530253e-05 2.95793165605573e-06 
0 0 0 0 
0 0 0 0 
0 0 0 0 
0 0 0 0 
0 0 0 0 
0 0 0 0 
0 0 0 0 
0 0 0 0 
0 0 0 0 
0 0 0 0 
0 0 0 0 
0 0 0 0 
0 0 0 0 
0 0 0 0 
99.6245727539063 0.239107444882393 0.118962831795216 0.00716302590444684 
