0 0 0 0 
0 0 0 0 
0 0 0 0 
0 0 0 0 
0 0 0 0 
0 0 0 0 
0 0 0 0 
0 0 0 0 
0 0 0 0 
0 0 0 0 
0.00120714062359184 -2.77842264040373e-05 1.33203002405935e-06 -6.48594914309797e-06 
0.00133966677822173 -3.13884593197145e-05 1.03663364825479e-06 -7.53764106775634e-06 
0.00150318932719529 -3.19322025461588e-05 2.73084481250407e-07 -8.35802802612307e-06 
0.00171293690800667 -3.12832344206981e-05 -5.16445027187729e-07 -8.94963795872172e-06 
0.00206212815828621 -2.81044140137965e-05 -1.83098109118873e-06 -8.76720969245071e-06 
0.00251578469760716 -2.0923533156747e-05 -2.93388711725129e-06 -8.16533793113194e-06 
0.00302221206948161 -1.18689858936705e-05 -3.67559709957277e-06 -7.22238519301754e-06 
0.00356172816827893 -2.61302147919196e-06 -4.31509806730901e-06 -5.66028074899805e-06 
0.00406425492838025 6.08768323218101e-06 -4.82891528008622e-06 -3.81143308914034e-06 
0.00442003179341555 1.41661766974721e-05 -4.69193264507339e-06 -2.29108695748437e-06 
0.00463102338835597 1.92094994417857e-05 -4.60867067886284e-06 -7.99332894985127e-07 
0.00474852463230491 2.28639437409583e-05 -4.73908448839211e-06 5.78625758862472e-07 
0.004809042904526 2.65448852587724e-05 -4.60289265902247e-06 1.61430284606467e-06 
0.00484325969591737 3.00877964036772e-05 -4.38292681792518e-06 2.32668253374868e-06 
0.00491916155442595 3.35621334670577e-05 -4.26373117079493e-06 2.8275767363084e-06 
0.00509103294461966 3.73435177607462e-05 -4.2134693103435e-06 3.26513304571563e-06 
0.00537352403625846 4.18822637584526e-05 -4.14387159253238e-06 3.6734950299433e-06 
0.0057557406835258 4.63596807094291e-05 -4.24952349931118e-06 3.99607915824163e-06 
0.00622935639694333 5.09146957483608e-05 -4.43410590378335e-06 4.41229394709808e-06 
0.00674290908500552 5.48952484678011e-05 -4.67258496428258e-06 4.95742870043614e-06 
0.00723283272236586 5.79531842959113e-05 -5.16370846526115e-06 5.522929768631e-06 
0.00764959305524826 5.92637152294628e-05 -5.85326142754639e-06 6.17844671069179e-06 
0.00796101614832878 5.9551191952778e-05 -6.66055348119698e-06 6.91002833264065e-06 
0.00815790984779596 5.85606903769076e-05 -7.59449949327973e-06 7.69631878938526e-06 
0.00826100166887045 5.71177697565872e-05 -8.85814552020747e-06 8.61578610056313e-06 
0.00833861622959375 5.64082365599461e-05 -9.95284426608123e-06 9.6696567197796e-06 
0.00848393142223358 5.84003355470486e-05 -1.0684793778637e-05 1.06402385426918e-05 
0.0088159441947937 6.40724902041256e-05 -1.09236852949834e-05 1.15876355266664e-05 
0.0094534931704402 7.44889839552343e-05 -1.08966596599203e-05 1.25401784316637e-05 
0.0105268443003297 9.08061701920815e-05 -1.01425794127863e-05 1.34745178002049e-05 
0.0122094638645649 0.000114763264718931 -8.91266518010525e-06 1.44054747579503e-05 
0.014669893309474 0.000145316153066233 -7.51321886127698e-06 1.581806827744e-05 
0.0180715098977089 0.000183234937139787 -5.91840944252908e-06 1.72170184669085e-05 
0.0226447600871325 0.000228688775678165 -3.65873734153865e-06 1.87762216228293e-05 
0.0285369250923395 0.000279033120023087 -7.20231241757574e-07 1.97830195247661e-05 
0.0358015187084675 0.000330741371726617 3.01337468044949e-06 1.97910449060146e-05 
0.0443788468837738 0.000380934769054875 8.04198589321459e-06 1.8210319467471e-05 
0.0540041476488113 0.000423395045800135 1.38721597977565e-05 1.48914932651678e-05 
0.0642023161053658 0.000451463391073048 1.98007528524613e-05 9.52348182181595e-06 
0.0746404826641083 0.000464069657027721 2.55443028436275e-05 3.49821880263335e-06 
0.0848132744431496 0.000457486923551187 2.98462982755154e-05 -2.62645812654227e-06 
0.0943460837006569 0.000432755303336307 3.22335617966019e-05 -7.93018443800975e-06 
0.103061854839325 0.000396292860386893 3.10707982862368e-05 -1.29249183373759e-05 
0.110997602343559 0.000354345393134281 2.6653622626327e-05 -1.58210441441042e-05 
0.117895007133484 0.000307812151731923 2.0052397303516e-05 -1.74864599102875e-05 
0.123851850628853 0.000264211616013199 1.16127666842658e-05 -1.76201374415541e-05 
0.128947466611862 0.000224353818339296 3.06056472254568e-06 -1.72948039107723e-05 
0.133247137069702 0.000187629659194499 -3.80983146897051e-06 -1.52114962475025e-05 
0.136856839060783 0.000154479421325959 -8.99461792869261e-06 -1.27560460896348e-05 
0.139923349022865 0.000126664861454628 -1.38387913466431e-05 -1.043298834702e-05 
0.142564237117767 0.000103323225630447 -1.67751150002005e-05 -8.35042737890035e-06 
0.144750103354454 8.62690940266475e-05 -1.92079987755278e-05 -6.53091501590097e-06 
0.146599784493446 7.45028009987436e-05 -2.07013399631251e-05 -4.77492130812607e-06 
0.147942408919334 6.30102440482005e-05 -2.17620199691737e-05 -4.1105922718998e-06 
0.148934155702591 5.59340915060602e-05 -2.2126891053631e-05 -3.45359967468539e-06 
0.14953225851059 4.6148295950843e-05 -2.3396762117045e-05 -2.9080003969284e-06 
0.149988666176796 4.01328943553381e-05 -2.37423628277611e-05 -2.64378741121618e-06 
0.150064438581467 2.97027581837028e-05 -2.39595465245657e-05 -3.70919474335096e-06 
0.150181874632835 2.63561723841121e-05 -2.32561578741297e-05 -3.9383794501191e-06 
0.150220602750778 1.61743901117006e-05 -2.2834341507405e-05 -4.28050543632708e-06 
0.150244772434235 1.13835303636733e-05 -2.1449677660712e-05 -5.483965651365e-06 
0.150135844945908 -2.57054603025608e-06 -2.16288317460567e-05 -6.35798869552673e-06 
0.15014711022377 -1.57895337906666e-05 -2.118442353094e-05 -4.86002363686566e-06 
0.149913296103477 -3.53497816831805e-05 -1.99595833692001e-05 -3.84173472411931e-06 
0.149708062410355 -4.79873924632557e-05 -1.78752270585392e-05 -2.27962277676852e-06 
0.149438798427582 -6.22411462245509e-05 -1.70721723407041e-05 -7.51716811464576e-07 
0.149246513843536 -6.96100105415098e-05 -1.41009068101994e-05 1.79963944901829e-06 
0.148828327655792 -7.27965525584295e-05 -1.09699712993461e-05 3.2164887215913e-06 
0.148216739296913 -7.95597516116686e-05 -1.05811132016242e-05 4.6125273911457e-06 
0.147323489189148 -9.0879577328451e-05 -8.46062994241947e-06 5.53242534806486e-06 
0.146302193403244 -9.54165516304784e-05 -3.99392729377723e-06 6.70108192935004e-06 
0.14478488266468 -0.000109761720523238 -1.90091611784737e-06 7.17735019861721e-06 
0.14326111972332 -0.000124546757433563 -1.62292678851372e-06 5.99844952375861e-06 
0.141676351428032 -0.000129946987726726 5.66424262160581e-07 5.14433349962928e-06 
0.140053033828735 -0.000130866275867447 2.28986959882604e-06 4.30632417192101e-06 
0.138137713074684 -0.000136142320116051 2.00971271624439e-06 3.84300437872298e-06 
0.136274933815002 -0.000130610060296021 3.82907501261798e-06 3.8496041270264e-06 
0.134121924638748 -0.000128690808196552 5.9733592934208e-06 5.21625133842463e-06 
0.131662100553513 -0.000127985156723298 9.20121510716854e-06 5.15786496180226e-06 
0.128942877054214 -0.000130086918943562 9.63159982347861e-06 5.71138934901683e-06 
0.126138508319855 -0.000135628564748913 1.23053305287613e-05 6.31537614026456e-06 
0.123055957257748 -0.000144795383675955 1.2328917364357e-05 6.37960829408257e-06 
0.119870193302631 -0.000150926207425073 1.32181094159023e-05 7.37201980882674e-06 
0.116676740348339 -0.000159055358381011 1.28703686641529e-05 8.36614253785228e-06 
0.113327667117119 -0.000162853306392208 1.38816858452628e-05 8.65186211740365e-06 
0.110024482011795 -0.000161912306793965 1.38741015689448e-05 8.80730021890486e-06 
0.10662204772234 -0.000158463793923147 1.49091047205729e-05 7.62299669077038e-06 
0.103356637060642 -0.000152070017065853 1.55208235810278e-05 5.91019897910883e-06 
0.100280970335007 -0.000148739884025417 1.59607407113072e-05 6.60276646158309e-06 
0.0973008647561073 -0.000147248487337492 1.61952902999474e-05 7.46009482099907e-06 
0.0941580459475517 -0.000144251316669397 1.69975792232435e-05 7.79435868025757e-06 
0.0910872742533684 -0.000139843774377368 1.83642696356401e-05 8.93860487849452e-06 
0.0877064019441605 -0.000139700641739182 1.91672279470367e-05 8.5484698502114e-06 
0.0840865820646286 -0.000133460358483717 1.97977533389349e-05 6.90648494128254e-06 
0.0802000015974045 -0.000126303741126321 2.07983466680162e-05 4.69296674054931e-06 
0.0759606435894966 -0.00012539851013571 2.08524397748988e-05 2.87599732473609e-06 
0.071351669728756 -0.000127107239677571 2.03935687750345e-05 1.39572387070075e-06 
0.0665986314415932 -0.000124948099255562 2.01784569071606e-05 7.73363410644379e-07 
0.0616457499563694 -0.000123669276945293 1.98987145267893e-05 1.50017598343766e-07 
0.0566294975578785 -0.000122988087241538 1.99440601136303e-05 -5.61829949674575e-07 
0.0517413504421711 -0.000121053351904266 1.94561634998536e-05 -1.10119367491279e-06 
0.047097060829401 -0.000114967377157882 1.90033115359256e-05 -2.10825965041295e-06 
0.0426509268581867 -0.000110775465145707 1.87614950846182e-05 -2.76386981568066e-06 
0.0385445132851601 -0.000106869098090101 1.82940493687056e-05 -3.40720521307958e-06 
0.0347833521664143 -0.000100588185887318 1.70770690601785e-05 -4.01762417823193e-06 
0.0314565002918243 -9.20209495234303e-05 1.63730437634513e-05 -4.54400060334592e-06 
0.0285241566598415 -8.47020201035775e-05 1.58709535753587e-05 -4.82807809021324e-06 
0.0259586609899998 -7.55844448576681e-05 1.52317752508679e-05 -5.18173010277678e-06 
0.0236880965530872 -6.5342137531843e-05 1.44186824400094e-05 -5.52076880921959e-06 
0.0217114686965942 -5.64824877073988e-05 1.36029157147277e-05 -5.27250813320279e-06 
0.0199622288346291 -4.68941943836398e-05 1.3109715837345e-05 -5.30100578544079e-06 
0.0184289328753948 -3.80499550374225e-05 1.23067029562662e-05 -5.09699793838081e-06 
0.0171041246503592 -3.00104074995033e-05 1.14341000880813e-05 -4.72889723823755e-06 
0.0159091912209988 -2.23695369641064e-05 1.06299767139717e-05 -4.38343022324261e-06 
0.0148734515532851 -1.50252126331907e-05 9.97649749479024e-06 -4.0300242289959e-06 
0.0139637477695942 -8.65107358549722e-06 9.01021667232271e-06 -3.47137006428966e-06 
0.0131474081426859 -2.3292202513403e-06 8.17774889583234e-06 -2.85201167571358e-06 
0.0123859625309706 3.96153518522624e-06 7.2470620580134e-06 -2.26138763537165e-06 
0.0116649186238647 9.27754717849893e-06 6.71296720611281e-06 -1.63295112542983e-06 
0.0109545346349478 1.4336504136736e-05 6.02340242039645e-06 -1.03482591384818e-06 
0.0102505665272474 1.88155463547446e-05 5.50734694115818e-06 -4.17627319393432e-07 
0.00956291984766722 2.27755826927023e-05 4.88398200104712e-06 1.39014275646332e-07 
0.00890047755092382 2.63563197222538e-05 4.13329689763486e-06 6.55553321848856e-07 
0.00826881267130375 3.00857154797995e-05 3.15398233396991e-06 1.15563091185322e-06 
0.00768506759777665 3.37005330948159e-05 2.11926044357824e-06 1.67998223332688e-06 
0.00714154122397304 3.72030081052799e-05 1.06137599686917e-06 2.28440694627352e-06 
0.0066343261860311 4.05857026635204e-05 1.82130904136102e-07 2.93071525447886e-06 
0.00617009215056896 4.43136959802359e-05 -4.52816891538532e-07 3.63932167601888e-06 
0.00576596520841122 4.80301641800907e-05 -1.08119593278388e-06 4.38330062024761e-06 
0.00540077919140458 5.19220375281293e-05 -1.46375577969593e-06 5.2338828027132e-06 
0.00508127780631185 5.64837682759389e-05 -1.79940491307207e-06 6.17110617895378e-06 
0.00478687509894371 6.09696835454088e-05 -2.15097998079727e-06 7.03903060639277e-06 
0.00449959700927138 6.44703904981725e-05 -2.50549351221707e-06 7.8208431659732e-06 
0.00423548836261034 6.71875750413164e-05 -2.64850359599222e-06 8.60154705151217e-06 
0.00397505750879645 6.83189136907458e-05 -2.74189051197027e-06 9.06259356270311e-06 
0.00370830902829766 6.76144118187949e-05 -2.78165907729999e-06 9.22908930078847e-06 
0.00345291453413665 6.5657492086757e-05 -2.55219310929533e-06 9.18889418244362e-06 
0.00319386273622513 6.2785780755803e-05 -2.21894129026623e-06 8.93897413334344e-06 
0.00290995906107128 5.84863882977515e-05 -1.81489065198548e-06 8.41379460325697e-06 
0.00260601285845041 5.31575242348481e-05 -1.37367158004054e-06 7.76222350395983e-06 
0.00229402212426066 4.74167354695965e-05 -7.64555977639247e-07 7.00875716574956e-06 
0.00197355425916612 4.08332525694277e-05 -4.62340494777891e-07 6.20755145064322e-06 
0.0016669575124979 3.39799626090098e-05 -4.85143871742366e-08 5.37667256139684e-06 
0.00136915151961148 2.76157752523432e-05 1.58334316324726e-07 4.49482922704192e-06 
0.00110583147034049 2.21469672396779e-05 3.2809839467518e-07 3.68641258319258e-06 
0.000871779979206622 1.68954557011602e-05 2.80571413213693e-07 2.89902664007968e-06 
0.000675372430123389 1.23933277791366e-05 2.41658739241757e-07 2.18846025745734e-06 
0.000523902592249215 9.25649146665819e-06 6.74149731594298e-08 1.66756854014238e-06 
0.000403813377488405 6.77439629725995e-06 2.20431282116351e-08 1.2106246458643e-06 
0.000314791454002261 4.93768720843946e-06 -5.50576579883e-08 8.52557150210487e-07 
0.000260102940956131 3.92665469917119e-06 -1.5132422959141e-07 5.83839550927223e-07 
0.000210794038139284 3.35711160914798e-06 -2.39744025520849e-07 3.66456902156642e-07 
0.000174539527506568 3.12623205900309e-06 -3.90341767797509e-07 1.34155882847153e-07 
0.000155055909999646 3.14399426315504e-06 -5.22417849424528e-07 -2.06806411995331e-08 
0.000151004031067714 3.53678137798852e-06 -8.30578528621118e-07 -2.11946201034152e-07 
0.000155185582116246 4.30824866270996e-06 -1.17779234187765e-06 -4.10087380942059e-07 
0.000169489867403172 5.6413259699184e-06 -1.46409922763269e-06 -7.02358533999359e-07 
0.000194618260138668 7.13546796760056e-06 -1.88231422271201e-06 -1.1132716508655e-06 
0.000228760225581937 9.25323365663644e-06 -2.46983017859748e-06 -1.58089414981077e-06 
0.000255224469583482 1.14857484732056e-05 -2.95678432848945e-06 -2.13896646528156e-06 
0.000305177585687488 1.43322449730476e-05 -3.67013308277819e-06 -2.68534063252446e-06 
0 0 0 0 
0 0 0 0 
0 0 0 0 
0 0 0 0 
0 0 0 0 
0 0 0 0 
0 0 0 0 
0 0 0 0 
0 0 0 0 
0 0 0 0 
0 0 0 0 
0 0 0 0 
0 0 0 0 
0 0 0 0 
99.7965469360352 0.169265300035477 0.0157517045736313 0.00936897564679384 
