0.00126006233040243 -0.00426454748958349 
0.00144779682159424 -0.00552863348275423 
0.00164304592180997 -0.0048823356628418 
0.00227943854406476 -0.00418571569025517 
0.003610864514485 -0.000317187455948442 
0.00600076792761683 0.0030825596768409 
0.00963443424552679 0.00651297438889742 
0.0147639913484454 0.00628511747345328 
0.021115193143487 0.0058724032714963 
0.0282380860298872 0.00723762577399611 
0.0355892106890678 0.00561085715889931 
0.0429352670907974 0.00454128114506602 
0.0497870147228241 0.00266939913854003 
0.0561817362904549 0.0053858021274209 
0.0632970631122589 0.00385139719583094 
0.0722519978880882 0.000329319853335619 
0.0824098885059357 -0.000827268231660128 
0.0911177471280098 0.00239418703131378 
0.0980276539921761 0.00766849843785167 
0.103790163993835 0.00508017651736736 
0.109705746173859 -3.03540709865047e-05 
0.11494317650795 -0.00263138301670551 
0.119371004402637 -0.00496933655813336 
0.122945517301559 -0.00624509667977691 
0.126341491937637 -0.0063439984805882 
0.129630818963051 -0.00344301550649107 
0.133312493562698 0.000684326863847673 
0.137309491634369 -0.0016842435579747 
0.141492053866386 -0.000235359533689916 
0.145789220929146 -0.00168914126697928 
0.149684578180313 -0.00111453712452203 
0.153143867850304 -0.00178758159745485 
0.155877068638802 -0.00290601397864521 
0.158180698752403 -0.00611610058695078 
0.159841656684875 -0.00930624362081289 
0.161327436566353 -0.0124802608042955 
0.162677943706512 -0.00833644438534975 
0.16437828540802 -0.00965988729149103 
0.166395366191864 -0.00548969488590956 
0.168222069740295 -0.00827205833047628 
0.16955541074276 -0.00509508466348052 
0.170320689678192 -0.00792472623288631 
0.170142218470573 -0.00659717386588454 
0.169443398714066 -0.00478050578385592 
0.167841091752052 -0.000679077405948192 
0.166199952363968 -0.000338405458023772 
0.164265155792236 -0.00442979438230395 
0.161550804972649 -0.00447260634973645 
0.158246889710426 -0.00340368738397956 
0.154653117060661 -0.00186782237142324 
0.150835812091827 -0.00459461286664009 
0.147219687700272 -0.00275033293291926 
0.143034860491753 -0.00231926655396819 
0.138973906636238 0.000222234579268843 
0.133630827069283 0.000250562385190278 
0.128059864044189 -0.00103219342418015 
0.121965192258358 -0.00235630432143807 
0.116452999413013 -0.00587818818166852 
0.110766470432281 -0.00483393110334873 
0.104941390454769 -0.00365454377606511 
0.0987527072429657 -0.00297957588918507 
0.0924966782331467 -0.00134203734342009 
0.0864994078874588 -0.00104135484434664 
0.0804813802242279 0.0024865202140063 
0.0742713361978531 0.00307314959354699 
0.0679350197315216 0.0032958909869194 
0.0617873333394527 -7.74342624936253e-05 
0.0562286674976349 -0.00206356844864786 
0.0512554422020912 -0.00163620663806796 
0.0469901897013187 -0.00203331094235182 
0.0432704165577888 -0.00107062212191522 
0.0401366055011749 -0.00134166388306767 
0.0374267548322678 8.47023547976278e-05 
0.035101979970932 0.000201138289412484 
0.0330660603940487 -0.000838138163089752 
0.031274352222681 -0.000444236735347658 
0.0297842472791672 -0.000268006697297096 
0.0284182466566563 0.00123338785488158 
0.0271988864988089 0.00134686927776784 
0.0260582957416773 0.00129113346338272 
0.024944331496954 0.000180251910933293 
0.023774852976203 -9.52830741880462e-05 
0.0226588454097509 -0.000413874251535162 
0.0216201208531857 -2.14450519706588e-05 
0.0207371469587088 -0.000497411761898547 
0.0197334159165621 0.000718247727490962 
0.0187170654535294 0.000104438346170355 
0.0177388302981853 4.29769352194853e-05 
0.0169671326875687 -0.0014057329390198 
0.0163635797798634 -0.00162863708101213 
0.0158724002540112 -0.00127823418006301 
0.0154930874705315 5.6480297644157e-05 
0.0152501324191689 0.000203941890504211 
0.0150648877024651 -0.000221378519199789 
0.0148693202063441 -0.00108154281042516 
0.014738917350769 -0.000342784100212157 
0.0147017622366548 0.000466221157694235 
0.0147782145068049 0.000627149478532374 
0.0149020943790674 8.78882929100655e-05 
0.0150853861123323 -0.000890984898433089 
0.0153468046337366 -0.000885840738192201 
0.0156315416097641 -0.00105729233473539 
0.0158544331789017 -0.000338379351887852 
0.0160270538181067 -0.000125656952150166 
0.0161405056715012 0.000744446006137878 
0.0162401683628559 0.00104002258740366 
0.0161929428577423 0.000802532362286001 
0.0161384716629982 0.00153385906014591 
0.0160174556076527 0.00141801673453301 
0.0159101914614439 0.00185987947043031 
0.0156860575079918 0.00107541051693261 
0.0155266476795077 0.000663492130115628 
0.0153839243575931 0.000552652461919934 
0.0153569662943482 -2.27582204388455e-05 
0.01525794621557 0.000416962750023231 
0.0151930619031191 0.000844187219627202 
0.0151149444282055 0.000678842712659389 
0.0151188625022769 -0.000390711677027866 
0.0151170352473855 -0.00094659609021619 
0.0150484489277005 -0.00131454120855778 
0.0149354347959161 -0.00170452275779098 
0.0147875845432281 -0.00224361382424831 
0.0145595455542207 -0.00298219476826489 
0.0143208438530564 -0.00328271719627082 
0.014127429574728 -0.0041166739538312 
0.0139203630387783 -0.00376557814888656 
0.0135187767446041 -0.00415879627689719 
0.0130176087841392 -0.00506124459207058 
0.0124317742884159 -0.00663731899112463 
0.0118284225463867 -0.00640193652361631 
0.0111204599961638 -0.00576141709461808 
0.0104382568970323 -0.00574719440191984 
0.00983039941638708 -0.00702962884679437 
0.00918414443731308 -0.00837760325521231 
0.00844402518123388 -0.00819920282810926 
0.00764623284339905 -0.00791530031710863 
0.00693634478375316 -0.00801777839660645 
0.00618318747729063 -0.0085331117734313 
0.00553259439766407 -0.00963194854557514 
0.00477307569235563 -0.0104525024071336 
0.00413418747484684 -0.0110601363703609 
0.00344391376711428 -0.0109683899208903 
0.00278369663283229 -0.00987809803336859 
0.00223877979442477 -0.0088474852964282 
0.00165174982976168 -0.00753924902528524 
0.00114399974700063 -0.00477134343236685 
0.000802236434537917 -0.00365809327922761 
0.000639540085103363 -0.00281371874734759 
0.000533257727511227 -0.00362177356146276 
0.000339408579748124 -0.00329164112918079 
0.000265406066318974 -0.00291571812704206 
0.000181287730811164 -0.00236441218294203 
0.000152041800902225 -0.00200438336469233 
1.80908227775944e-05 -0.00154349091462791 
-6.25872635282576e-05 -0.000422911223722622 
-0.00011167443881277 0.000225548021262512 
-6.22484003542922e-05 -0.000961083977017552 
0.000109138003608678 -0.00350341945886612 
0.000107209707493894 -0.00424239411950111 
0.000212768718483858 -0.00430230982601643 
5.91128009546082e-05 -0.00259875250048935 
7.30189713067375e-05 -0.00298241595737636 
-0.000127347724628635 -0.00128637219313532 
-2.91442338493653e-05 -0.00228822347708046 
-6.80478842696175e-05 -0.0015717213973403 
-3.02714961435413e-05 -0.00154634832870215 
-6.12382655162946e-06 -0.000660348508972675 
0.000130924221593887 -0.00100294628646225 
0.000126234328490682 -0.000966418941970915 
5.61772685614415e-05 -0.00109159841667861 
-5.56084160052706e-05 -0.000196058579604141 
6.92980902385898e-05 -0.00129163102246821 
0.000101113633718342 -0.00163567345589399 
0.000165940029546618 -0.00283770845271647 
6.58905482850969e-05 -0.00193463265895844 
-2.55082923104055e-05 -0.00139520189259201 
-0.000105746257759165 -0.000236206484260038 
-5.15113897563424e-05 -0.000829735246952623 
7.48704405850731e-05 -0.0022008903324604 
0.000107032283267472 -0.00221128016710281 
1.16187475214247e-05 -0.00120961153879762 
-2.16043736145366e-05 -0.000430135318310931 
2.32765451073647e-05 -0.00122347206342965 
4.56602756457869e-05 -0.00169117818586528 
1.82431140274275e-05 -0.00149110250640661 
