0 0 0 0 
0 0 0 0 
0 0 0 0 
0 0 0 0 
0 0 0 0 
0 0 0 0 
0 0 0 0 
0 0 0 0 
0 0 0 0 
0 0 0 0 
0.0124068614095449 0.00113091710954905 -4.45778787252493e-05 -1.04861865111161e-05 
0.0165157187730074 0.00146632827818394 -4.42552627646364e-05 -1.25743208627682e-05 
0.0210560075938702 0.00177651480771601 -2.70161890512099e-05 -1.43644283525646e-05 
0.0263017602264881 0.00203840038739145 -6.19239199295407e-06 -1.64500179380411e-05 
0.0337528139352798 0.00221211113967001 2.25584935833467e-05 -2.25272142415633e-05 
0.0433116778731346 0.00226232199929655 5.96613317611627e-05 -2.36552023125114e-05 
0.0542069673538208 0.00218175677582622 9.49472159845755e-05 -1.89896236406639e-05 
0.0661259815096855 0.00198862887918949 0.000117736402899027 -1.41068267112132e-05 
0.0783357545733452 0.0017104271100834 0.000126406099298038 -7.48083721191506e-06 
0.0891768708825111 0.00139979703817517 0.0001220094418386 5.90476429351838e-06 
0.0983647331595421 0.00110893428791314 0.000102458274341188 1.56455535034183e-05 
0.106319963932037 0.000866806774865836 7.70455008023418e-05 2.05532032850897e-05 
0.113013878464699 0.000678295153193176 5.45615002920385e-05 2.53477101068711e-05 
0.118435479700565 0.000545057293493301 3.57595745299477e-05 2.83850986306788e-05 
0.122972004115582 0.000461817544419318 2.01711754925782e-05 2.85851037915563e-05 
0.126936003565788 0.0004100966907572 8.633831384941e-06 2.70189320872305e-05 
0.130658149719238 0.000364718755008653 -1.01140085462248e-06 2.4710716388654e-05 
0.13435323536396 0.000335647026076913 -9.6374951681355e-06 2.22172348003369e-05 
0.138010993599892 0.000316308258334175 -1.58775565068936e-05 2.03994932235219e-05 
0.141551464796066 0.000297409278573468 -2.0344772565295e-05 1.9337892808835e-05 
0.144864156842232 0.000280732114333659 -2.52208064921433e-05 1.90249393199338e-05 
0.147803112864494 0.000279131898423657 -2.78285115200561e-05 1.90554019354749e-05 
0.150290340185165 0.00027349399169907 -2.93522825813852e-05 2.0153545847279e-05 
0.152575775980949 0.000269773998297751 -3.15327888529282e-05 1.87567948159995e-05 
0.1546291410923 0.00026527201407589 -3.39256730512716e-05 1.4614570318372e-05 
0.156562656164169 0.00026290540699847 -3.63649232895114e-05 7.96553013060475e-06 
0.158410295844078 0.000246271200012416 -3.89169836125802e-05 3.86750161851523e-06 
0.160257026553154 0.000227829135837965 -4.16491275245789e-05 5.29820397332514e-07 
0.161951869726181 0.000204409618163481 -4.58814611192793e-05 -1.29986779029423e-06 
0.163419336080551 0.000173995242221281 -4.80008748127148e-05 -3.7786671214235e-07 
0.164544016122818 0.000125192134873942 -4.88791993120685e-05 3.76595835405169e-06 
0.165454015135765 7.35246721887961e-05 -5.08367338625249e-05 1.76117589489877e-06 
0.165881335735321 1.95879547391087e-05 -5.2751103794435e-05 -1.40184101837804e-06 
0.165966436266899 -4.30282234447077e-05 -5.17306398251094e-05 -3.85368730349001e-06 
0.165635034441948 -0.000100870332971681 -5.20161083841231e-05 -8.84187284100335e-06 
0.164867803454399 -0.000148296618135646 -4.90698912471998e-05 -1.44046098284889e-05 
0.163625851273537 -0.000190633843885735 -4.41952324763406e-05 -1.55034340423299e-05 
0.162043765187263 -0.000235021492699161 -3.68794535461348e-05 -1.66604531841585e-05 
0.159916490316391 -0.00026422188966535 -2.95397676381981e-05 -1.84549553523539e-05 
0.157496556639671 -0.000293421384412795 -2.17077704292024e-05 -1.73114731296664e-05 
0.154754817485809 -0.000321148108923808 -1.90029859368224e-05 -1.65558576554758e-05 
0.151652798056602 -0.000338962650857866 -1.52629672811599e-05 -1.71669653354911e-05 
0.148189336061478 -0.000354496849467978 -1.36591124828556e-05 -1.65581022883998e-05 
0.144214510917664 -0.000371028756489977 -1.01789937616559e-05 -1.51251333591063e-05 
0.139839544892311 -0.000384682381991297 -5.96981089984183e-06 -1.3856086297892e-05 
0.135135024785995 -0.000403970305342227 8.83088546288491e-07 -1.26108034237404e-05 
0.13016277551651 -0.000429945212090388 6.46305352347554e-06 -1.0602098882373e-05 
0.125045105814934 -0.000459864735603333 1.11099434434436e-05 -9.61696332524298e-06 
0.120073303580284 -0.000499050074722618 1.25920287246117e-05 -8.84807468537474e-06 
0.114962756633759 -0.000536619918420911 1.40894271680736e-05 -8.57544455357129e-06 
0.109820902347565 -0.000571473734453321 1.6278425391647e-05 -8.4000066635781e-06 
0.1045241355896 -0.000602366286329925 1.87545319931814e-05 -8.24899689177983e-06 
0.0990879684686661 -0.000629528309218585 2.22548169404035e-05 -7.89723526395392e-06 
0.093361459672451 -0.00064214423764497 2.66752213065047e-05 -7.62073432269972e-06 
0.0874829515814781 -0.000654142291750759 3.09916867990978e-05 -6.6963443714485e-06 
0.0814884454011917 -0.000657565891742706 3.44632207998075e-05 -6.08056598139228e-06 
0.0756415650248528 -0.00065965234534815 3.83302503905725e-05 -5.24793313161354e-06 
0.0699905306100845 -0.000651780166663229 4.19553944084328e-05 -4.69504993816372e-06 
0.0648664236068726 -0.000651262060273439 4.47898200945929e-05 -3.59508339897729e-06 
0.0602931752800941 -0.00064499513246119 4.66029669041745e-05 -3.66983863386849e-06 
0.0562577322125435 -0.000636024691630155 4.83611329400446e-05 -2.69818087872409e-06 
0.052679143846035 -0.000621785584371537 4.82123614347074e-05 -2.55623785960779e-06 
0.0496177040040493 -0.000614648626651615 4.61083436675835e-05 -2.79595246865938e-06 
0.0468462444841862 -0.000600824016146362 4.42941091023386e-05 -3.46262891071092e-06 
0.044430747628212 -0.000590350071433932 4.32522647315636e-05 -3.26912527270906e-06 
0.0423381105065346 -0.000581442785914987 4.23259698436595e-05 -3.42824387189467e-06 
0.0405548736453056 -0.000579184154048562 4.20006217609625e-05 -3.24370284943143e-06 
0.0389340221881866 -0.000574907578993589 4.26898914156482e-05 -2.87672946797102e-06 
0.0374303162097931 -0.000568459450732917 4.28004677814897e-05 -2.39399082602176e-06 
0.0359578318893909 -0.000559787382371724 4.20426549680997e-05 -1.86015847702947e-06 
0.0344798155128956 -0.000551480974536389 4.05257451348007e-05 -1.00638442290801e-06 
0.0329291820526123 -0.000536788487806916 3.87986219720915e-05 -6.7412315729598e-07 
0.0313978604972363 -0.000518963905051351 3.70357047358993e-05 -2.89350026605462e-07 
0.0299010537564754 -0.000503232120536268 3.65103514923248e-05 3.90987423770639e-07 
0.0284175593405962 -0.000486920936964452 3.60942103725392e-05 7.50625872569799e-07 
0.0269446764141321 -0.000470321334432811 3.60550329787657e-05 6.68948302973149e-07 
0.0255325324833393 -0.00045682696509175 3.54244439222384e-05 8.49592765916896e-07 
0.0241473875939846 -0.000442490621935576 3.48271423717961e-05 1.07875575849903e-06 
0.0228488761931658 -0.000428838160587475 3.30109724018257e-05 1.20754646104615e-06 
0.0216391794383526 -0.000414694746723399 3.10579744109418e-05 1.35657580813131e-06 
0.0205826610326767 -0.000400844786781818 2.88903120235773e-05 1.32089121507306e-06 
0.0196325480937958 -0.000385585939511657 2.71818662440637e-05 1.40263909997884e-06 
0.0188177190721035 -0.000373990274965763 2.54118440352613e-05 1.35991274419212e-06 
0.0181339085102081 -0.000362939783371985 2.4023613150348e-05 1.08262292997097e-06 
0.0175715610384941 -0.000354611169314012 2.33069331443403e-05 8.42173164983251e-07 
0.017119387164712 -0.000346728746080771 2.35358947975328e-05 1.00991576346132e-06 
0.0167623199522495 -0.000340341415721923 2.43760932789883e-05 9.8534906101122e-07 
0.0165146123617887 -0.000336043478455395 2.56780276686186e-05 9.73900682765816e-07 
0.0163407810032368 -0.000333020027028397 2.7587801014306e-05 1.01030309451744e-06 
0.0162276551127434 -0.000331222952809185 2.88680403173203e-05 8.99598262549262e-07 
0.0161122735589743 -0.000329608796164393 2.96682010230143e-05 6.81775588873279e-07 
0.0160122998058796 -0.000328199908835813 3.01764866890153e-05 5.37524442734139e-07 
0.0158489644527435 -0.00032140186522156 3.07869522657711e-05 4.68535091613376e-07 
0.0156270302832127 -0.000315362005494535 3.07548689306714e-05 4.31897859698438e-07 
0.0153181524947286 -0.000306201138300821 3.09158240270335e-05 6.02434283791808e-07 
0.0149278901517391 -0.000295456469757482 3.06372530758381e-05 5.41408269327803e-07 
0.0144313350319862 -0.000281382817775011 3.02378393826075e-05 5.38229812718782e-07 
0.0138777559623122 -0.000269675685558468 2.94909168587765e-05 5.48217883533653e-07 
0.0132767362520099 -0.000256992090726271 2.87235052383039e-05 4.05305343065265e-07 
0.0126456348225474 -0.00024409823527094 2.773039159365e-05 2.17321996842657e-07 
0.011996136046946 -0.000230790174100548 2.65657108684536e-05 1.25616296031694e-07 
0.0113845448940992 -0.000220423666178249 2.50710254476871e-05 9.21707599133015e-09 
0.0107987280935049 -0.000210450380109251 2.35896131925983e-05 -1.89912967130113e-07 
0.0102563323453069 -0.000201396775082685 2.20848723984091e-05 -1.89733654565316e-07 
0.00975761003792286 -0.000194098189240322 2.08690307772486e-05 -2.31568705544305e-07 
0.00933191273361444 -0.000188748846994713 2.01061957341153e-05 -1.65983934152791e-07 
0.00895077269524336 -0.000184202945092693 1.99094301933656e-05 1.22716121708777e-08 
0.00864084810018539 -0.000181702853296883 1.99432124645682e-05 1.63299219479995e-07 
0.00837022624909878 -0.000179733484401368 2.01865113922395e-05 3.16357045448967e-07 
0.00814609602093697 -0.000178841524757445 2.0239314835635e-05 3.13996139311712e-07 
0.00796061102300882 -0.000179586684680544 2.02916817215737e-05 3.84431501743165e-07 
0.00781450048089027 -0.000181007228093222 2.00811628019437e-05 4.01411000439111e-07 
0.00768695399165154 -0.000182422081707045 1.99037149286596e-05 5.35758886144322e-07 
0.00758278788998723 -0.000184068936505355 1.99579699255992e-05 5.51710513718717e-07 
0.00750413164496422 -0.000186136036063544 2.0287234292482e-05 6.00527243932447e-07 
0.00745678180828691 -0.000189563957974315 2.06344484467991e-05 6.05759453264909e-07 
0.00741767650470138 -0.000192810635780916 2.10835314646829e-05 6.14038583535148e-07 
0.00740381283685565 -0.000198229055968113 2.12401046155719e-05 5.72801297948899e-07 
0.00738455355167389 -0.000203428528038785 2.11776878131786e-05 5.80468054067751e-07 
0.00735631957650185 -0.000208407145692036 2.16040607483592e-05 6.49498304028384e-07 
0.00731549737975001 -0.000212373633985408 2.24537543545011e-05 6.1189285815999e-07 
0.0072587737813592 -0.000215153166209348 2.3451866582036e-05 4.08581655619855e-07 
0.00716583803296089 -0.000215964726521634 2.48059259320144e-05 3.63426480021189e-08 
0.00706723844632506 -0.000217380351386964 2.63816800725181e-05 -3.88103870818668e-07 
0.00693243136629462 -0.000217478591366671 2.74990925390739e-05 -6.24707297447458e-07 
0.00676287012174726 -0.000217228895053267 2.8326983738225e-05 -6.87134161125869e-07 
0.00659328233450651 -0.000219904992263764 2.89519994112197e-05 -6.43407702227705e-07 
0.00641029747202992 -0.000221680413233116 2.9528029699577e-05 -3.51561567413228e-07 
0.00620472757145762 -0.000223184761125594 3.00224237435032e-05 -7.11883387793932e-08 
0.00601723790168762 -0.000226302887313068 3.02491571346764e-05 6.97539874749964e-08 
0.00580480322241783 -0.00022929250553716 3.00920801237226e-05 1.55857122763337e-07 
0.00554773258045316 -0.000229481680435129 2.96061552944593e-05 2.29146039032457e-07 
0.0052570584230125 -0.000229653000133112 2.88675273623085e-05 4.0271390844282e-07 
0.00493167713284492 -0.000227863871259615 2.76679365924792e-05 5.49559160845092e-07 
0.00457961950451136 -0.000223227078095078 2.59997468674555e-05 6.40319512967835e-07 
0.00422332482412457 -0.000215546402614564 2.39616474573268e-05 8.50424214604573e-07 
0.00385824590921402 -0.000206302618607879 2.17847409658134e-05 1.03227341696766e-06 
0.00348736345767975 -0.000193397412658669 1.92593415704323e-05 1.12188524781232e-06 
0.00311496458016336 -0.000177759371581487 1.63928580150241e-05 1.18447962904611e-06 
0.00271252263337374 -0.000159416376845911 1.35048421725514e-05 1.1600681091295e-06 
0.00232289312407374 -0.000139866460813209 1.08276171886246e-05 1.11036968064582e-06 
0.00194820808246732 -0.000118617695989087 8.23177015263354e-06 1.0539490631345e-06 
0.00160832318942994 -9.97518072836101e-05 5.84288727623061e-06 8.03165846718912e-07 
0.00129053846467286 -8.11869103927165e-05 3.91617595596472e-06 7.32013404558529e-07 
0.00103076733648777 -6.5243017161265e-05 2.57741407949652e-06 6.26424025540473e-07 
0.000799208879470825 -5.04484814882744e-05 1.53413225234544e-06 5.37608286776958e-07 
0.000612621253821999 -3.84932609449606e-05 8.52503887927014e-07 3.34108051447402e-07 
0.000471853622002527 -2.89098934445065e-05 3.75429266341598e-07 2.42047434539927e-07 
0.000362615304766223 -2.08902220037999e-05 1.14972003473213e-07 1.70708815971921e-07 
0.000292716576950625 -1.61600091814762e-05 -2.18198408674652e-07 1.52830040178742e-07 
0.000246682786382735 -1.33967514557298e-05 -1.73067832065499e-07 1.94214521798131e-07 
0.000207104734727181 -1.1946192898904e-05 -3.65934447188465e-08 2.07560503895365e-07 
0.000172546991962008 -9.57251995714614e-06 5.01218266890646e-07 2.69087337301244e-07 
0.000158604962052777 -8.73330827744212e-06 1.36811615902843e-06 2.78389478580721e-07 
0.000161421499797143 -7.56145982450107e-06 2.91034962174308e-06 3.98478363194954e-07 
0.000164992379723117 -5.51636821910506e-06 4.75482602269039e-06 1.22189774742765e-07 
0.000196334032807499 -3.75226568394282e-06 7.36094489184325e-06 1.9786457983173e-07 
0.000240511348238215 -2.67549398813571e-06 1.04765840660548e-05 7.73916397633911e-08 
0.00030334698385559 -1.4254085272114e-06 1.44004015965038e-05 -1.38752895395555e-07 
0.000360389734851196 -1.78144276219427e-07 1.84681230166461e-05 -2.29584514954695e-07 
0.000447674392489716 1.6474376707265e-06 2.36263513215818e-05 -6.99440306561883e-07 
0 0 0 0 
0 0 0 0 
0 0 0 0 
0 0 0 0 
0 0 0 0 
0 0 0 0 
0 0 0 0 
0 0 0 0 
0 0 0 0 
0 0 0 0 
0 0 0 0 
0 0 0 0 
0 0 0 0 
0 0 0 0 
99.1931762695313 0.736809015274048 0.0450424589216709 0.0116517599672079 
