0 0 0 0 
0 0 0 0 
0 0 0 0 
0 0 0 0 
0 0 0 0 
0 0 0 0 
0 0 0 0 
0 0 0 0 
0 0 0 0 
0 0 0 0 
0.00101536500733346 -1.66554855240975e-05 3.14378553412098e-06 1.19357719086111e-06 
0.00124953431077302 -2.02219362108735e-05 3.53184123014216e-06 1.32645141093235e-06 
0.00146657240111381 -2.29690267588012e-05 4.06286153520341e-06 1.65181631928135e-06 
0.00171424343716353 -2.43038903136039e-05 4.59294733445859e-06 2.01070020011684e-06 
0.00203925790265203 -2.27127693506191e-05 5.0292760533921e-06 2.3336433514487e-06 
0.00240354053676128 -1.88404483196791e-05 5.22677646586089e-06 2.59298599303293e-06 
0.00275216274894774 -1.35850114020286e-05 5.09538313053781e-06 2.62013463725452e-06 
0.00304729049094021 -7.86524651630316e-06 4.74789158033673e-06 2.4645717076055e-06 
0.00322749675251544 -3.26718873111531e-06 4.22818266088143e-06 2.15972818295995e-06 
0.00323765492066741 -8.84488997598964e-07 3.65579171557329e-06 1.84063173946925e-06 
0.00311337667517364 -3.57334272393928e-07 3.20554590871325e-06 1.55011684910278e-06 
0.00292561715468764 -7.47219814911659e-07 2.89810100184695e-06 1.40106567414477e-06 
0.00273361033760011 -1.5266397213054e-06 2.61884974861459e-06 1.36291532726318e-06 
0.00259008491411805 -1.94091626326554e-06 2.36787218454992e-06 1.32643776851182e-06 
0.00250966916792095 -2.55871145782294e-06 2.18435252463678e-06 1.30734906633734e-06 
0.00251874094828963 -2.91828155241092e-06 2.04922321245249e-06 1.29545082927507e-06 
0.00261594774201512 -3.2377374736825e-06 1.97174972527137e-06 1.28251633668697e-06 
0.00277801719494164 -3.43700571647787e-06 1.8845230442821e-06 1.25298834063869e-06 
0.00297435652464628 -3.80917276743276e-06 1.81760651685181e-06 1.2413639751685e-06 
0.00317721115425229 -4.08966434406466e-06 1.75509205746494e-06 1.22794745038846e-06 
0.00334789557382464 -4.43040744357859e-06 1.69354439094604e-06 1.21889570436906e-06 
0.00346053624525666 -4.72249485028442e-06 1.61132152243226e-06 1.19213382276939e-06 
0.00350804557092488 -5.02957300341222e-06 1.60680826866155e-06 1.23179199817969e-06 
0.00347829353995621 -5.41617100680014e-06 1.68826238677866e-06 1.32424850107782e-06 
0.00339547335170209 -5.6022117860266e-06 1.77803758560913e-06 1.45394369610585e-06 
0.00331522990018129 -5.55830274606706e-06 1.81408586286125e-06 1.55497707510222e-06 
0.00329270213842392 -5.53304334971472e-06 1.83880274562398e-06 1.59025637458399e-06 
0.00338778365403414 -5.67969482290209e-06 1.78526931904344e-06 1.57968884195725e-06 
0.00367632228881121 -5.63285311727668e-06 1.62279525284248e-06 1.50119615227595e-06 
0.00424828333780169 -5.55274073121836e-06 1.42684632464807e-06 1.37273821110284e-06 
0.0052066002972424 -5.80570213060128e-06 1.24376344956545e-06 1.34264530515793e-06 
0.00670033693313599 -6.05906825512648e-06 1.05105027614627e-06 1.45086471547984e-06 
0.00895352195948362 -6.61391732137417e-06 9.5429004431935e-07 1.67146583862632e-06 
0.0122153162956238 -7.04513331584167e-06 8.77492766448995e-07 1.94122480934311e-06 
0.0167281087487936 -8.92723801371176e-06 7.51032189327816e-07 2.44131979343365e-06 
0.0226480476558208 -1.1478391570563e-05 5.42234090517013e-07 3.00586134471814e-06 
0.0299426037818193 -1.36757844302338e-05 1.70395068721518e-07 3.71692067346885e-06 
0.0383477099239826 -1.59536430146545e-05 -1.38681201633517e-07 4.29241390520474e-06 
0.0475311204791069 -1.77102356246905e-05 -4.76741803367986e-07 4.94971027364954e-06 
0.0569947212934494 -1.70233324752189e-05 -1.42035537464835e-06 5.20722187502543e-06 
0.0661780461668968 -1.77511574293021e-05 -1.92985430658155e-06 5.23883181813289e-06 
0.0747015848755836 -1.81144314410631e-05 -2.88801561509899e-06 5.10154268340557e-06 
0.0824355408549309 -1.7135935195256e-05 -3.98917154598166e-06 5.19263039677753e-06 
0.0893662422895432 -1.86084780580131e-05 -4.7762227950443e-06 4.89371086587198e-06 
0.0953094139695168 -2.20859074033797e-05 -4.7502371671726e-06 4.62990692540188e-06 
0.100373670458794 -2.36109881370794e-05 -5.05941306983004e-06 4.8328015509469e-06 
0.104740455746651 -2.66019178525312e-05 -4.68821917820605e-06 4.64425602331175e-06 
0.108487576246262 -2.85567330138292e-05 -4.38538290836732e-06 4.35309721069643e-06 
0.111477360129356 -2.94323326670565e-05 -4.5217511797091e-06 4.19194111600518e-06 
0.114156223833561 -2.83976733044256e-05 -4.84563997815712e-06 4.12269719163305e-06 
0.116514421999454 -2.69838565145619e-05 -5.60822491024737e-06 3.77158994524507e-06 
0.118607580661774 -2.18327786569716e-05 -5.78371918891207e-06 3.95152574128588e-06 
0.120419174432755 -2.01401908270782e-05 -5.65449818168418e-06 3.6919011563441e-06 
0.122030779719353 -1.36237458718824e-05 -6.03755097472458e-06 3.25716791849118e-06 
0.123314596712589 -7.64344713388709e-06 -6.29986379863112e-06 3.17417539008602e-06 
0.124349743127823 -2.75887282441545e-06 -6.23118057774263e-06 2.75189427156874e-06 
0.125066593289375 -2.68588587459817e-06 -6.65696370560909e-06 1.50908977047948e-06 
0.125510215759277 -2.70521991296846e-06 -6.6778984546545e-06 6.82186453104805e-07 
0.125801101326942 -6.09438029641751e-06 -6.31327384326141e-06 6.32896558272478e-07 
0.126021683216095 -7.4245581345167e-06 -6.07425727139344e-06 -1.90446783676634e-07 
0.126262158155441 -9.91709475783864e-06 -6.43771954855765e-06 -8.18632884147519e-07 
0.126554265618324 -8.00981433712877e-06 -7.01540602676687e-06 -9.44572718708514e-07 
0.126943022012711 -6.33144827588694e-06 -7.9345209087478e-06 -1.31457591123763e-06 
0.127318739891052 -5.24632150700199e-06 -8.3635331975529e-06 -1.51648555402062e-06 
0.127557978034019 -3.94970766137703e-06 -8.79106482898351e-06 -1.75081481756933e-06 
0.127765104174614 -2.09584959520726e-06 -8.48515173856867e-06 -1.62474589160411e-06 
0.127854138612747 -3.45520629707607e-06 -7.51961260903045e-06 -2.65038352154079e-06 
0.127742052078247 1.00135866887285e-06 -6.80985067447182e-06 -2.83546114587807e-06 
0.12754712998867 5.95506946865498e-07 -6.00171870246413e-06 -3.22738151226076e-06 
0.127409875392914 -3.96453560824739e-06 -4.75873639516067e-06 -2.64222171608708e-06 
0.127016440033913 -8.91570016392507e-06 -3.54814005731896e-06 -3.03661636280594e-06 
0.126653164625168 -1.28420115288463e-05 -3.10027621708286e-06 -1.83834674771788e-06 
0.126271620392799 -2.18764635064872e-05 -2.00927274818241e-06 -9.74089061855921e-07 
0.125898942351341 -2.26882293645758e-05 -1.82942471838032e-06 -3.77160176867619e-07 
0.125353395938873 -2.50270604738034e-05 -2.23520260078658e-06 -4.95098333885835e-07 
0.124887719750404 -2.10309844987933e-05 -2.5731217192515e-06 -6.07735671565024e-07 
0.124339014291763 -1.58301045303233e-05 -2.42988653553766e-06 -4.39704848531619e-07 
0.123784765601158 -1.11140934677678e-05 -3.19977630169888e-06 -6.23745904704265e-07 
0.123121052980423 -1.13668593257898e-05 -2.84380644188786e-06 -8.48551792387298e-07 
0.122424334287643 -1.06461993709672e-05 -2.21098434849409e-06 -1.57963791025395e-06 
0.121660158038139 -1.32510404000641e-05 -1.61704235779325e-06 -1.12078066649701e-06 
0.120817482471466 -1.84165983228013e-05 -1.35416121338494e-06 -1.35602829232084e-06 
0.119815744459629 -2.25363201025175e-05 -4.7606150133106e-07 -1.43292686516361e-06 
0.118740126490593 -2.39929559029406e-05 3.64539658903595e-07 -1.67151233654295e-06 
0.117567621171474 -2.53294238063972e-05 8.60452701090253e-07 -1.07616551758838e-06 
0.116442695260048 -2.9125963919796e-05 1.19934941267275e-06 -1.29994759845431e-06 
0.115307718515396 -3.14916542265564e-05 1.98660723071953e-06 -1.62617016030708e-06 
0.114351369440556 -2.98301711154636e-05 2.30489717978344e-06 -1.96846758626634e-06 
0.113554790616035 -3.04882141790586e-05 2.30338650908379e-06 -2.23627125706116e-06 
0.112969174981117 -2.68486164713977e-05 1.52415316279075e-06 -2.14510168916604e-06 
0.112516172230244 -2.25668882194441e-05 1.63733272984246e-06 -2.26079555432079e-06 
0.112077198922634 -1.63255463121459e-05 1.3873675470677e-06 -2.20259016714408e-06 
0.111670106649399 -1.46315069287084e-05 1.34630408865632e-06 -2.19701564674324e-06 
0.111045248806477 -1.16423461804516e-05 9.80812160378264e-07 -2.35121456171328e-06 
0.11020402610302 -1.02423937278218e-05 2.42193868871254e-06 -2.46370836975984e-06 
0.108991272747517 -7.08209972799523e-06 3.47194622918323e-06 -1.87698049103346e-06 
0.1076335683465 -5.82271241000853e-06 4.80354492538027e-06 -1.59796422849467e-06 
0.105900332331657 -7.41462008591043e-06 5.93863887843327e-06 -1.16206922484707e-06 
0.104033201932907 -9.0038474809262e-06 6.91973082211916e-06 -7.68246707139042e-07 
0.102133080363274 -1.1041464858863e-05 6.65608058625367e-06 -8.26761549888033e-07 
0.100102260708809 -1.60813651746139e-05 6.82591280565248e-06 -1.04575451587152e-06 
0.0980048477649689 -1.91045091924025e-05 6.98984649716294e-06 -6.78516528296313e-07 
0.0960875377058983 -2.14416231756331e-05 7.22525010132813e-06 -8.06476975867554e-07 
0.0942327752709389 -2.01728398678824e-05 7.98259588918881e-06 -7.40485290862125e-07 
0.0924669206142426 -1.97201552509796e-05 9.27532619243721e-06 -9.23853917811357e-07 
0.0909224227070808 -1.57210524776019e-05 9.25616768654436e-06 -9.89643126558803e-07 
0.0893897861242294 -1.28972196762334e-05 8.80283459991915e-06 -1.40572831242025e-06 
0.0879560858011246 -5.15249257659889e-06 8.99320639291545e-06 -1.64380378464557e-06 
0.0864253342151642 -1.4861982435832e-06 8.42685585666914e-06 -2.18011041397403e-06 
0.0847696140408516 4.85590044263517e-06 8.38113555801101e-06 -2.43293129642552e-06 
0.0830409079790115 1.35089030663949e-05 8.48795207275543e-06 -2.80612357528298e-06 
0.0811648964881897 1.71604096976807e-05 9.6602179837646e-06 -2.82319592770364e-06 
0.0790292024612427 1.81529358087573e-05 1.03630200101179e-05 -2.59246121459e-06 
0.0770219713449478 2.23800943786046e-05 1.11866102088243e-05 -1.72837690115557e-06 
0.0748418495059013 2.378192039032e-05 1.12507832454867e-05 -1.31087040244893e-06 
0.0725557431578636 2.10446323762881e-05 1.18058860607562e-05 -7.78930541400769e-07 
0.070347972214222 2.29815741477069e-05 1.16944775072625e-05 -5.61723879854981e-07 
0.0681045800447464 2.76080045296112e-05 1.1195885235793e-05 -1.44190352102669e-07 
0.0657273828983307 3.11478797812015e-05 1.12812949737418e-05 -1.80143828742985e-07 
0.0633090436458588 3.56461641786154e-05 1.11385706986766e-05 1.64435405736185e-07 
0.060912799090147 4.13404341088608e-05 1.0901271707553e-05 6.40389941963804e-07 
0.0584193803369999 4.83975964016281e-05 1.0720978025347e-05 1.28461169879301e-06 
0.0559439770877361 5.55270780751016e-05 1.01671257652924e-05 1.90370394648198e-06 
0.0534218847751617 6.44225438009016e-05 9.51428592088632e-06 2.34905860452272e-06 
0.0510806739330292 7.60827679187059e-05 8.71664178703213e-06 2.75866887022858e-06 
0.0487235151231289 8.96750643732958e-05 8.02698286861414e-06 3.0741327918804e-06 
0.0464349612593651 0.00010308909259038 6.94624441166525e-06 3.00111150863813e-06 
0.0440609343349934 0.000117217387014534 6.16191664448706e-06 2.61826517089503e-06 
0.0417412631213665 0.000130467669805512 5.10565996592049e-06 2.57891952060163e-06 
0.0393574424088001 0.00014164179447107 4.54453220299911e-06 2.72458964900579e-06 
0.036916121840477 0.000153987581143156 3.68338351108832e-06 2.66592314801528e-06 
0.0343788862228394 0.000166888072271831 2.76567743640044e-06 2.85682676803845e-06 
0.0318523347377777 0.000180437651579268 1.81435780177708e-06 2.99108160106698e-06 
0.0292726531624794 0.00019298930419609 8.97566962976271e-07 2.84986140286492e-06 
0.0267243925482035 0.000207553195650689 -1.73874667552809e-07 2.53057555710257e-06 
0.0242383405566216 0.00021904768073 -1.23781774163945e-06 2.09035965781368e-06 
0.0218834746629 0.000228694698307663 -2.52998347605171e-06 1.5949751741573e-06 
0.0196079276502132 0.000234813778661191 -3.65935557056218e-06 9.08478511973954e-07 
0.0174471326172352 0.000238149121287279 -4.79040045320289e-06 1.33479673536385e-07 
0.0153141533955932 0.000235228377277963 -5.75507920075324e-06 -8.25757808797789e-07 
0.0132663575932384 0.000227825250476599 -6.48336617814493e-06 -2.03400986720226e-06 
0.011278199031949 0.000213147810427472 -6.6259576669836e-06 -3.12037082039751e-06 
0.00940046086907387 0.000192902574781328 -6.31825741947978e-06 -4.02124760512379e-06 
0.00763254053890705 0.00016738215344958 -5.47050603927346e-06 -4.41436714027077e-06 
0.00602211756631732 0.000139628129545599 -4.29597093898337e-06 -4.39520681538852e-06 
0.00459619471803308 0.00011121372517664 -2.98696045319957e-06 -3.80412666345364e-06 
0.00339696416631341 8.5413790657185e-05 -1.79497897079273e-06 -2.96594794235716e-06 
0.00242383684962988 6.31097209407017e-05 -7.01531007507583e-07 -1.87696798548131e-06 
0.00167673046234995 4.55866938864347e-05 3.7132341645929e-08 -9.56103576754685e-07 
0.00112165021710098 3.23462118103635e-05 5.53497272903769e-07 -2.15701220440678e-07 
0.00071783026214689 2.23571314563742e-05 9.21065122838627e-07 4.03493714884462e-07 
0.000440274336142465 1.5674233509344e-05 1.15265322619962e-06 7.29444479929953e-07 
0.000251646153628826 1.12136567622656e-05 1.22154335713276e-06 8.58452381180541e-07 
0.000119916199764702 8.13071710581426e-06 1.26862244087533e-06 9.0767383653656e-07 
3.63026265404187e-05 5.9466847233125e-06 1.26467739391956e-06 9.93182197817077e-07 
-2.73784407909261e-05 4.41650763605139e-06 1.2389755283948e-06 9.86358713817026e-07 
-7.12440742063336e-05 3.43456235896156e-06 1.20449726637162e-06 1.01685998288303e-06 
-9.85189544735476e-05 2.79980940831592e-06 1.14404883788666e-06 9.91380034065514e-07 
-0.000119022908620536 2.2154110865813e-06 1.12497309601167e-06 1.0115965096702e-06 
-0.000133832785650156 1.95231700672593e-06 1.07362961898616e-06 9.86046416073805e-07 
-0.000142229560879059 1.59784281095199e-06 1.04734829164954e-06 1.00700333405257e-06 
0 0 0 0 
0 0 0 0 
0 0 0 0 
0 0 0 0 
0 0 0 0 
0 0 0 0 
0 0 0 0 
0 0 0 0 
0 0 0 0 
0 0 0 0 
0 0 0 0 
0 0 0 0 
0 0 0 0 
0 0 0 0 
99.8979949951172 0.0871723517775536 0.00671764742583036 0.00295320898294449 
