0 0 0 0 
0 0 0 0 
0 0 0 0 
0 0 0 0 
0 0 0 0 
0 0 0 0 
0 0 0 0 
0 0 0 0 
0 0 0 0 
0 0 0 0 
0.00209885486401618 -0.000178382644662634 2.06915265152929e-05 -4.09911990573164e-06 
0.00246730330400169 -0.000195551314391196 2.80195708910469e-05 -7.18159662937978e-06 
0.00280192447826266 -0.000202195413294248 3.74295013898518e-05 -1.04917244243552e-05 
0.00323465024121106 -0.000203564763069153 4.62580028397497e-05 -1.35211503220489e-05 
0.00385626847855747 -0.000192176492419094 5.39174689038191e-05 -1.58477178047178e-05 
0.00462145591154695 -0.000169235077919438 6.02658037678339e-05 -1.745244844642e-05 
0.00549753755331039 -0.000139467418193817 6.35457690805197e-05 -1.80423357960535e-05 
0.00640164501965046 -0.00010780492448248 6.32541268714704e-05 -1.78586760739563e-05 
0.00724712479859591 -7.60284019634128e-05 6.04963061050512e-05 -1.69734012160916e-05 
0.00784287508577108 -4.96366737934295e-05 5.66646667721216e-05 -1.60446415975457e-05 
0.00820084754377604 -3.01634390780237e-05 5.17672306159511e-05 -1.48673907460761e-05 
0.00837155897170305 -1.3627309272124e-05 4.72636056656484e-05 -1.38354635055293e-05 
0.00835657399147749 -1.42282999604504e-07 4.39667455793824e-05 -1.28865776787279e-05 
0.00819301698356867 1.0009919606091e-05 4.14650530728977e-05 -1.20857748697745e-05 
0.00797546654939651 1.73807802639203e-05 3.95189636037685e-05 -1.13468167910469e-05 
0.0077358060516417 2.28283843171084e-05 3.81904719688464e-05 -1.08313352029654e-05 
0.00750363245606422 2.69009269686649e-05 3.7229747249512e-05 -1.02583935586154e-05 
0.00727860722690821 2.98770082736155e-05 3.65080813935492e-05 -9.96310973278014e-06 
0.00707348063588142 3.24618449667469e-05 3.59104633389506e-05 -9.61946079769405e-06 
0.00686412863433361 3.47911700373515e-05 3.54145813616924e-05 -9.46939508139621e-06 
0.00664004869759083 3.66901767847594e-05 3.51810085703619e-05 -9.27180644794134e-06 
0.00640588020905852 3.80112978746183e-05 3.51194212271366e-05 -9.34362833504565e-06 
0.00618010433390737 3.98298216168769e-05 3.51585149473976e-05 -9.13983967620879e-06 
0.00596771249547601 4.10116808780003e-05 3.52478164131753e-05 -9.09425125428243e-06 
0.0057544675655663 4.21948388975579e-05 3.51675735146273e-05 -8.99463339010254e-06 
0.00553261628374457 4.31455191574059e-05 3.48654248227831e-05 -9.06847071746597e-06 
0.00533568765968084 4.43577155238017e-05 3.47164314007387e-05 -8.9404938989901e-06 
0.00519332569092512 4.5360629883362e-05 3.44667641911656e-05 -8.81967298482778e-06 
0.00510241324082017 4.64939002995379e-05 3.41561499226373e-05 -8.66518803377403e-06 
0.00507868314161897 4.75515917059965e-05 3.42866442224476e-05 -8.43993529997533e-06 
0.00516270287334919 4.96008651680313e-05 3.46477536368184e-05 -8.13111728348304e-06 
0.00531630218029022 5.16142536071129e-05 3.49242109223269e-05 -7.96669792180182e-06 
0.00551338540390134 5.37144514964893e-05 3.55165029759519e-05 -7.81411017669598e-06 
0.00578483752906322 5.6688288168516e-05 3.62764003511984e-05 -7.66292032494675e-06 
0.00613299570977688 5.96262361796107e-05 3.72913891624194e-05 -7.57919406169094e-06 
0.00653924280777574 6.2280407291837e-05 3.87815016438253e-05 -7.45147781344713e-06 
0.00698981061577797 6.47433989797719e-05 4.08472551498562e-05 -7.30664760340005e-06 
0.00749358721077442 6.73456670483574e-05 4.33117820648476e-05 -7.26467760614469e-06 
0.00798079743981361 6.86435669194907e-05 4.6276552893687e-05 -7.3768487709458e-06 
0.00844898354262114 6.98641742928885e-05 4.9116224545287e-05 -7.46390514905215e-06 
0.00887865666300058 7.01508033671416e-05 5.16741383762565e-05 -7.53131234887405e-06 
0.00928535312414169 7.04121921444312e-05 5.37729720235802e-05 -7.68335848988499e-06 
0.00962678622454405 7.02200122759677e-05 5.56825652893167e-05 -7.76844717620406e-06 
0.00997468642890453 7.08911684341729e-05 5.70996417081915e-05 -7.6730502769351e-06 
0.0103054130449891 7.1464259235654e-05 5.83996479690541e-05 -7.65732056606794e-06 
0.0106427138671279 7.29619132471271e-05 5.95315941609442e-05 -7.51821789890528e-06 
0.0109800891950727 7.42970150895417e-05 6.04419183218852e-05 -7.29688690626062e-06 
0.0113544799387455 7.5838906923309e-05 6.05681816523429e-05 -7.0202445385803e-06 
0.011733666062355 7.70365513744764e-05 6.03358312218916e-05 -6.78361675454653e-06 
0.0121385073289275 7.80615446274169e-05 6.00739804212935e-05 -6.44401279714657e-06 
0.0125719644129276 7.87689423304982e-05 5.99521554249804e-05 -6.2610210989078e-06 
0.0130295129492879 7.94637817307375e-05 6.00250168645289e-05 -6.06378898737603e-06 
0.0135346297174692 8.02294453023933e-05 6.02052205067594e-05 -5.8838950280915e-06 
0.014096837490797 8.06175303296186e-05 6.06266294198576e-05 -5.6427888921462e-06 
0.0147617291659117 8.15231323940679e-05 6.10586575930938e-05 -5.43060104973847e-06 
0.0155369192361832 8.20624845800921e-05 6.15674362052232e-05 -5.30296847500722e-06 
0.0164385307580233 8.19898559711874e-05 6.22975858277641e-05 -5.11215012011235e-06 
0.0174305960536003 8.03312359494157e-05 6.35335818515159e-05 -5.12420228915289e-06 
0.0185184311121702 7.83919094828889e-05 6.47220076643862e-05 -5.31195655639749e-06 
0.0196313671767712 7.44223798392341e-05 6.59430879750289e-05 -5.61416754862876e-06 
0.020695773884654 6.91442401148379e-05 6.72444148221985e-05 -5.81443055125419e-06 
0.0216224454343319 6.16817924310453e-05 6.76794661558233e-05 -6.34586376691004e-06 
0.0223613958805799 5.37831765541341e-05 6.67644126224332e-05 -6.71818179398542e-06 
0.0227747801691294 4.37361195508856e-05 6.54955947538838e-05 -7.10640824763686e-06 
0.0228591654449701 3.53308168996591e-05 6.40266807749867e-05 -7.40879431759822e-06 
0.022612513974309 2.8562893930939e-05 6.23077357886359e-05 -8.01650548964972e-06 
0.0220922213047743 2.56101520790253e-05 6.08125301369e-05 -8.482293196721e-06 
0.0213273726403713 2.54403021244798e-05 5.95477358729113e-05 -8.71400425239699e-06 
0.0204597003757954 2.82173241430428e-05 5.79848056077026e-05 -8.51488221087493e-06 
0.0195511654019356 3.17865960823838e-05 5.57957355340477e-05 -8.18390071799513e-06 
0.018697252497077 3.65032028639689e-05 5.31207151652779e-05 -7.06370929037803e-06 
0.0179230887442827 4.02245532313827e-05 5.0868300604634e-05 -5.93539652982145e-06 
0.0173257868736982 4.34741195931565e-05 4.93972402182408e-05 -5.0007311074296e-06 
0.01688820309937 4.75850138172973e-05 4.87060133309569e-05 -4.18347735831048e-06 
0.0166122503578663 5.17018561367877e-05 4.85983546241187e-05 -3.41293798555853e-06 
0.0164568293839693 5.56083396077156e-05 4.88251243950799e-05 -3.06245851788844e-06 
0.0164334438741207 6.01553329033777e-05 4.84826632600743e-05 -2.75291904472397e-06 
0.0164703875780106 6.41216247458942e-05 4.77510366181377e-05 -2.28997896556393e-06 
0.0165641009807587 6.67642671032809e-05 4.66693854832556e-05 -1.89199329270195e-06 
0.0167226903140545 6.90660526743159e-05 4.53832617495209e-05 -1.49698792029085e-06 
0.0169946141541004 7.13940389687195e-05 4.38413735537324e-05 -1.2520082464107e-06 
0.0174389015883207 7.40519462851807e-05 4.24471108999569e-05 -6.62963884678902e-07 
0.0182607639580965 8.07363030617125e-05 4.1429291741224e-05 7.62153717914771e-08 
0.0198223777115345 9.2987458629068e-05 4.00244425691199e-05 1.43422482778988e-06 
0.0228278543800116 0.000118051386380102 4.01394245272968e-05 3.78972208636696e-06 
0.0283746775239706 0.000159763992996886 4.30296968261246e-05 8.53968322189758e-06 
0.0374357402324677 0.000216136279050261 4.68987091153394e-05 1.55185462062946e-05 
0.0511452928185463 0.000280716310953721 5.42002962902188e-05 2.53237158176489e-05 
0.069809190928936 0.00033740748767741 6.09685739618726e-05 3.53019386238884e-05 
0.092671737074852 0.000365219835657626 6.36105687590316e-05 4.45216501248069e-05 
0.117827825248241 0.000345230539096519 6.46072512608953e-05 5.11331963934936e-05 
0.142880722880363 0.000277915591141209 6.35655305813998e-05 5.28560485690832e-05 
0.16498875617981 0.000153819230035879 6.47360648144968e-05 4.84275005874224e-05 
0.18286357820034 2.08393666980555e-05 6.41110091237351e-05 4.11466062359978e-05 
0.195822149515152 -0.000105399871245027 6.21715153101832e-05 3.45656117133331e-05 
0.203830033540726 -0.000218232788029127 5.81935164518654e-05 2.55932991422014e-05 
0.207847759127617 -0.00031024930649437 5.607577986666e-05 1.6808946384117e-05 
0.209315434098244 -0.000360440782969818 4.48110404249746e-05 1.10218998088385e-05 
0.208680182695389 -0.000392795511288568 3.2825511880219e-05 7.45610304875299e-06 
0.206453576683998 -0.000418173120124266 2.34903618547833e-05 2.05751985049574e-06 
0.203282132744789 -0.000428440369432792 1.16450046334649e-05 -1.34714935029479e-06 
0.199624598026276 -0.000417604489484802 -3.07480900119117e-06 1.01296322441158e-07 
0.195318818092346 -0.00041002340731211 -1.77551337401383e-05 -1.12612795533096e-07 
0.190943881869316 -0.000405065162340179 -3.33180287270807e-05 -1.37200129302073e-06 
0.186375066637993 -0.000392073590774089 -4.46201884187758e-05 -4.85149882933911e-07 
0.182004630565643 -0.000367596046999097 -5.34962200617883e-05 -1.46866682371183e-06 
0.17757211625576 -0.00034846446942538 -5.82190659770276e-05 -5.13280974701047e-06 
0.173236310482025 -0.000318007747409865 -5.85661546210758e-05 -9.06499462871579e-06 
0.168865174055099 -0.000278657476883382 -5.65189511689823e-05 -1.1822799933725e-05 
0.164407685399055 -0.000238534252275713 -5.82721404498443e-05 -1.65876463142922e-05 
0.159586161375046 -0.000196458888240159 -5.69719923078083e-05 -1.64657158165937e-05 
0.154608815908432 -0.000148514591273852 -5.78029321331996e-05 -1.78444024641067e-05 
0.149644523859024 -9.86318700597622e-05 -5.95250312471762e-05 -1.9195180357201e-05 
0.14426626265049 -4.75038614240475e-05 -5.68387731618714e-05 -1.98424950212939e-05 
0.139001190662384 8.67886592459399e-06 -5.21238944202196e-05 -2.10877533390885e-05 
0.133902356028557 6.34000098216347e-05 -4.80757807963528e-05 -2.40861518250313e-05 
0.128871187567711 0.000122548241051845 -4.41488846263383e-05 -2.4765631678747e-05 
0.123752653598785 0.00018761791579891 -4.31002808909398e-05 -2.27258660743246e-05 
0.118516519665718 0.000248173630097881 -4.47306265414227e-05 -2.19295598071767e-05 
0.113097302615643 0.000310087343677878 -4.59170478279702e-05 -1.96992932615103e-05 
0.107418306171894 0.000372128066373989 -4.64586046291515e-05 -1.97365134226857e-05 
0.101454421877861 0.000428030674811453 -4.3238622311037e-05 -2.02293740585446e-05 
0.0954208672046661 0.000480146438349038 -3.69167719327379e-05 -2.21661211980972e-05 
0.089414931833744 0.000535641273017973 -2.84440429823007e-05 -2.38572065427434e-05 
0.0834339261054993 0.000588450173381716 -2.09836562135024e-05 -2.510306876502e-05 
0.0774776414036751 0.00063985149608925 -1.43472152558388e-05 -2.45112460106611e-05 
0.0718703344464302 0.00069200259167701 -1.05905064629042e-05 -2.34380804613465e-05 
0.0664439797401428 0.000743398675695062 -5.54345206182916e-06 -2.12024569918867e-05 
0.0614077299833298 0.000788263394497335 -2.33348191613914e-06 -1.83866650331765e-05 
0.056725449860096 0.000827528070658445 -1.36085577651102e-06 -1.49955558299553e-05 
0.0524611324071884 0.000860032567288727 -3.73529451280774e-06 -1.03358588603442e-05 
0.0483208149671555 0.000880162930116057 -7.83514133217977e-06 -5.3929106798023e-06 
0.0442393831908703 0.000883830594830215 -1.33323710542754e-05 1.03863442291185e-07 
0.040211945772171 0.000872888194862753 -1.89708971447544e-05 5.66885273656226e-06 
0.0361894518136978 0.000843537505716085 -2.33710543398047e-05 1.04891150840558e-05 
0.0322306156158447 0.000797919637989253 -2.63713809545152e-05 1.40627180371666e-05 
0.0284217298030853 0.000739086302928627 -2.88818846456707e-05 1.66253048519138e-05 
0.0248593781143427 0.000670755340252072 -3.19607461278792e-05 1.81120012712199e-05 
0.0214439798146486 0.000593508593738079 -3.47952081938274e-05 1.83601459866622e-05 
0.0181939546018839 0.000512586673721671 -3.62910941476002e-05 1.77843685378321e-05 
0.015114014968276 0.00043049655505456 -3.59926634700969e-05 1.6682952264091e-05 
0.0122849801555276 0.000351328344549984 -3.39277466991916e-05 1.49990582940518e-05 
0.0097510265186429 0.000278944411547855 -3.05177163681947e-05 1.28232668430428e-05 
0.00753748184069991 0.00021486435434781 -2.5924860892701e-05 1.06451261672191e-05 
0.0057012690231204 0.000161401185323484 -2.10178986890242e-05 8.56831138662528e-06 
0.00424758438020945 0.000118518095405307 -1.6238267562585e-05 6.61038984617335e-06 
0.00307320593856275 8.47512419568375e-05 -1.164346394944e-05 4.93529432787909e-06 
0.00219443370588124 5.87300237384625e-05 -8.07665765023557e-06 3.32260742652579e-06 
0.00158148223999888 4.04136699216906e-05 -5.49142623640364e-06 2.30604337048135e-06 
0.00113244017120451 2.78617644653423e-05 -3.58148349732801e-06 1.31843739836768e-06 
0.000814258703030646 1.91077724593924e-05 -1.80259257831494e-06 5.41143833743263e-07 
0.000644026324152946 1.4507661035168e-05 -2.26988703388997e-07 -2.51932217310014e-08 
0.000525933457538486 1.29034051497001e-05 2.4346657028218e-06 -6.75432602292858e-07 
0.000469083490315825 1.33384301079786e-05 6.30674958301825e-06 -1.70113537478755e-06 
0.000499553745612502 1.59932442329591e-05 1.17265881272033e-05 -2.88718638330465e-06 
0.000562542874831706 2.13460025406675e-05 1.91688286577119e-05 -4.7503408495686e-06 
0.000684235710650682 2.93639677693136e-05 2.9004138923483e-05 -7.17063812771812e-06 
0.000832354184240103 3.95116476283874e-05 4.17514638684224e-05 -1.03041347756516e-05 
0.00102122081443667 5.21177134942263e-05 5.76196325710043e-05 -1.43383140311926e-05 
0.00122502027079463 6.6105778387282e-05 7.43669152143411e-05 -1.85668704943964e-05 
0.00144404615275562 8.13966180430725e-05 9.61176192504354e-05 -2.43501035583904e-05 
0 0 0 0 
0 0 0 0 
0 0 0 0 
0 0 0 0 
0 0 0 0 
0 0 0 0 
0 0 0 0 
0 0 0 0 
0 0 0 0 
0 0 0 0 
0 0 0 0 
0 0 0 0 
0 0 0 0 
0 0 0 0 
99.5413208007813 0.371566414833069 0.0587738379836082 0.0189503859728575 
