0 0 0 0 
0 0 0 0 
0 0 0 0 
0 0 0 0 
0 0 0 0 
0 0 0 0 
0 0 0 0 
0 0 0 0 
0 0 0 0 
0 0 0 0 
0.00143696484155953 -7.73171341279522e-05 -6.39780319033889e-06 -1.42223336752068e-06 
0.00159658130723983 -8.26611212687567e-05 -6.4990699684131e-06 -1.41208408876992e-06 
0.00171654298901558 -8.52014927659184e-05 -6.92750381858787e-06 -1.76453215772199e-06 
0.00188111187890172 -8.28898773761466e-05 -7.30954252503579e-06 -2.2224025997275e-06 
0.00210556876845658 -7.16916911187582e-05 -7.57412544771796e-06 -2.74860576610081e-06 
0.00239515653811395 -5.44209178769961e-05 -7.5311313594284e-06 -3.06877427647123e-06 
0.00267468765377998 -3.51683775079437e-05 -7.23065113561461e-06 -3.04644117932185e-06 
0.00291718356311321 -1.69263603311265e-05 -6.60580099065555e-06 -2.85712690129003e-06 
0.00305585307069123 -2.96276130029582e-06 -5.79489369556541e-06 -2.41016300606134e-06 
0.00304863066412508 2.84999669020181e-06 -5.0049607125402e-06 -1.87769819604e-06 
0.00289488164708018 2.80269500763097e-06 -4.42269856648636e-06 -1.54739234403678e-06 
0.00269888318143785 1.6361481129934e-06 -3.93454229197232e-06 -1.43233285143651e-06 
0.00250628590583801 7.52332027786906e-08 -3.5842215311277e-06 -1.42113390211307e-06 
0.002355927368626 -1.32221873627714e-06 -3.28684291162062e-06 -1.37158576762886e-06 
0.0022759516723454 -2.24192808673251e-06 -3.01249087897304e-06 -1.37904760322272e-06 
0.00228807656094432 -3.03238584820065e-06 -2.78404104392393e-06 -1.36944220230362e-06 
0.00238674134016037 -3.68700352737505e-06 -2.63643755715748e-06 -1.35822961055965e-06 
0.00254481448791921 -3.79326252186729e-06 -2.4343573841179e-06 -1.32940124331071e-06 
0.00273686530999839 -4.5679698814638e-06 -2.30037903747871e-06 -1.289624265155e-06 
0.00294104870408773 -5.11703410666087e-06 -2.19545881918748e-06 -1.23584766242857e-06 
0.00311432755552232 -5.31276555193472e-06 -2.08506435228628e-06 -1.1611805348366e-06 
0.00322575867176056 -6.04375918555888e-06 -1.95911411537963e-06 -1.1182465868842e-06 
0.00326239736750722 -6.89942180542857e-06 -1.98200268641813e-06 -1.07911080249323e-06 
0.00322817289270461 -7.40599216442206e-06 -2.10253347177058e-06 -1.18082596145541e-06 
0.00313834822736681 -7.19386252967524e-06 -2.39601286011748e-06 -1.2396301372064e-06 
0.00304248672910035 -7.29042994862539e-06 -2.59928629020578e-06 -1.4344828969115e-06 
0.00301888468675315 -7.17647890269291e-06 -2.67760719907528e-06 -1.48786705267412e-06 
0.00312652997672558 -6.72326632411568e-06 -2.54233373198076e-06 -1.49612094446638e-06 
0.00342389661818743 -6.34360276308144e-06 -2.21114555642998e-06 -1.42338330988423e-06 
0.00400292919948697 -5.95485789744998e-06 -1.67638529546821e-06 -1.34957781483536e-06 
0.00496468646451831 -5.86507258049096e-06 -1.09967106709519e-06 -1.29434954487806e-06 
0.00643441686406732 -5.64909259992419e-06 -5.12495660132117e-07 -1.38770815283351e-06 
0.00864172726869583 -6.39979907646193e-06 9.43170732625731e-08 -1.60014076300286e-06 
0.0118536418303847 -6.32385354037979e-06 7.03065268226055e-07 -1.80272752459132e-06 
0.0163097493350506 -9.32256170926848e-06 1.79832943558722e-06 -2.18166701415612e-06 
0.0221802517771721 -1.32615823531523e-05 2.83645022136625e-06 -2.43714748648927e-06 
0.0294470191001892 -1.73152002389543e-05 4.16100738220848e-06 -2.81708730653918e-06 
0.0378931276500225 -2.16268108488293e-05 5.29911085322965e-06 -3.05332423522486e-06 
0.0471667312085629 -2.82934397546342e-05 6.36016238786397e-06 -3.32641275235801e-06 
0.0567649863660336 -3.18609636451583e-05 7.64029118727194e-06 -3.22151254295022e-06 
0.0661378800868988 -4.12098379456438e-05 8.3326531239436e-06 -3.09023425870691e-06 
0.074862889945507 -5.35514955117833e-05 8.64998128236039e-06 -2.4589792246843e-06 
0.0827757865190506 -6.43702151137404e-05 8.87475380295655e-06 -2.31985973186966e-06 
0.089839443564415 -7.95728192315437e-05 8.84607379703084e-06 -2.10233156394679e-06 
0.0958762988448143 -9.94714064290747e-05 7.85246447776444e-06 -2.22204675992543e-06 
0.1009501516819 -0.00011177864507772 7.88873239798704e-06 -2.56148791777377e-06 
0.105279259383678 -0.00012161517952336 7.5408256634546e-06 -2.65535754806479e-06 
0.108939684927464 -0.000126741622807458 7.39848110242747e-06 -2.81123425338592e-06 
0.111830845475197 -0.00012310134479776 7.88820125308121e-06 -2.64971390606661e-06 
0.114384792745113 -0.000112361187348142 8.84509699972114e-06 -2.32135175792791e-06 
0.116646528244019 -9.87070889095776e-05 9.98158429865725e-06 -1.90256946552836e-06 
0.118671022355556 -7.80167029006407e-05 1.07685136754299e-05 -2.32124534704781e-06 
0.120385140180588 -6.52984672342427e-05 1.14420245154179e-05 -1.98401289708272e-06 
0.121938921511173 -4.5400629460346e-05 1.180790241051e-05 -1.70226758200442e-06 
0.12316170334816 -2.66138758888701e-05 1.20505255836179e-05 -2.0525508261926e-06 
0.124124966561794 -1.31385422719177e-05 1.16408955364022e-05 -1.83759675564943e-06 
0.124797895550728 -7.63935258873971e-06 1.1684802302625e-05 -4.35433406664743e-07 
0.125233918428421 -3.03815227198356e-06 1.13829864858417e-05 4.87830106976617e-07 
0.125509306788445 -6.92383127898211e-06 1.0989821930707e-05 8.6136350319066e-07 
0.125798031687737 -8.15989824332064e-06 1.01714676929987e-05 2.17285241888021e-06 
0.126139953732491 -1.11064000520855e-05 1.0155828022107e-05 3.32234367306228e-06 
0.126571208238602 -8.4506418716046e-06 9.66370134847239e-06 3.634203949332e-06 
0.127110719680786 -1.03208776636166e-05 9.51209040067624e-06 4.32016304330318e-06 
0.12767393887043 -1.12456154965912e-05 9.17061606742209e-06 4.67544714410906e-06 
0.128113210201263 -1.38270752358949e-05 8.6162335719564e-06 5.2044370022486e-06 
0.128494203090668 -1.91062790690921e-05 6.8098916017334e-06 5.34593800693983e-06 
0.128764420747757 -2.92315889964812e-05 5.29643693880644e-06 6.23344521955005e-06 
0.128866389393806 -2.88369410554878e-05 3.5342973205843e-06 6.47169008516357e-06 
0.128780111670494 -4.52888270956464e-05 2.04942716663936e-06 6.56539714327664e-06 
0.128698110580444 -6.98500662110746e-05 7.61022704409697e-07 5.24072765983874e-06 
0.128409296274185 -9.10641974769533e-05 4.79979540557451e-08 4.81162351206876e-06 
0.128075659275055 -0.000110280052467715 -2.8947184205208e-07 3.20836784339917e-06 
0.127690270543098 -0.000136555623612367 -4.77688047340052e-07 1.23146742225799e-06 
0.127443954348564 -0.000137613722472452 -2.97245435376681e-07 -2.17106133959533e-07 
0.127004727721214 -0.000139180701808073 9.67997593193104e-08 -5.3516868092629e-07 
0.126655057072639 -0.000126275161164813 -2.03797867470712e-08 -1.2138458487243e-06 
0.126193627715111 -0.000113411486381665 -5.07425170326314e-07 -1.91212416211783e-06 
0.125670954585075 -9.90992921288125e-05 -5.57990290417365e-07 -1.4875728311381e-06 
0.124923713505268 -9.9509852589108e-05 -1.21799905627995e-06 -1.11376209588343e-06 
0.124169789254665 -9.69151515164413e-05 -1.88627939223807e-06 -3.77830559727954e-07 
0.123274832963943 -0.000101670259027742 -2.23866800297401e-06 -1.02737011786758e-07 
0.122296191751957 -0.000112082147097681 -1.9974795577582e-06 3.42321548885138e-08 
0.121214739978313 -0.000117634357593488 -2.51011283580738e-06 9.67468452017783e-08 
0.120065249502659 -0.00011994566739304 -3.23391054735112e-06 4.80268873559453e-08 
0.118783481419086 -0.000120371783850715 -3.99907776227337e-06 -2.03095098072481e-07 
0.117563351988792 -0.000126660626847297 -4.67394875158789e-06 2.39673909163685e-07 
0.116403162479401 -0.000126159560750239 -5.42888574273093e-06 9.95686150417896e-07 
0.115449786186218 -0.000120306387543678 -6.26331302555627e-06 1.38495431656338e-06 
0.114658392965794 -0.000117194125778042 -6.64730714561301e-06 2.08985989047505e-06 
0.114132791757584 -0.000106150218925904 -6.19172760707443e-06 2.45946830546018e-06 
0.11371137201786 -9.71881454461254e-05 -6.64108574710554e-06 2.5242077299481e-06 
0.113284319639206 -8.62156884977594e-05 -7.16744216333609e-06 2.69951397058321e-06 
0.112835876643658 -8.38346750242636e-05 -7.16875956641161e-06 3.03987462757505e-06 
0.112178392708302 -7.92602731962688e-05 -7.40150699130027e-06 3.35149434249615e-06 
0.111233338713646 -8.07118922239169e-05 -8.79940944287227e-06 2.53391999649466e-06 
0.109929583966732 -7.63736316002905e-05 -9.29199904931011e-06 1.05195840660599e-06 
0.108418837189674 -7.75523294578306e-05 -1.05897397588706e-05 3.44032997645627e-07 
0.106466762721539 -8.61249573063105e-05 -1.15732564154314e-05 -4.44976166136257e-07 
0.104428149759769 -8.76313788467087e-05 -1.14851845864905e-05 -9.67016831054934e-07 
0.102349683642387 -8.85225381352939e-05 -1.06681554825627e-05 -8.17509942407924e-07 
0.100131370127201 -9.36740325414576e-05 -1.05073477243423e-05 -6.90030276473408e-07 
0.0979036390781403 -8.70959338499233e-05 -9.85096085059922e-06 -1.57284591750795e-06 
0.0959160551428795 -7.7192991739139e-05 -9.33431329031009e-06 -1.85557234999578e-06 
0.093969039618969 -6.04262968408875e-05 -1.00590850706794e-05 -2.88634123535303e-06 
0.0920940339565277 -4.40897529188078e-05 -1.09710545075359e-05 -2.9454627110681e-06 
0.0904479697346687 -1.8342358089285e-05 -1.10089504232747e-05 -2.44874217969482e-06 
0.088741734623909 3.75230411009397e-06 -1.05553572211647e-05 -1.65752817338216e-06 
0.0871072858572006 3.61582060577348e-05 -1.06387888081372e-05 -1.55826535319648e-06 
0.0852804854512215 5.77795326535124e-05 -9.95587197394343e-06 -5.04597437611665e-07 
0.0832852870225906 8.68826173245907e-05 -9.91664364846656e-06 -2.56964057143705e-07 
0.0812403634190559 0.0001232494978467 -9.73555233940715e-06 1.5828149457775e-08 
0.0789781361818314 0.000147919054143131 -9.93831690720981e-06 -2.962804614981e-07 
0.076381579041481 0.000167495614732616 -9.85904716799268e-06 -6.91882519276987e-07 
0.0739101395010948 0.000194330277736299 -9.81406265054829e-06 -1.68391864008299e-06 
0.0712766572833061 0.000214731131563894 -9.30307942326181e-06 -1.6810922716104e-06 
0.0684700757265091 0.000226011281483807 -8.66524896991905e-06 -2.6680108931032e-06 
0.0657554492354393 0.000246680050622672 -8.20474178908626e-06 -3.00818373943912e-06 
0.0630766078829765 0.00027853439678438 -7.0574624260189e-06 -3.31300793732225e-06 
0.0602811090648174 0.000309620285406709 -6.3663878790976e-06 -3.57021690433612e-06 
0.0574882477521896 0.000344798114383593 -4.95422000312828e-06 -4.26819133281242e-06 
0.0546767748892307 0.000380703335395083 -4.02491650675074e-06 -4.55579402114381e-06 
0.051841638982296 0.00042178388684988 -2.93633206638333e-06 -5.2264986152295e-06 
0.0490235835313797 0.000460817245766521 -1.78372499703983e-06 -6.25525990471942e-06 
0.0462088771164417 0.000503139570355415 -6.90724334617698e-07 -6.43285011392436e-06 
0.0435522086918354 0.000550173863302916 3.88316152566404e-08 -6.88259387970902e-06 
0.0409381724894047 0.000599482795223594 6.72210319407895e-07 -7.24278697816771e-06 
0.0384228490293026 0.000646817905362695 1.46847730775335e-06 -6.78037395118736e-06 
0.0359078347682953 0.000692651781719178 1.81698180767853e-06 -5.69306621400756e-06 
0.0335076935589314 0.00073234096635133 2.45748447014194e-06 -5.50431059309631e-06 
0.0311362408101559 0.00076353905024007 2.79896948995884e-06 -4.95613312523346e-06 
0.0288920029997826 0.000793859479017556 3.13896157422278e-06 -4.13745783589548e-06 
0.0266804564744234 0.000817597378045321 3.47003037859395e-06 -3.90065679312102e-06 
0.0246102251112461 0.000837001425679773 3.57277440343751e-06 -3.28435635310598e-06 
0.0225655939429998 0.000847645802423358 3.28779174196825e-06 -1.97283793568204e-06 
0.0206426344811916 0.000852942932397127 3.05799949273933e-06 -9.69094230640621e-07 
0.0187869742512703 0.000845562957692891 2.69233441940742e-06 4.96484972245526e-07 
0.017088545486331 0.000830560631584376 2.35868742493039e-06 2.39875544139068e-06 
0.0154092982411385 0.000798979424871504 1.83050292434928e-06 4.39261839346727e-06 
0.0138443969190121 0.000759261136408895 1.19968763101497e-06 6.47230308459257e-06 
0.0122395465150476 0.000703741272445768 2.58813116715828e-07 8.77725324244238e-06 
0.0106282839551568 0.000636881333775818 -9.32768784878135e-07 1.09823913589935e-05 
0.00897069834172726 0.000556207785848528 -2.20964034269855e-06 1.24505604617298e-05 
0.00739417923614383 0.000473610096378252 -3.43445753969718e-06 1.31655442601186e-05 
0.00585884228348732 0.000387380481697619 -4.36034815720632e-06 1.27528410303057e-05 
0.00448200851678848 0.000307010050164536 -5.02318152939552e-06 1.15072371045244e-05 
0.00328062055632472 0.000234751336392947 -5.29241970070871e-06 9.37488039198797e-06 
0.00231270678341389 0.000176607267349027 -5.34951186637045e-06 7.2158218245022e-06 
0.00153200887143612 0.000128772953758016 -5.29797398485243e-06 5.0090152399207e-06 
0.000956239877268672 9.34502531890757e-05 -5.10708105139202e-06 3.16177056447486e-06 
0.000545314396731555 6.83442412992008e-05 -4.83294570585713e-06 1.67867051459325e-06 
0.000259384687524289 4.95801905344706e-05 -4.48110858997097e-06 5.16142620199389e-07 
5.83010878472123e-05 3.65291052730754e-05 -4.22895027440973e-06 -1.82529504400009e-07 
-6.77613279549405e-05 2.77174440270755e-05 -3.90602781408234e-06 -6.06409003012232e-07 
-0.00015296769561246 2.11621845664922e-05 -3.66119593309122e-06 -8.91320951268426e-07 
-0.000209717458346859 1.63177119247848e-05 -3.43609008268686e-06 -1.06006643818546e-06 
-0.0002425036218483 1.35325308292522e-05 -3.21569586958503e-06 -1.09531083580805e-06 
-0.000254325015703216 1.10250948637258e-05 -3.03365368381492e-06 -1.11799840851745e-06 
-0.00026893406175077 9.26482152863173e-06 -2.90981688522152e-06 -1.10989401491679e-06 
-0.000275452359346673 8.10310393717373e-06 -2.8068789106328e-06 -1.07082962585991e-06 
-0.000284118403214961 6.96866663929541e-06 -2.75713091468788e-06 -9.65574372457922e-07 
-0.000283069908618927 6.85435816194513e-06 -2.71246744887321e-06 -9.30125281684013e-07 
0 0 0 0 
0 0 0 0 
0 0 0 0 
0 0 0 0 
0 0 0 0 
0 0 0 0 
0 0 0 0 
0 0 0 0 
0 0 0 0 
0 0 0 0 
0 0 0 0 
0 0 0 0 
0 0 0 0 
0 0 0 0 
99.6279602050781 0.352640330791473 0.00808864738792181 0.00469071185216308 
