0 0 0 0 
0 0 0 0 
0 0 0 0 
0 0 0 0 
0 0 0 0 
0 0 0 0 
0 0 0 0 
0 0 0 0 
0 0 0 0 
0 0 0 0 
0.00728418491780758 0.000423931691329926 -5.87625936532277e-06 2.62880148511613e-05 
0.0114184645935893 0.000656423973850906 -1.20510549095343e-05 3.22993364534341e-05 
0.0165905803442001 0.000925415835808963 -9.7735382951214e-06 3.53975665348116e-05 
0.0223725829273462 0.00119016773533076 -3.98225438402733e-06 3.830762943835e-05 
0.0305170863866806 0.00146497727837414 7.71672785049304e-06 3.97375406464562e-05 
0.0408736318349838 0.00170330831315368 3.15031866193749e-05 3.31377559632529e-05 
0.0523908026516438 0.0018434840021655 5.96800091443583e-05 2.02507126232376e-05 
0.0647607743740082 0.00185443239752203 8.10414494480938e-05 7.16302793080104e-06 
0.0773830711841583 0.00172364269383252 9.4379298388958e-05 -5.83172140977695e-06 
0.0886718779802322 0.00146446237340569 9.92900822893716e-05 -1.92651314137038e-05 
0.0982719510793686 0.00114190997555852 8.80854931892827e-05 -2.52537702181144e-05 
0.106750279664993 0.000837606727145612 6.84483675286174e-05 -2.54298101936001e-05 
0.113997139036655 0.000599099672399461 4.96041175210848e-05 -2.5409097361262e-05 
0.119856342673302 0.00043777862447314 3.31671108142473e-05 -2.54464848694624e-05 
0.124694533646107 0.00034312519710511 1.85277585842414e-05 -2.42893001995981e-05 
0.128754049539566 0.000291971169644967 7.41220856070868e-06 -2.24602954403963e-05 
0.13239948451519 0.000251969584496692 -4.46323554115224e-07 -2.08641613426153e-05 
0.135959729552269 0.000223945186007768 -7.02628221915802e-06 -1.93175092135789e-05 
0.13949066400528 0.000201767208636738 -1.22115616250085e-05 -1.76204157469328e-05 
0.142876207828522 0.000184657343197614 -1.5021317267383e-05 -1.67525540746283e-05 
0.146089181303978 0.000173080246895552 -1.79980888788123e-05 -1.66178924700944e-05 
0.149010345339775 0.000175328692421317 -2.04483221750706e-05 -1.58452894538641e-05 
0.151499301195145 0.000174270331626758 -2.13289058592636e-05 -1.55992274812888e-05 
0.153779402375221 0.000172407671925612 -2.28812750719953e-05 -1.33859102788847e-05 
0.155814543366432 0.000165563775226474 -2.6330140826758e-05 -8.65679066919256e-06 
0.157751128077507 0.000151090091094375 -3.1636835046811e-05 -1.93296159523015e-06 
0.159526988863945 0.000130310872918926 -3.5627275792649e-05 1.67317659816035e-06 
0.161309242248535 0.000111258166725747 -4.01639590563718e-05 4.40019130110159e-06 
0.162982910871506 8.81039450177923e-05 -4.51461746706627e-05 5.33514139533509e-06 
0.1644137352705 6.99584779795259e-05 -4.73406616947614e-05 3.3653584523563e-06 
0.165429010987282 4.58203976450022e-05 -4.57592104794458e-05 -6.41095596165542e-07 
0.1662767380476 1.41241698656813e-05 -4.66718338429928e-05 4.60626978338041e-07 
0.166639730334282 -2.16111384361284e-05 -4.70469967694953e-05 2.84970178654476e-06 
0.166611701250076 -6.15493045188487e-05 -4.55738409073092e-05 5.05911521031521e-06 
0.166161566972733 -0.00010231691703666 -4.49747094535269e-05 8.76863941812189e-06 
0.165317833423615 -0.000139078299980611 -4.33134046033956e-05 1.23313229778432e-05 
0.163955584168434 -0.000171979074366391 -3.91245303035248e-05 1.2413061085681e-05 
0.162207797169685 -0.000206259384867735 -3.27746020047925e-05 1.26032509797369e-05 
0.159927889704704 -0.000230738631216809 -2.64956979663111e-05 1.32342966026044e-05 
0.157366722822189 -0.0002583907044027 -2.02872670342913e-05 1.22633537102956e-05 
0.154453545808792 -0.00028203972033225 -1.72066283994354e-05 1.19988089863909e-05 
0.15126459300518 -0.000298634433420375 -1.33661151267006e-05 1.26484446809627e-05 
0.147763401269913 -0.000311460491502658 -1.12406578409718e-05 1.24302241601981e-05 
0.143812298774719 -0.00031705413130112 -7.97269967733882e-06 1.08976064439048e-05 
0.13955719769001 -0.000315914658131078 -3.8578650674026e-06 9.65045273915166e-06 
0.135010823607445 -0.000317989499308169 2.27278383135854e-06 8.23265054350486e-06 
0.130212187767029 -0.000320417224429548 7.223182819871e-06 6.23649611952715e-06 
0.125255703926086 -0.000324927648762241 1.07820960693061e-05 4.66944447907736e-06 
0.120415650308132 -0.000341648497851565 1.25008664326742e-05 3.91277444578009e-06 
0.115376658737659 -0.000358563469490036 1.34655356305302e-05 3.52415713678056e-06 
0.110263504087925 -0.000372221897123381 1.47515465869219e-05 3.11840312861023e-06 
0.104950971901417 -0.000387542910175398 1.57485774252564e-05 3.02908142657543e-06 
0.0994600430130959 -0.000403879676014185 1.74485521711176e-05 3.16762543661753e-06 
0.0936643108725548 -0.000411347689805552 1.97913705051178e-05 3.21942525260965e-06 
0.0876709446310997 -0.000420442054746673 2.26593620027415e-05 2.97481733468885e-06 
0.0815554186701775 -0.000426899176090956 2.50872508331668e-05 2.83843473880552e-06 
0.0755447745323181 -0.000433552748290822 2.84493416984333e-05 2.5198346520483e-06 
0.0697599574923515 -0.000434758665505797 3.19643804687075e-05 2.46294848693651e-06 
0.0644667372107506 -0.00044409793918021 3.54133808286861e-05 2.43093222707103e-06 
0.0597583763301373 -0.000450422667199746 3.82310136046726e-05 2.98122245112609e-06 
0.0556009709835052 -0.000455175788374618 4.07953448302578e-05 2.95872996503022e-06 
0.0519336648285389 -0.000453767424914986 4.15990834881086e-05 3.53187169821467e-06 
0.0487430766224861 -0.00045586604392156 4.11482651543338e-05 4.37947437603725e-06 
0.0458770468831062 -0.000450321153039113 4.07499755965546e-05 5.34816899744328e-06 
0.0433386377990246 -0.000444882578449324 4.06904655392282e-05 5.78903200221248e-06 
0.0411314181983471 -0.000439031631685793 4.0814502426656e-05 6.31801049166825e-06 
0.0392089076340199 -0.000438395945820957 4.16553157265298e-05 6.79951699567027e-06 
0.037472315132618 -0.000435755267972127 4.30711879744194e-05 6.63437594994321e-06 
0.0358795002102852 -0.000431379623478279 4.35623915109318e-05 6.25980601398624e-06 
0.0343462415039539 -0.000424580881372094 4.34703069913667e-05 5.73382840229897e-06 
0.0328264236450195 -0.000419485208112746 4.28624007327016e-05 4.94030564368586e-06 
0.0312623046338558 -0.000408356630941853 4.16610273532569e-05 4.29718966188375e-06 
0.0297492686659098 -0.000395499460864812 4.03060439566616e-05 3.79553443963232e-06 
0.0282346121966839 -0.000383451086236164 4.01529759983532e-05 2.95714016829152e-06 
0.0267358906567097 -0.000372643233276904 4.01181714551058e-05 2.45124056164059e-06 
0.0252324808388948 -0.000358871679054573 4.02508412662428e-05 2.16967509913957e-06 
0.0237944461405277 -0.000349694106262177 4.01892466470599e-05 1.82985309038486e-06 
0.0223931074142456 -0.000339933671057224 4.02117075282149e-05 1.48980439007573e-06 
0.0210879892110825 -0.000330822891555727 3.92621113860514e-05 1.47556079355127e-06 
0.0198932960629463 -0.000322486273944378 3.79513039661106e-05 1.43849149480957e-06 
0.018857829272747 -0.000315632583806291 3.6497411201708e-05 1.54681890762731e-06 
0.0179392211139202 -0.000307516485918313 3.4977805626113e-05 1.67136170148297e-06 
0.0171453449875116 -0.00030160989263095 3.33588614012115e-05 1.9598940070864e-06 
0.0164836887270212 -0.000296628830255941 3.20195249514654e-05 2.1948289941065e-06 
0.0159252192825079 -0.000291733129415661 3.14064745907672e-05 2.52895983976487e-06 
0.0154775762930512 -0.000288440729491413 3.1330382626038e-05 2.67043560597813e-06 
0.0151161681860685 -0.000284771696897224 3.20857907354366e-05 2.721373903114e-06 
0.0148400273174047 -0.000282879133010283 3.3199270546902e-05 2.76767582363391e-06 
0.0146532887592912 -0.000282578286714852 3.46500091836788e-05 2.811020522131e-06 
0.0145237650722265 -0.000284030160401016 3.58587312803138e-05 2.91993092105258e-06 
0.0144043555483222 -0.00028607650892809 3.68020519090351e-05 3.12695237880689e-06 
0.0142951840534806 -0.000288964103674516 3.7509853427764e-05 3.35314007315901e-06 
0.0141487149521708 -0.000288052542600781 3.82369034923613e-05 3.40953806698963e-06 
0.0139404945075512 -0.000286659895209596 3.85746607207693e-05 3.56064242623688e-06 
0.013676043599844 -0.000283434404991567 3.87467553082388e-05 3.47250556842482e-06 
0.0133319664746523 -0.000276231789030135 3.85643834306393e-05 3.4021365991066e-06 
0.012915151193738 -0.000267190800514072 3.80885576305445e-05 3.29228350892663e-06 
0.012442734092474 -0.000258210056927055 3.72001086361706e-05 3.31031446876295e-06 
0.0119203412905335 -0.000248122960329056 3.61606435035355e-05 3.31490332428075e-06 
0.0113669577986002 -0.000236472405958921 3.49091751559172e-05 3.22800838148396e-06 
0.0108038894832134 -0.000225265772314742 3.34129472321365e-05 3.17609215017001e-06 
0.0102621074765921 -0.000215702224522829 3.16767109325156e-05 3.15835131914355e-06 
0.00974313914775848 -0.000207033139304258 3.00284518743865e-05 3.10609198095335e-06 
0.00926318857818842 -0.000198663590708748 2.8449187084334e-05 2.99791736324551e-06 
0.0088262939825654 -0.000191535902558826 2.71230055659544e-05 3.02777334582061e-06 
0.00845323037356138 -0.000186887758900411 2.62403846136294e-05 2.99732096209482e-06 
0.00812767632305622 -0.00018213308067061 2.58484105870593e-05 2.87923012365354e-06 
0.00785942748188972 -0.000178566944669001 2.55330905929441e-05 2.80138033303956e-06 
0.00763894198462367 -0.000175927489181049 2.543270784372e-05 2.70498958343524e-06 
0.00745081668719649 -0.00017385657702107 2.51928522629896e-05 2.80113522421743e-06 
0.0073023708537221 -0.000171674473676831 2.50791908911197e-05 2.78018364952004e-06 
0.00718290545046329 -0.00017008520080708 2.48583110078471e-05 2.7471401153889e-06 
0.00709355808794498 -0.000168770158779807 2.46534909820184e-05 2.71385897576693e-06 
0.00702130608260632 -0.000167548860190436 2.47127245529555e-05 2.65607741312124e-06 
0.00697987666353583 -0.000166801153682172 2.51046294579282e-05 2.50384528044378e-06 
0.00696563301607966 -0.000166494966833852 2.54639671766199e-05 2.40595591094461e-06 
0.00696806842461228 -0.000166227153385989 2.57910942309536e-05 2.50572929871851e-06 
0.00697842799127102 -0.000167376929312013 2.59320313489297e-05 2.53726670962351e-06 
0.00699491333216429 -0.000167985243024305 2.56511902989587e-05 2.66298479800753e-06 
0.00701143825426698 -0.000169006394571625 2.53590769716538e-05 2.70573264060658e-06 
0.00701181683689356 -0.000168626283993945 2.49725744652096e-05 2.74092349172861e-06 
0.00699557224288583 -0.000167001751833595 2.47564075834816e-05 2.67684663413092e-06 
0.00698069063946605 -0.000164197641424835 2.46918843913591e-05 2.69993938672997e-06 
0.00695035001263022 -0.000160442374181002 2.51294441113714e-05 2.54785413744685e-06 
0.00690271100029349 -0.000155201982124709 2.51947712968104e-05 2.49528125095821e-06 
0.00683463690802455 -0.000150047984789126 2.51947931246832e-05 2.38657094087102e-06 
0.00676589505746961 -0.00014562149590347 2.50631510425592e-05 2.34447702496254e-06 
0.00667003868147731 -0.000140575648401864 2.52328190981643e-05 2.1374864900281e-06 
0.00656866561621428 -0.000136721471790224 2.51164765359135e-05 2.16002649722213e-06 
0.00644375802949071 -0.000134437548695132 2.53229027293855e-05 2.04201387532521e-06 
0.00630085496231914 -0.000133232286316343 2.55612521868898e-05 2.0901529751427e-06 
0.0061111650429666 -0.000132553599542007 2.58967484114692e-05 2.06192589757848e-06 
0.00586682511493564 -0.00013143070100341 2.59848220593994e-05 2.20443644138868e-06 
0.00557475490495563 -0.00013075431343168 2.60782417171868e-05 2.15093427868851e-06 
0.00523811858147383 -0.000128683735965751 2.57630981650436e-05 2.1413984541141e-06 
0.00486202305182815 -0.00012534846609924 2.49980093940394e-05 2.14091437555908e-06 
0.00446576764807105 -0.000122103243484162 2.38159227592405e-05 2.01895227291971e-06 
0.00404340028762817 -0.000117493749712594 2.22812323045218e-05 1.81101961516106e-06 
0.00360468262806535 -0.00011060744873248 2.02442643058021e-05 1.63504057582031e-06 
0.00315681681968272 -0.000102324127510656 1.79760663741035e-05 1.55193322370906e-06 
0.00270463852211833 -9.33943811105564e-05 1.56681217049481e-05 1.31037188566552e-06 
0.00226367800496519 -8.22212241473608e-05 1.30403186631156e-05 1.23468817037065e-06 
0.00186522793956101 -7.24223646102473e-05 1.04028431451297e-05 1.12183556666423e-06 
0.00149357470218092 -6.23098530923016e-05 7.81746712164022e-06 1.0106872423421e-06 
0.00118345615919679 -5.23639828315936e-05 5.62659943170729e-06 8.72325131240359e-07 
0.000927893619518727 -4.28827552241273e-05 3.80541018785152e-06 7.74269551584439e-07 
0.000716149224899709 -3.38341596943792e-05 2.50559628511837e-06 6.33395188742725e-07 
0.000555181701201946 -2.64765621977858e-05 1.6721276097087e-06 5.68312827908812e-07 
0.000432708795415238 -2.03309973585419e-05 1.15523084787128e-06 4.06410521236467e-07 
0.000342909974278882 -1.68089172802866e-05 6.38520987195079e-07 2.84403370187647e-07 
0.000274940161034465 -1.4004532204126e-05 4.33150887602096e-07 1.51517852486904e-07 
0.000224654620978981 -1.2213069567224e-05 4.5464025788533e-07 1.20786424417929e-07 
0.00019049683760386 -9.87310431810329e-06 8.44855151171942e-07 2.24160476847146e-08 
0.000179419803316705 -8.50472952151904e-06 1.77936362888431e-06 9.34202049052146e-08 
0.000170733634149656 -6.73332942824345e-06 3.55684460373595e-06 2.08240020782569e-08 
0.00017531773482915 -5.15849524163059e-06 5.93610684518353e-06 5.05785315851881e-08 
0.000204757554456592 -4.55610461358447e-06 9.19615558814257e-06 -8.46870094051155e-08 
0.000251318269874901 -4.05100900024991e-06 1.32542645587819e-05 -5.38624895796147e-08 
0.000304551795125008 -3.74911064682237e-06 1.83384890988236e-05 -8.3878340717547e-08 
0.000371489091776311 -3.55592442247143e-06 2.36304476857185e-05 -7.41490282507584e-08 
0.000443697557784617 -3.72040449292399e-06 3.05887733702548e-05 -6.95040025533444e-09 
0 0 0 0 
0 0 0 0 
0 0 0 0 
0 0 0 0 
0 0 0 0 
0 0 0 0 
0 0 0 0 
0 0 0 0 
0 0 0 0 
0 0 0 0 
0 0 0 0 
0 0 0 0 
0 0 0 0 
0 0 0 0 
99.361442565918 0.565839290618896 0.0411984845995903 0.0129514820873737 
