0 0 0 0 
0 0 0 0 
0 0 0 0 
0 0 0 0 
0 0 0 0 
0 0 0 0 
0 0 0 0 
0 0 0 0 
0 0 0 0 
0 0 0 0 
0.0157283265143633 0.000926059845369309 -8.45863760332577e-05 -7.14998759576702e-06 
0.0198906715959311 0.00111094850581139 -0.000101778350654058 -8.1547495938139e-06 
0.0249092727899551 0.00123624561820179 -0.000100892844784539 -6.60727528156713e-06 
0.0318436026573181 0.00128017319366336 -7.63888165238313e-05 -4.22944276579074e-06 
0.0427101030945778 0.00117974076420069 -1.06427914943197e-05 -4.23432908291943e-07 
0.0559235736727715 0.000976458715740591 7.886176899774e-05 2.60701153820264e-06 
0.0695980191230774 0.000719166127964854 0.000174908040207811 4.73590262117796e-06 
0.0829973593354225 0.000460868701338768 0.00026165007147938 4.9405043682782e-06 
0.0945132076740265 0.000264334201347083 0.000317339785397053 4.04295496991836e-06 
0.102339349687099 0.000179274284164421 0.000327911926433444 1.80755023393431e-06 
0.107970550656319 0.000151788728544489 0.000314662058372051 4.25472734377763e-07 
0.112999826669693 0.000153046406921931 0.000285675312625244 -1.32677939745918e-07 
0.117757245898247 0.000148121631355025 0.000251527759246528 5.32609760739433e-07 
0.12214158475399 0.000143392724567093 0.00021633155120071 9.84189682640135e-07 
0.126354396343231 0.000125583945191465 0.000181893061380833 2.28095427701192e-06 
0.13027149438858 0.000115156792162452 0.000146451886394061 3.45957573699707e-06 
0.134297221899033 0.000103318823676091 0.00011444634583313 4.28119074058486e-06 
0.138251543045044 8.85988847585395e-05 8.43083253130317e-05 4.36640857515158e-06 
0.142313793301582 7.26850630599074e-05 5.77954051550478e-05 3.14611156682076e-06 
0.146124601364136 6.40544312773272e-05 3.48719404428266e-05 1.67854705068748e-06 
0.149790555238724 5.07224176544696e-05 1.39389048854355e-05 -3.61958825578768e-07 
0.152868986129761 4.0470124076819e-05 -4.16856801166432e-06 -1.73471323705598e-06 
0.155510425567627 4.12235785915982e-05 -1.9900840925402e-05 -3.29059002979193e-06 
0.157695323228836 3.6820685636485e-05 -3.10697032546159e-05 -3.18446677738393e-06 
0.159584298729897 2.73026053037029e-05 -4.12660665460862e-05 -3.36075413542858e-06 
0.161349222064018 2.01720886252588e-05 -5.12018123117741e-05 -2.71032695309259e-06 
0.163124695420265 9.8406371762394e-06 -5.97855723754037e-05 -1.6738030126362e-06 
0.165014758706093 -3.49998367710214e-06 -6.59837969578803e-05 -1.22470069641167e-07 
0.166897222399712 -2.40441331698094e-05 -7.35818030079827e-05 1.03420734376414e-06 
0.16852168738842 -3.84028244297951e-05 -7.81493436079472e-05 2.9223890578578e-06 
0.169632822275162 -4.63540927739814e-05 -8.31245779409073e-05 4.85462123833713e-06 
0.17006154358387 -5.40705805178732e-05 -8.84286055224948e-05 6.04787828706321e-06 
0.16990239918232 -5.64843103347812e-05 -9.25172935239971e-05 7.23112725609099e-06 
0.169067606329918 -5.51275225006975e-05 -9.21245809877291e-05 8.02336126071168e-06 
0.167676165699959 -4.97178480145521e-05 -9.74863214651123e-05 8.5451838458539e-06 
0.16587495803833 -4.83561125292908e-05 -0.000101264100521803 7.29213479644386e-06 
0.163884311914444 -5.53568315808661e-05 -0.000100418590591289 6.19940601609414e-06 
0.161353453993797 -6.67311760480516e-05 -9.88431347650476e-05 4.67777590529295e-06 
0.15868304669857 -7.70371188991703e-05 -9.86909653875045e-05 2.9483478556358e-06 
0.15581701695919 -0.000102349127701018 -9.79542310233228e-05 1.33758021547692e-06 
0.152506351470947 -0.000119433789222967 -9.19256344786845e-05 6.02077363964781e-07 
0.148791715502739 -0.000129932974232361 -8.99291844689287e-05 -1.41418240673374e-06 
0.14490532875061 -0.000143794051837176 -8.40151260490529e-05 -1.94270660358598e-06 
0.140079468488693 -0.00015389415784739 -7.8055883932393e-05 -2.09398376682657e-06 
0.134885013103485 -0.000149845145642757 -6.72868191031739e-05 -2.36331538872037e-06 
0.129420593380928 -0.000155674773850478 -5.91467578487936e-05 -1.68312146797689e-06 
0.123829178512096 -0.000161496602231637 -4.73083855467848e-05 -1.04491482488811e-06 
0.118029892444611 -0.00017067143926397 -3.8909689465072e-05 -1.34243771299225e-06 
0.112494625151157 -0.000183162861503661 -3.14274620905053e-05 -1.41911209539103e-06 
0.106880411505699 -0.000203329545911402 -2.28824083023937e-05 -2.13666066883889e-06 
0.101307034492493 -0.000223450449993834 -1.58275088324444e-05 -3.5304519769852e-06 
0.095610186457634 -0.000237311964156106 -9.90090302366298e-06 -4.33748891737196e-06 
0.0897150412201881 -0.000239086846704595 -6.22421111984295e-06 -4.94177083965042e-06 
0.0837779194116592 -0.000241140223806724 -2.12314921554935e-06 -5.92420747125288e-06 
0.0776875466108322 -0.00023359849001281 6.25915618002182e-07 -6.12930716670235e-06 
0.0715519487857819 -0.000220287518459372 3.68617429558071e-06 -6.27586359769339e-06 
0.0655573680996895 -0.000206278273253702 4.28755629400257e-06 -6.06617277298938e-06 
0.0599190704524517 -0.000192115345271304 4.57581563750864e-06 -5.85039015277289e-06 
0.0547933354973793 -0.000173465537955053 4.81802362628514e-06 -5.17615944772842e-06 
0.0503108985722065 -0.000158142996951938 5.04894069308648e-06 -5.21730635227868e-06 
0.0464064963161945 -0.000143617377034388 3.59485443368612e-06 -5.16954378326773e-06 
0.0430693365633488 -0.000132880959426984 4.68157077193609e-06 -5.14503881277051e-06 
0.0401932969689369 -0.000124613987281919 4.99874477100093e-06 -5.23764219906298e-06 
0.0376537404954433 -0.000115829054266214 5.19271907251095e-06 -5.19903096574126e-06 
0.0354293063282967 -0.000107050720544066 4.82241330246325e-06 -5.076061370346e-06 
0.0335192382335663 -9.87895327853039e-05 5.71769760426832e-06 -4.96132361149648e-06 
0.0318117626011372 -8.86796260601841e-05 5.07879485667218e-06 -4.84858674099087e-06 
0.0303033459931612 -8.16287865745835e-05 5.81711856284528e-06 -4.77589492220432e-06 
0.0288982540369034 -7.22683835192584e-05 4.62864318251377e-06 -4.82743962493259e-06 
0.0275713764131069 -6.09221351624001e-05 4.10325810662471e-06 -4.77376897833892e-06 
0.0262534208595753 -5.01711947435979e-05 2.95727659249678e-06 -4.82275845570257e-06 
0.0249570738524199 -4.04019046982285e-05 1.89632737601642e-06 -4.83573148812866e-06 
0.0236794166266918 -2.88977062155027e-05 3.35385806238264e-07 -4.65452694697888e-06 
0.0224707368761301 -2.25928542931797e-05 1.45437454079911e-07 -4.46091553385486e-06 
0.0212703607976437 -1.72640247910749e-05 -1.31896354105265e-06 -4.59563807453378e-06 
0.0201189704239368 -1.24733969641966e-05 -1.62842434292543e-06 -4.42304099124158e-06 
0.0190153568983078 -7.56202780394233e-06 -1.99937107936421e-06 -4.35165156886796e-06 
0.0180008243769407 -2.34916296903975e-06 -2.08415463021083e-06 -4.36938398706843e-06 
0.0170520134270191 5.25026234754478e-06 -2.75346110356622e-06 -4.45009754912462e-06 
0.0162618309259415 1.16561377581093e-05 -2.94899996333697e-06 -4.46266130893491e-06 
0.0155891431495547 1.75237055373145e-05 -3.26806548400782e-06 -4.51887490271474e-06 
0.0150071615353227 2.45246337726712e-05 -4.55973122370779e-06 -4.46970307166339e-06 
0.0145274568349123 2.94831352221081e-05 -5.18402021043585e-06 -4.40746498497901e-06 
0.0141500467434525 3.49791007465683e-05 -6.15978979112697e-06 -4.41578322352143e-06 
0.0138344690203667 3.93796763091814e-05 -7.00679129295168e-06 -4.4347248149279e-06 
0.0136332605034113 4.39500036009122e-05 -8.24745256977621e-06 -4.42761484009679e-06 
0.0135366125032306 4.71044040750712e-05 -8.79291928868042e-06 -4.4753760448657e-06 
0.013539656996727 5.06878641317599e-05 -9.5643918029964e-06 -4.46756484961952e-06 
0.0136382691562176 5.24838287674356e-05 -9.7662541520549e-06 -4.46999320047325e-06 
0.0138069139793515 5.39938700967468e-05 -1.05026247183559e-05 -4.42185091742431e-06 
0.0140014933422208 5.71231576032005e-05 -1.13290634544683e-05 -4.51001096735126e-06 
0.0142078744247556 6.03565786150284e-05 -1.19600390462438e-05 -4.41406746176654e-06 
0.0144371408969164 6.29831192782149e-05 -1.25927554108785e-05 -4.4019411689078e-06 
0.0146214840933681 6.48295463179238e-05 -1.38047689688392e-05 -4.52813037554733e-06 
0.0147343808785081 6.82433892507106e-05 -1.43864399433369e-05 -4.47535512648756e-06 
0.0148406373336911 6.80787052260712e-05 -1.3773251339444e-05 -4.12967210650095e-06 
0.0149260256439447 6.89957305439748e-05 -1.29984418890672e-05 -4.1753551158763e-06 
0.0149189746007323 7.01823009876534e-05 -1.32142749862396e-05 -4.23098617829964e-06 
0.0148739777505398 7.17692964826711e-05 -1.29687341541285e-05 -4.02257728637778e-06 
0.0148544982075691 7.19992749509402e-05 -1.33561625261791e-05 -4.04361117034568e-06 
0.0147568378597498 7.51543993828818e-05 -1.38598061312223e-05 -4.28293333243346e-06 
0.0146664902567863 7.47989033698104e-05 -1.4024351912667e-05 -4.09572294302052e-06 
0.0146025279536843 7.55548171582632e-05 -1.37863107738667e-05 -4.11867858929327e-06 
0.0145954405888915 7.43830823921598e-05 -1.21812145152944e-05 -3.98018346459139e-06 
0.0145653700456023 7.42218035156839e-05 -1.12142024590867e-05 -3.99944156015408e-06 
0.0146158467978239 7.20207463018596e-05 -1.01309278761619e-05 -4.00180624637869e-06 
0.0146314976736903 6.99436423019506e-05 -9.0333478510729e-06 -4.01496390622924e-06 
0.0146842766553164 6.60785590298474e-05 -7.34484638087451e-06 -3.92422953154892e-06 
0.0147101581096649 6.19137426838279e-05 -6.15521685176645e-06 -4.09602944273502e-06 
0.0147278420627117 5.50920231034979e-05 -3.38663835464104e-06 -3.95061579183675e-06 
0.0146927554160357 4.75809938507155e-05 4.0943231027768e-08 -3.8916737139516e-06 
0.014618338085711 3.96268587792292e-05 3.36676407641789e-06 -3.86467536372948e-06 
0.0144588341936469 3.36121702275705e-05 6.17879686615197e-06 -3.65091932508221e-06 
0.01430210378021 2.48091928369831e-05 9.6350840976811e-06 -3.53517498297151e-06 
0.0140900174155831 1.75589066202519e-05 1.22398332678131e-05 -3.71368605556199e-06 
0.0138425687327981 8.40938264445867e-06 1.43773431773297e-05 -3.67390452993277e-06 
0.0136031340807676 -1.81861608439249e-07 1.65974161063787e-05 -3.72770091416896e-06 
0.0133415935561061 -1.19687128972146e-05 1.9847471776302e-05 -3.88787975680316e-06 
0.0130527140572667 -2.32760758080985e-05 2.36046926147537e-05 -3.57742192136357e-06 
0.0127508183941245 -3.69196895917412e-05 2.78544102911837e-05 -3.28724740938924e-06 
0.0124402325600386 -5.11677244503517e-05 3.19106220558751e-05 -2.94054689220502e-06 
0.0121073722839355 -6.81237725075334e-05 3.69623958249576e-05 -2.86729914478201e-06 
0.0118001447990537 -8.76952253747731e-05 4.3282921978971e-05 -2.35777224588674e-06 
0.0114119742065668 -0.000106708270322997 4.87518809677567e-05 -2.52525342148147e-06 
0.0110531579703093 -0.000126487022498623 5.52100536879152e-05 -2.44572584051639e-06 
0.0106670539826155 -0.000147819097037427 6.25196917098947e-05 -2.10587609217328e-06 
0.0102711273357272 -0.000167530030012131 6.86986313667148e-05 -1.69897077739734e-06 
0.00985232647508383 -0.000187383251613937 7.44955323170871e-05 -1.56124201566854e-06 
0.00946694985032082 -0.000208366807783023 7.96820895629935e-05 -1.39993335324107e-06 
0.00902855675667524 -0.00022606756829191 8.49818170536309e-05 -9.67704750109988e-07 
0.00860735215246677 -0.000240452063735574 8.96451165317558e-05 -7.92417949924129e-07 
0.00819413736462593 -0.000255124265095219 9.47057851590216e-05 -2.01672989419421e-07 
0.00774674629792571 -0.000265300332102925 9.84659127425402e-05 -2.23626930306864e-08 
0.00727244513109326 -0.000269544252660125 0.00010115477925865 2.63514010612198e-07 
0.00686971750110388 -0.000274994468782097 0.000103660218883306 1.36082007884397e-07 
0.00640482967719436 -0.000275504833552986 0.000103482620033901 -4.27592993901271e-07 
0.00591275794431567 -0.000270575372269377 0.000101840370916761 -1.15456680305215e-06 
0.00537138385698199 -0.000257539300946519 9.88572428468615e-05 -2.09781615012616e-06 
0.00480428710579872 -0.000243386879446916 9.58462551352568e-05 -3.3492615330033e-06 
0.00413436768576503 -0.000221066831727512 8.91526142368093e-05 -4.37850121670635e-06 
0.00347963767126203 -0.000196020628209226 8.27922267490067e-05 -5.46590354133514e-06 
0.00274105044081807 -0.000166311379871331 7.46474252082407e-05 -6.35255992165185e-06 
0.00204026093706489 -0.000139191804919392 6.58645876683295e-05 -6.77279967931099e-06 
0.00137416773941368 -0.000108285930764396 5.65976879443042e-05 -6.35399328530184e-06 
0.000813135469797999 -8.2240228948649e-05 4.80772432638332e-05 -6.03991020398098e-06 
0.000316057994496077 -5.71980854147114e-05 4.12295012210961e-05 -5.29320413988899e-06 
-2.71247099590255e-05 -3.77337128156796e-05 3.58528377546463e-05 -4.81644337924081e-06 
-0.000275382190011442 -2.11566857615253e-05 3.03959568555001e-05 -4.11005612477311e-06 
-0.00043797047692351 -1.09684551716782e-05 2.66367496806197e-05 -3.90067089028889e-06 
-0.00056559348013252 2.40960702058146e-07 2.44291877606884e-05 -3.2047130389401e-06 
-0.000617884332314134 6.3414022406505e-06 2.23155566345667e-05 -2.99085627375462e-06 
-0.000636066077277064 1.03110560303321e-05 2.00709473574534e-05 -2.83949725599086e-06 
-0.000642483588308096 1.15335878945189e-05 1.98093748622341e-05 -2.62823118646338e-06 
-0.000632319541182369 1.33966877911007e-05 1.79229409695836e-05 -2.41353609453654e-06 
-0.000594167911913246 1.35643877001712e-05 1.67998459801311e-05 -2.52142899626051e-06 
-0.000599737861193717 1.34229803734343e-05 1.51981503222487e-05 -2.21701975533506e-06 
-0.000603500520810485 1.44082305268967e-05 1.39119520099484e-05 -1.86061470230925e-06 
-0.000583548564463854 1.46088659676025e-05 1.31536180560943e-05 -1.91464323506807e-06 
-0.000571559765376151 1.57882714120205e-05 1.30114622152178e-05 -1.75592822415638e-06 
-0.000580770196393132 1.56713940668851e-05 1.22111305245198e-05 -1.72300292433647e-06 
-0.000546593975741416 1.72281579580158e-05 1.20311533464701e-05 -1.5868785112616e-06 
0 0 0 0 
0 0 0 0 
0 0 0 0 
0 0 0 0 
0 0 0 0 
0 0 0 0 
0 0 0 0 
0 0 0 0 
0 0 0 0 
0 0 0 0 
0 0 0 0 
0 0 0 0 
0 0 0 0 
0 0 0 0 
99.5580902099609 0.32487028837204 0.102175928652287 0.00513088796287775 
