0 0 0 0 
0 0 0 0 
0 0 0 0 
0 0 0 0 
0 0 0 0 
0 0 0 0 
0 0 0 0 
0 0 0 0 
0 0 0 0 
0 0 0 0 
0.000880724517628551 -2.79342771136726e-06 2.00870908884099e-06 -3.81332392862532e-06 
0.00112501240801066 -6.66287132844445e-06 3.73678631149232e-06 -5.2100581342529e-06 
0.00139731005765498 -1.08774511318188e-05 4.82568339066347e-06 -6.86170869812486e-06 
0.00169568147975951 -1.46467327795108e-05 5.71843565921881e-06 -8.28490829007933e-06 
0.00209480873309076 -1.84069795068353e-05 5.9068261180073e-06 -9.26073516893666e-06 
0.00256941607221961 -2.03052513825241e-05 5.55391761736246e-06 -9.8369428087608e-06 
0.0030659269541502 -1.95666034414899e-05 4.83566873299424e-06 -9.79837568593211e-06 
0.00356904207728803 -1.64581251738127e-05 3.45992020811536e-06 -8.6922573245829e-06 
0.00403754925355315 -1.10161790871643e-05 1.5878766816968e-06 -6.74138891554321e-06 
0.00437860190868378 -2.74813896794512e-06 -2.74988508408569e-07 -4.45326350018149e-06 
0.00458056479692459 5.61244451091625e-06 -2.14727924685576e-06 -1.84245823220408e-06 
0.00469623459503055 1.3176573702367e-05 -3.95939696318237e-06 6.62551371988229e-07 
0.0047453735023737 1.98274556169054e-05 -5.39988059244934e-06 2.61877926277521e-06 
0.00475437939167023 2.55689465120668e-05 -6.3875486375764e-06 3.99191276301281e-06 
0.0047883614897728 3.01922118524089e-05 -7.07501340002636e-06 4.89560579808312e-06 
0.00490978360176086 3.50833906850312e-05 -7.60596185500617e-06 5.64561423743726e-06 
0.00512831099331379 4.04955753765535e-05 -8.09424545877846e-06 6.3324523580377e-06 
0.00545084197074175 4.59389229945373e-05 -8.67311609908938e-06 6.9181601247692e-06 
0.00586559670045972 5.12958795297891e-05 -9.45407464314485e-06 7.58659598432132e-06 
0.00632404210045934 5.58886422368232e-05 -1.04932187241502e-05 8.33838566904888e-06 
0.00676915282383561 5.85938396397978e-05 -1.19378628369304e-05 9.10376274987357e-06 
0.00715649453923106 5.89102528465446e-05 -1.36577427838347e-05 9.9559601949295e-06 
0.00745171401649714 5.76716774958186e-05 -1.55909547174815e-05 1.08071935756016e-05 
0.00765216210857034 5.42655943718273e-05 -1.77665460796561e-05 1.18783045763848e-05 
0.00776427192613482 4.93872539664153e-05 -2.02443734451663e-05 1.32862933241995e-05 
0.00783070083707571 4.53987413493451e-05 -2.28349163080566e-05 1.49696579683223e-05 
0.00792956352233887 4.61567469756119e-05 -2.48168016696582e-05 1.64543343998957e-05 
0.00816463492810726 5.18660817760974e-05 -2.62607409240445e-05 1.80020197149133e-05 
0.00862428918480873 6.43238745396957e-05 -2.70681557594799e-05 1.94392923731357e-05 
0.00944764539599419 8.56807891977951e-05 -2.70851269306149e-05 2.07929788302863e-05 
0.0107882227748632 0.000116900868306402 -2.63222791545559e-05 2.20916408579797e-05 
0.0128270275890827 0.000155754110892303 -2.55897521128645e-05 2.42164933297317e-05 
0.0157286692410707 0.000203820600290783 -2.43078702624189e-05 2.6360899937572e-05 
0.0197266060858965 0.000262328394455835 -2.21145182877081e-05 2.86006616079248e-05 
0.0249856822192669 0.000328137452015653 -1.80412662302842e-05 3.01789605146041e-05 
0.0316183976829052 0.000398271804442629 -1.13778814920806e-05 3.05638241115957e-05 
0.0395749770104885 0.000469677004730329 -1.59506248564867e-06 2.8555303288158e-05 
0.0486714988946915 0.000535828934516758 1.06845818663714e-05 2.44394868786912e-05 
0.0584942363202572 0.000586121808737516 2.48552150878822e-05 1.80076658580219e-05 
0.0687027350068092 0.000619375437963754 3.80958699679468e-05 1.00595898402389e-05 
0.0788135975599289 0.000627765490207821 4.84850315842777e-05 1.64115476763982e-06 
0.0884925872087479 0.000610495801083744 5.44905997230671e-05 -5.5356740631396e-06 
0.0974772945046425 0.000572365359403193 5.41333902219776e-05 -1.26664417621214e-05 
0.105791836977005 0.000517835898790509 4.63819524156861e-05 -1.75687164301053e-05 
0.113184154033661 0.000450830324552953 3.47037967003416e-05 -2.0928135199938e-05 
0.119649164378643 0.000381095887860283 1.99015812540893e-05 -2.23299884964945e-05 
0.125297397375107 0.000314087665174156 5.77993068873184e-06 -2.35394436458591e-05 
0.130181849002838 0.000251004996243864 -6.84793440086651e-06 -2.31428821280133e-05 
0.134366035461426 0.000195544111193158 -1.6233570931945e-05 -2.21249174501281e-05 
0.137982770800591 0.000147692277096212 -2.38199263549177e-05 -2.10193229577271e-05 
0.141194745898247 0.000106900704849977 -2.92003223876236e-05 -1.99661462829681e-05 
0.143885031342506 7.39731112844311e-05 -3.48283392668236e-05 -1.94892108993372e-05 
0.146149694919586 4.67547906737309e-05 -3.82608741347212e-05 -1.82711119123269e-05 
0.147915154695511 2.00325430341763e-05 -4.06973485951312e-05 -1.84130512934644e-05 
0.149234399199486 6.81253993661812e-07 -4.29081192123704e-05 -1.82616076926934e-05 
0.150122836232185 -2.0725103240693e-05 -4.42829332314432e-05 -1.74115320987767e-05 
0.15077717602253 -3.4258388041053e-05 -4.47591373813339e-05 -1.62748674483737e-05 
0.151103004813194 -4.80755661556032e-05 -4.41573029092979e-05 -1.62862124852836e-05 
0.151282414793968 -4.94277883262839e-05 -4.38833994849119e-05 -1.4797602489125e-05 
0.151421874761581 -5.70855590922292e-05 -4.31150874646846e-05 -1.2722694009426e-05 
0.15143720805645 -5.46499795746058e-05 -4.216509842081e-05 -1.25163587654242e-05 
0.151332318782806 -6.48807836114429e-05 -4.03565682063345e-05 -1.12175384856528e-05 
0.151251554489136 -7.51331099309027e-05 -3.9838305383455e-05 -7.39261531634838e-06 
0.150999024510384 -9.20569364097901e-05 -3.70573907275684e-05 -4.8104352572409e-06 
0.150638431310654 -0.000100057382951491 -3.40535516443197e-05 -2.55041300079029e-06 
0.150252342224121 -0.000112118505057879 -3.18015590892173e-05 4.03034078999553e-07 
0.149885058403015 -0.000112166788312607 -2.91664928226965e-05 4.19808384322096e-06 
0.149264425039291 -0.000106425934063736 -2.6395166059956e-05 6.6076959228667e-06 
0.148493990302086 -0.000105349361547269 -2.56242510658922e-05 9.6297972049797e-06 
0.147587284445763 -0.000107400897832122 -2.29848028538981e-05 1.20925151350093e-05 
0.14647214114666 -0.000100255681900308 -1.86334928002907e-05 1.41561204145546e-05 
0.145003169775009 -0.000107617241155822 -1.63649092428386e-05 1.52181473822566e-05 
0.143555223941803 -0.000118329509859905 -1.39698140628752e-05 1.40133561217226e-05 
0.141961470246315 -0.000119252035801765 -1.11032795757637e-05 1.2628986951313e-05 
0.1402587890625 -0.000118355208542198 -7.46628393244464e-06 1.16428745968733e-05 
0.138340726494789 -0.000123799254652113 -5.34248329131515e-06 1.16274304673425e-05 
0.136350139975548 -0.000117165815026965 -2.3901600343379e-06 1.15693665065919e-05 
0.134148716926575 -0.000114266367745586 1.9546182556951e-06 1.37261586132809e-05 
0.131728038191795 -0.000110579894680995 7.74626641941722e-06 1.36012013172149e-05 
0.129086315631866 -0.000111654946522322 1.04555674624862e-05 1.43448460221407e-05 
0.126454293727875 -0.000114925780508202 1.53301662066951e-05 1.45328058351879e-05 
0.123615674674511 -0.000123344580060802 1.91165618161904e-05 1.47190921779838e-05 
0.120627142488956 -0.000128346815472469 2.15811105590547e-05 1.51541726154392e-05 
0.117669701576233 -0.000138198971399106 2.49212844209978e-05 1.65013316291152e-05 
0.114533506333828 -0.000142749107908458 2.76735190709587e-05 1.65405381267192e-05 
0.111354731023312 -0.000144138917676173 3.00477840937674e-05 1.64370921993395e-05 
0.108084127306938 -0.000143413373734802 3.35795884893741e-05 1.44997666211566e-05 
0.104894891381264 -0.000139720083097927 3.60863596142735e-05 1.20169415822602e-05 
0.101836338639259 -0.000139062176458538 3.63722538168076e-05 1.20671193144517e-05 
0.098883219063282 -0.000140106509206817 3.80465826310683e-05 1.26423419715138e-05 
0.0957832410931587 -0.000138355506351218 3.96129253203981e-05 1.24085299830767e-05 
0.0927354246377945 -0.000132278830278665 4.05521313950885e-05 1.31014567159582e-05 
0.0894938483834267 -0.000131023785797879 4.28018684033304e-05 1.24371326819528e-05 
0.0859837979078293 -0.000123415709822439 4.45295918325428e-05 1.0286052201991e-05 
0.0822221636772156 -0.000114166585262865 4.76729037472978e-05 7.52020014260779e-06 
0.0781638100743294 -0.000113362519186921 4.93116895086132e-05 5.06975084135775e-06 
0.0737433880567551 -0.000118135314551182 5.12584956595674e-05 3.16989576276683e-06 
0.0690817683935165 -0.000119165022624657 5.27712363691535e-05 2.13233897738974e-06 
0.0642184466123581 -0.000120802535093389 5.48817843082361e-05 1.28409942590224e-06 
0.0592862963676453 -0.000124333848361857 5.6430737458868e-05 8.09661742096068e-08 
0.0544107519090176 -0.000125740509247407 5.76809034100734e-05 -6.26041810392053e-07 
0.0497299246490002 -0.00012150700786151 5.84686640650034e-05 -1.79336427663657e-06 
0.0452686585485935 -0.000118017342174426 5.87817557970993e-05 -2.56885437011078e-06 
0.0411307662725449 -0.000115232600364834 5.84797926421743e-05 -3.31828118760313e-06 
0.0372951813042164 -0.000109838772914372 5.6744996982161e-05 -3.99909595216741e-06 
0.0338827781379223 -0.000100899997050874 5.51663652004208e-05 -4.57808891951572e-06 
0.0308588910847902 -9.33917908696458e-05 5.39382635906804e-05 -5.02267766933073e-06 
0.0281958300620317 -8.4162806160748e-05 5.24924798810389e-05 -5.62411150895059e-06 
0.025824174284935 -7.42590127629228e-05 5.06948490510695e-05 -6.25553320787731e-06 
0.0237568449229002 -6.6228058130946e-05 4.88767800561618e-05 -6.2476824496116e-06 
0.0219227485358715 -5.76047314098105e-05 4.75891029054765e-05 -6.72661099088145e-06 
0.0203103013336658 -5.04340459883679e-05 4.5845728891436e-05 -6.91232889948878e-06 
0.0189083870500326 -4.45383775513619e-05 4.40627482021227e-05 -6.91350714987493e-06 
0.0176403466612101 -3.83791084459517e-05 4.23494384449441e-05 -6.94628351993742e-06 
0.0165400095283985 -3.26044028042816e-05 4.06956023653038e-05 -7.07237495589652e-06 
0.0155736245214939 -2.88697028736351e-05 3.87356849387288e-05 -6.72911210131133e-06 
0.0147118493914604 -2.50225821218919e-05 3.69794215657748e-05 -6.40379630567622e-06 
0.0138996001332998 -2.12458544410765e-05 3.50111949956045e-05 -5.98494443693198e-06 
0.0131490770727396 -1.84805521712406e-05 3.34200994984712e-05 -5.66049538974767e-06 
0.0124226585030556 -1.62678115884773e-05 3.15828547172714e-05 -5.15188094141195e-06 
0.0117196394130588 -1.45869771586149e-05 2.98901286441833e-05 -4.72586361865979e-06 
0.0110397785902023 -1.33676012410433e-05 2.81348002317827e-05 -4.31770422437694e-06 
0.0103907343000174 -1.30077296489617e-05 2.64543032244546e-05 -4.01062743549119e-06 
0.00978308822959661 -1.28766150737647e-05 2.46486979449401e-05 -3.67055167771468e-06 
0.0092091104015708 -1.23218123917468e-05 2.30445602937834e-05 -3.47308423442882e-06 
0.00867033284157515 -1.16557484943769e-05 2.12278046092251e-05 -3.35707386511785e-06 
0.00817486643791199 -1.10429436972481e-05 1.96352775674313e-05 -3.25337032336392e-06 
0.00772385345771909 -9.20123238756787e-06 1.8095301129506e-05 -3.11288908960705e-06 
0.00731124589219689 -6.90612387188594e-06 1.65516958077205e-05 -2.73603495770658e-06 
0.00694295298308134 -4.30752834290615e-06 1.49037123264861e-05 -2.25546477850003e-06 
0.00660290895029902 -7.11657833107893e-07 1.33421317514149e-05 -1.63550907927856e-06 
0.00627728318795562 3.17474359690095e-06 1.15844777610619e-05 -7.98304199634003e-07 
0.0059462683275342 6.6606116888579e-06 9.67810410656966e-06 8.3097859260306e-08 
0.00562016945332289 1.06039169622818e-05 7.85199517849833e-06 9.33651904233557e-07 
0.00528014823794365 1.38440445880406e-05 5.85160478294711e-06 1.74184356183105e-06 
0.00492761237546802 1.63705062732333e-05 3.79272591999325e-06 2.52770314546069e-06 
0.00456925854086876 1.8498205463402e-05 1.85016358500434e-06 3.25167957271333e-06 
0.00419361470267177 2.01464317797218e-05 1.16463304777881e-07 3.91624644180411e-06 
0.0037903469055891 2.05944052140694e-05 -1.60364675139135e-06 4.55477356808842e-06 
0.00336111523211002 2.07543835131219e-05 -2.94006622425513e-06 5.04265381096047e-06 
0.00292857154272497 2.07508492167108e-05 -4.06655681217671e-06 5.33270531377639e-06 
0.00249456218443811 1.96029177459422e-05 -4.90898128191475e-06 5.42461521035875e-06 
0.00208908272907138 1.83206193469232e-05 -5.37996356797521e-06 5.37445475856657e-06 
0.001719462685287 1.63570784934564e-05 -5.46949013369158e-06 4.92329490953125e-06 
0.00140493852086365 1.42719491122989e-05 -5.1647052714543e-06 4.39114364780835e-06 
0.00113320047967136 1.16724640975008e-05 -4.43737326349947e-06 3.79269181394193e-06 
0.000906111556105316 9.35258776735282e-06 -3.63474032383237e-06 3.07684467770741e-06 
0.000725401740055531 7.43923783375067e-06 -2.89459194391384e-06 2.38760571846797e-06 
0.000580469670239836 5.81313634029357e-06 -2.14194233194576e-06 1.8792102309817e-06 
0.000464089447632432 4.57144096799311e-06 -1.64527421020466e-06 1.41202190206968e-06 
0.000380970072001219 3.87644286092836e-06 -1.31324043195491e-06 1.06303377833683e-06 
0.000321581115713343 3.42349630955141e-06 -1.23315089695097e-06 8.035606242629e-07 
0.000274272577371448 3.32327977048408e-06 -1.22070582619926e-06 5.36272864337661e-07 
0.000246654992224649 4.11674909628346e-06 -1.44069417729042e-06 2.14631242556607e-07 
0.000239980668993667 5.08395351062063e-06 -1.93991695596196e-06 -8.67129159587421e-08 
0.000249132950557396 6.78406831866596e-06 -2.76682976618758e-06 -4.43031439090191e-07 
0.000274919206276536 9.7499405455892e-06 -3.7177405829425e-06 -8.91557476734306e-07 
0.000322339474223554 1.32073355416651e-05 -5.09235223944415e-06 -1.36362018565706e-06 
0.000389504624763504 1.77373840415385e-05 -6.84215592627879e-06 -1.96931364371267e-06 
0.000459755479823798 2.27777582040289e-05 -8.54442168929381e-06 -2.58162685895513e-06 
0.000558183353859931 2.92806907964405e-05 -1.09615684777964e-05 -3.41894383382169e-06 
0 0 0 0 
0 0 0 0 
0 0 0 0 
0 0 0 0 
0 0 0 0 
0 0 0 0 
0 0 0 0 
0 0 0 0 
0 0 0 0 
0 0 0 0 
0 0 0 0 
0 0 0 0 
0 0 0 0 
0 0 0 0 
99.7317733764648 0.208315059542656 0.0369966328144073 0.0148653453215957 
