0 0 0 0 
0 0 0 0 
0 0 0 0 
0 0 0 0 
0 0 0 0 
0 0 0 0 
0 0 0 0 
0 0 0 0 
0 0 0 0 
0 0 0 0 
0.0121268462389708 0.000118233372631948 0.000728725921362638 1.74054603121476e-05 
0.015705693513155 0.000144648569403216 0.000840113440062851 1.71747724380111e-05 
0.0207748785614967 0.000200019567273557 0.000868308881763369 1.38768436954706e-05 
0.0278647299855947 0.000276154431048781 0.000838785490486771 9.67559662967687e-06 
0.0390027314424515 0.000392895133700222 0.000688962580170482 4.05193259211956e-06 
0.0523933693766594 0.000522472430020571 0.000473275053082034 -2.58035527167522e-07 
0.0662098452448845 0.000637573015410453 0.000241155343246646 -3.50437039742246e-06 
0.0794932469725609 0.000734216067939997 3.16128607664723e-05 -5.23726703249849e-06 
0.0908439606428146 0.000787247321568429 -0.000112429283035453 -5.11492589794216e-06 
0.098470613360405 0.000782758987043053 -0.000155631394591182 -3.47159789271245e-06 
0.104012124240398 0.000743705022614449 -0.000148932347656228 -2.68606868303323e-06 
0.109140083193779 0.000686758547089994 -0.000127655250253156 -2.63406263911747e-06 
0.114004783332348 0.000610693416092545 -0.000108510306745302 -3.29283329847385e-06 
0.118559792637825 0.000523873546626419 -9.11903043743223e-05 -3.76076445718354e-06 
0.123132593929768 0.000434108194895089 -7.82727802288719e-05 -5.16906948178075e-06 
0.127508834004402 0.000347856373991817 -6.06391113251448e-05 -7.51311699787038e-06 
0.13187637925148 0.000273085024673492 -4.33376953878906e-05 -9.25020140130073e-06 
0.136470660567284 0.00019465021614451 -2.6053108740598e-05 -9.98345967673231e-06 
0.140927940607071 0.000131112508825026 -9.92811601463472e-06 -1.02262310974766e-05 
0.14511476457119 7.52264313632622e-05 8.29612508823629e-06 -9.62498324952321e-06 
0.14910888671875 2.69498505076626e-05 1.82064268301474e-05 -7.69048619986279e-06 
0.152526035904884 -1.90445516636828e-05 2.95929366984637e-05 -6.23348023509607e-06 
0.155304104089737 -4.37808048445731e-05 4.25483704020735e-05 -5.33823049408966e-06 
0.157697662711143 -7.0269888965413e-05 4.78482324979268e-05 -5.0244325393578e-06 
0.15979665517807 -9.59915414568968e-05 4.78584443044383e-05 -4.97235987495515e-06 
0.161684095859528 -0.000125738355563954 5.26508993061725e-05 -5.41458121006144e-06 
0.163649827241898 -0.000155852190800942 6.07559704803862e-05 -7.2521415859228e-06 
0.16570095717907 -0.000186035817023367 6.68741704430431e-05 -8.46297916723415e-06 
0.167845413088799 -0.000206731667276472 6.7182831116952e-05 -9.48923116084188e-06 
0.169728875160217 -0.000221429538214579 7.06755090504885e-05 -1.06880806924892e-05 
0.171063050627708 -0.000230083460337482 7.89727928349748e-05 -1.13634278022801e-05 
0.171609744429588 -0.00023401748330798 8.13418228062801e-05 -1.09415050246753e-05 
0.171495541930199 -0.000232645674259402 8.21664289105684e-05 -1.17158788270899e-05 
0.170773431658745 -0.000232239210163243 8.17890613689087e-05 -1.14965814645984e-05 
0.169346958398819 -0.000232347272685729 9.04914049897343e-05 -1.15089233077015e-05 
0.167721658945084 -0.000235036030062474 8.61231528688222e-05 -1.09640604932792e-05 
0.165843486785889 -0.000235304090892896 7.45020224712789e-05 -1.06569796116673e-05 
0.163485541939735 -0.000233325030421838 6.05695204285439e-05 -9.80464210442733e-06 
0.160733461380005 -0.000231612051720731 5.23575981787872e-05 -9.00886789167998e-06 
0.157918885350227 -0.000236614243476652 2.74005233222852e-05 -7.3036480898736e-06 
0.154574871063232 -0.000229722150834277 9.57660722633591e-06 -4.6645163820358e-06 
0.150832816958427 -0.000224563962547109 -4.97476366945193e-06 7.24509845895227e-07 
0.146902233362198 -0.000213683422771282 -2.14536521525588e-05 5.54835969523992e-06 
0.142017126083374 -0.000200364680495113 -3.14895332849119e-05 1.0169048437092e-05 
0.136677175760269 -0.000171845764270984 -3.61170823452994e-05 1.39691728691105e-05 
0.131080955266953 -0.000148576305946335 -4.51223022537306e-05 1.56557507580146e-05 
0.12531790137291 -0.000118469979497604 -5.22861519129947e-05 1.63186905410839e-05 
0.119342990219593 -9.67309970292263e-05 -6.06008288741577e-05 1.76098437805194e-05 
0.113835230469704 -7.72685671108775e-05 -7.97892862465233e-05 1.78146437974647e-05 
0.108270540833473 -6.34546158835292e-05 -0.000100344121165108 1.8125587303075e-05 
0.102601915597916 -5.15814135724213e-05 -0.000119885102321859 1.87659661605721e-05 
0.0968842282891273 -4.51749401690904e-05 -0.00013868224050384 1.90171303984243e-05 
0.0908968597650528 -4.00262470066082e-05 -0.000146090329508297 1.86001634574495e-05 
0.0847191587090492 -3.43262254318688e-05 -0.000150294217746705 1.85479184438009e-05 
0.0784181728959084 -2.99890598398633e-05 -0.000150218838825822 1.83506890607532e-05 
0.0721090212464333 -2.46286272158613e-05 -0.000145165307912976 1.7543932699482e-05 
0.065940223634243 -1.95056873053545e-05 -0.000137056282255799 1.65255787578644e-05 
0.0601872727274895 -1.73415573954117e-05 -0.000130929445731454 1.59196333697764e-05 
0.0550051890313625 -1.46440752359922e-05 -0.000121402044896968 1.4759597434022e-05 
0.0504125691950321 -1.10943565232446e-05 -0.000113362671982031 1.39052308441023e-05 
0.0464746542274952 -1.09637103378191e-05 -0.000106513907667249 1.33727753564017e-05 
0.0430886372923851 -8.65324636833975e-06 -0.000102698497357778 1.28251504065702e-05 
0.0402059033513069 -6.11524728810764e-06 -0.000100761746580247 1.23823792819167e-05 
0.0376467481255531 -2.95400673167023e-06 -9.76739611360244e-05 1.1844611435663e-05 
0.0354143157601357 -1.05604453892738e-06 -9.40765094128437e-05 1.1604559404077e-05 
0.0334400646388531 2.48761011789611e-06 -8.91157542355359e-05 1.13267697088304e-05 
0.0317154750227928 3.52240022039041e-06 -8.43638481455855e-05 1.10065020635375e-05 
0.0301507152616978 6.70042481942801e-06 -7.96849926700816e-05 1.05138697108487e-05 
0.0286705438047647 5.40834753337549e-06 -7.08588195266202e-05 1.06045035863644e-05 
0.0272987931966782 5.86811893299455e-06 -6.41294100205414e-05 1.03470138128614e-05 
0.0259667374193668 4.77662661069189e-06 -5.88858092669398e-05 1.02311050795834e-05 
0.0246595591306686 4.42137616118998e-06 -5.12467559019569e-05 1.00046427178313e-05 
0.023380259051919 4.06371600547573e-06 -4.34616667916998e-05 9.7422453109175e-06 
0.0221978407353163 5.77199853069033e-06 -3.92714755435009e-05 9.15381588129094e-06 
0.0209785811603069 4.12188092013821e-06 -3.30842049152125e-05 9.14182874112157e-06 
0.0198173709213734 4.78774245493696e-06 -2.71065910055768e-05 8.78471473697573e-06 
0.0186897646635771 4.59269176644739e-06 -2.20009860640857e-05 8.77119600772858e-06 
0.0176732577383518 4.91050059281406e-06 -1.77568381332094e-05 8.85784265847178e-06 
0.0167310442775488 3.63565641237074e-06 -1.31690112539218e-05 9.17673969524913e-06 
0.0158986244350672 3.41883242072072e-06 -6.51539812679403e-06 9.19636750040809e-06 
0.0152192199602723 4.07328661822248e-06 -1.09473501197499e-06 9.31876456888858e-06 
0.0146699650213122 3.32061608787626e-06 4.60473074781476e-06 9.23829156818101e-06 
0.014183078892529 1.2319279676376e-06 1.06819552456727e-05 9.55679297476308e-06 
0.0138009563088417 1.35519155719521e-06 1.55457437358564e-05 9.56127769313753e-06 
0.0135674364864826 2.28523140322068e-06 1.76933463080786e-05 9.59338103712071e-06 
0.0133741619065404 1.99468649952905e-06 2.12896338780411e-05 9.70098608377157e-06 
0.0132665522396564 1.57360591401812e-06 2.40280769503443e-05 9.79970536718611e-06 
0.0132791381329298 2.33241394198558e-06 2.55577924690442e-05 9.51775928115239e-06 
0.0133611289784312 2.02865294340882e-06 2.76010669040261e-05 9.38311222853372e-06 
0.0135372634977102 1.97630083675904e-06 2.8424075935618e-05 9.26425400393782e-06 
0.013753273524344 1.77898050424119e-06 2.90470052277669e-05 9.20386082725599e-06 
0.0139900548383594 2.24397422243783e-06 2.90831540041836e-05 9.11888582777465e-06 
0.0142214074730873 2.2720712422597e-06 2.8904103601235e-05 9.20716956898104e-06 
0.0144418841227889 9.86664986157848e-07 2.78014049399644e-05 9.50079265749082e-06 
0.0145220821723342 5.82020014405771e-08 2.96599246212281e-05 9.55602263275068e-06 
0.0145767908543348 1.12428745069337e-06 2.89934469037689e-05 9.34360741666751e-06 
0.0145717216655612 2.86605518340366e-06 2.86213125946233e-05 9.31130580283934e-06 
0.0145105607807636 2.25631970351969e-06 2.8574897442013e-05 9.30310488911346e-06 
0.0143945282325149 3.7268978303473e-06 2.82611035800073e-05 9.14914289751323e-06 
0.0143123026937246 5.27555721419048e-06 2.41254401771585e-05 8.96845995157491e-06 
0.0142338434234262 5.52565188627341e-06 2.12286540772766e-05 8.99965834832983e-06 
0.0141743961721659 6.44665715299197e-06 1.80439164978452e-05 8.62837532622507e-06 
0.0141215454787016 9.02056126506068e-06 1.52823158714455e-05 8.20751029095845e-06 
0.01408501714468 1.05277240436408e-05 1.20208387670573e-05 7.77216428105021e-06 
0.0140986246988177 1.1686519428622e-05 9.39706842473242e-06 7.59978047426557e-06 
0.0140808681026101 1.23333793453639e-05 7.65625736676157e-06 7.53962331145885e-06 
0.0141193401068449 1.41551627166336e-05 3.71939268006827e-06 7.55783548811451e-06 
0.0141743933781981 1.44899322549463e-05 7.79028752617705e-08 7.24985875422135e-06 
0.01420833542943 1.8238315533381e-05 -4.38859569840133e-06 7.23282755643595e-06 
0.0142051419243217 2.15548679989297e-05 -8.9152545115212e-06 7.16423983249115e-06 
0.0142570482566953 2.70475684374105e-05 -1.72954260051483e-05 6.94403343004524e-06 
0.0141480742022395 3.05015801131958e-05 -2.16418538911967e-05 6.62154434394324e-06 
0.0140062822028995 3.65498126484454e-05 -2.73984478553757e-05 6.49153844278771e-06 
0.0139116253703833 4.10637512686662e-05 -3.39300568157341e-05 6.07680340181105e-06 
0.0137355951592326 4.55610861536115e-05 -4.00316530431155e-05 6.01459441895713e-06 
0.0134982084855437 4.89180492877495e-05 -4.52337553724647e-05 5.55159977011499e-06 
0.0132854077965021 5.30164797964972e-05 -5.33557613380253e-05 5.38022686669137e-06 
0.013056630268693 5.66771850571968e-05 -6.34859825368039e-05 4.93298603032599e-06 
0.0127923619002104 5.92644646530971e-05 -7.5866213592235e-05 4.54151677331538e-06 
0.0125194489955902 6.32958253845572e-05 -8.92106399987824e-05 3.62214018423401e-06 
0.0122492639347911 6.73860049573705e-05 -0.000104656559415162 3.17453691422998e-06 
0.0119778253138065 7.32256376068108e-05 -0.000120331700600218 2.37496988120256e-06 
0.0116600627079606 7.89438199717551e-05 -0.000136704213218763 1.9391943624214e-06 
0.0112692229449749 8.61484295455739e-05 -0.000152256965520792 1.3443501529764e-06 
0.0109630841761827 9.193379082717e-05 -0.000170800238265656 1.113997086577e-06 
0.0106500890105963 0.000100652068795171 -0.000187826095498167 3.09093451278386e-07 
0.0103385858237743 0.000107938649307471 -0.000207077711820602 -3.13568079945981e-07 
0.0100271953269839 0.00011529891344253 -0.000223189694224857 -9.0109028860752e-07 
0.0097632147371769 0.000119396754598711 -0.000238642955082469 -1.40330155318225e-06 
0.00944948568940163 0.000124011727166362 -0.000252567144343629 -1.78439711362444e-06 
0.00907116290181875 0.000126295286463574 -0.000262922490946949 -1.91852359421318e-06 
0.0086822435259819 0.000128147803479806 -0.000270830030785874 -2.24585119212861e-06 
0.00830375775694847 0.000131090680952184 -0.000279832456726581 -2.33654441217368e-06 
0.0078520504757762 0.0001320491428487 -0.000283288944046944 -2.33144237427041e-06 
0.00730897439643741 0.000131318360217847 -0.000281853106571361 -2.27725126933365e-06 
0.00675580278038979 0.000129174281028099 -0.000276314880466089 -1.94290782928874e-06 
0.0061190165579319 0.000125036836834624 -0.000264622096437961 -1.09226664335438e-06 
0.00540520530194044 0.000112382134830114 -0.000246257724938914 3.79247751425282e-07 
0.00467534037306905 0.000102424011856783 -0.000225341689656489 1.62677429216274e-06 
0.00393037730827928 9.05521374079399e-05 -0.000198074005311355 2.78966217592824e-06 
0.00312414159998298 7.72042913013138e-05 -0.000170442275702953 3.91752564610215e-06 
0.00232615019194782 6.53425231575966e-05 -0.00014152005314827 4.65253287984524e-06 
0.00152951083146036 5.90049567108508e-05 -0.000112955400254577 4.42730970462435e-06 
0.000799521862063557 5.02718612551689e-05 -8.49969583214261e-05 4.18385980083258e-06 
0.000225102878175676 4.61712406831793e-05 -6.55984986224212e-05 3.99502323489287e-06 
-0.000258112326264381 4.50122461188585e-05 -4.75149863632396e-05 3.64614197678748e-06 
-0.000618273625150323 4.19300486100838e-05 -3.36516641255002e-05 3.83540100301616e-06 
-0.00089612539159134 4.04113015974872e-05 -2.31406047532801e-05 3.51354037775309e-06 
-0.00104468013159931 4.09202111768536e-05 -1.53209512063768e-05 3.63966228178469e-06 
-0.00120064918883145 3.8897582271602e-05 -9.73412170424126e-06 3.41547388416075e-06 
-0.00129679997917265 3.49323308910243e-05 -5.84984036322567e-06 3.48389994542231e-06 
-0.00129533896688372 3.27127127093263e-05 -5.57966086489614e-06 2.87351622318965e-06 
-0.00124106125440449 3.06446600006893e-05 -4.61670742879505e-06 3.05150979329483e-06 
-0.00123422499746084 2.8025358915329e-05 -6.33779791314737e-06 2.93624566438666e-06 
-0.00119092152453959 2.60606575466227e-05 -4.3211980482738e-06 2.82975588561385e-06 
-0.00109941943082958 2.56421626545489e-05 -3.38388849741023e-06 2.36573305301135e-06 
-0.00106131052598357 2.32866277656285e-05 -2.89492987803897e-07 2.55638155977067e-06 
-0.0010053749429062 2.16627213376341e-05 -5.266645644042e-07 2.3207167032524e-06 
-0.000924310996197164 2.04225416382542e-05 9.12791264795487e-08 2.18736545321008e-06 
-0.000873165496159345 1.78681639226852e-05 -7.93981058677673e-09 2.37833137362031e-06 
-0.0007936698384583 1.71975589182694e-05 -2.85176497527573e-06 2.17866295315616e-06 
0 0 0 0 
0 0 0 0 
0 0 0 0 
0 0 0 0 
0 0 0 0 
0 0 0 0 
0 0 0 0 
0 0 0 0 
0 0 0 0 
0 0 0 0 
0 0 0 0 
0 0 0 0 
0 0 0 0 
0 0 0 0 
99.4990005493164 0.248161017894745 0.225025475025177 0.0114415949210525 
