0 0 0 0 
0 0 0 0 
0 0 0 0 
0 0 0 0 
0 0 0 0 
0 0 0 0 
0 0 0 0 
0 0 0 0 
0 0 0 0 
0 0 0 0 
0.00100139167625457 -1.59345145220868e-05 3.00829356092436e-06 2.38900474869297e-06 
0.00122532981913537 -1.90603259397903e-05 3.49859828929766e-06 2.53660641647002e-06 
0.00143926276359707 -2.1851865312783e-05 3.98491374653531e-06 2.85268583866127e-06 
0.0016781446756795 -2.32689362746896e-05 4.53639404440764e-06 3.22833511745557e-06 
0.0019968687556684 -2.18458917515818e-05 4.98569761475665e-06 3.55159500031732e-06 
0.00235501094721258 -1.83510073838988e-05 5.20643652635044e-06 3.73462057723373e-06 
0.00268624187447131 -1.33978192025097e-05 5.13457280248986e-06 3.63022854799055e-06 
0.0029783311765641 -7.99887675384525e-06 4.81736424262635e-06 3.36091329700139e-06 
0.00315745593979955 -3.58235547537333e-06 4.30412319474271e-06 2.93888615487958e-06 
0.00317157502286136 -1.29174850371783e-06 3.72643125956529e-06 2.48309152084403e-06 
0.0030443943105638 -7.3117706733683e-07 3.27438033309591e-06 2.12167128665897e-06 
0.00286655547097325 -1.0724269259299e-06 2.92552886094199e-06 1.94290191757318e-06 
0.00268004299141467 -1.68917711107497e-06 2.63370702668908e-06 1.82785515789874e-06 
0.00253900373354554 -2.12770942198404e-06 2.35796892411599e-06 1.71724070696655e-06 
0.00246227905154228 -2.74263697974675e-06 2.14541796594858e-06 1.67381756455143e-06 
0.0024751634337008 -3.19579089591571e-06 1.97142026081565e-06 1.65983897204569e-06 
0.00256979884579778 -3.6364697280078e-06 1.86027500603814e-06 1.63570950917347e-06 
0.00272964732721448 -3.90807645089808e-06 1.76318815192644e-06 1.59682167577557e-06 
0.00292572355829179 -4.32425895269262e-06 1.73037221884442e-06 1.60056299591815e-06 
0.0031286075245589 -4.64473851025105e-06 1.68158248925465e-06 1.57503859554708e-06 
0.00330472784116864 -4.79568325317814e-06 1.61699540512927e-06 1.55072768848186e-06 
0.00342074688524008 -4.9111345106212e-06 1.54815643327311e-06 1.53168377892143e-06 
0.00347173004411161 -5.14282100994023e-06 1.52518168761162e-06 1.5848429484322e-06 
0.00344664184376597 -5.09585333929863e-06 1.549556941427e-06 1.64837001648266e-06 
0.00335885118693113 -5.14494286107947e-06 1.57242470777419e-06 1.79565483904298e-06 
0.00326359528116882 -5.33014372194884e-06 1.61735454184964e-06 1.93210803445254e-06 
0.00324295181781054 -5.4268443818728e-06 1.6086212326627e-06 1.98744714907662e-06 
0.00334306131117046 -5.48960269952659e-06 1.5537513036179e-06 1.9469619019219e-06 
0.00363184651359916 -5.56317854716326e-06 1.39071096327825e-06 1.84207476650045e-06 
0.00420727208256721 -5.48850584891625e-06 1.21320090329391e-06 1.63037736911065e-06 
0.00517761474475265 -5.55969427296077e-06 9.87871203506074e-07 1.48820879530831e-06 
0.00666529126465321 -5.8158739193459e-06 7.81840867603023e-07 1.4553802429873e-06 
0.00890996214002371 -6.26691689831205e-06 6.45075374450244e-07 1.52133520714415e-06 
0.0121688395738602 -6.8200229179638e-06 5.14517694227834e-07 1.69457416632213e-06 
0.0166855603456497 -8.47896171762841e-06 3.22772876870658e-07 2.07766947823984e-06 
0.022608358412981 -1.02910917121335e-05 -5.22554399751129e-09 2.55828354056575e-06 
0.0299078710377216 -1.18709840535303e-05 -4.66852071667745e-07 3.19004584525828e-06 
0.0383332706987858 -1.32225995912449e-05 -9.18765692858869e-07 3.81870358978631e-06 
0.0475373677909374 -1.40520860441029e-05 -1.4247780200094e-06 4.57136320619611e-06 
0.0569974407553673 -1.33693538373336e-05 -2.35652123592445e-06 4.91184027850977e-06 
0.0662022978067398 -1.35790551212267e-05 -2.79258620139444e-06 5.21768970429548e-06 
0.0747426003217697 -1.33862640723237e-05 -3.55657221007277e-06 5.42396855962579e-06 
0.0824645757675171 -1.21348666652921e-05 -4.52548556495458e-06 5.78432400288875e-06 
0.0893852338194847 -1.32643090182682e-05 -5.13306486027432e-06 5.60590478926315e-06 
0.0953469201922417 -1.59878964041127e-05 -5.12971064381418e-06 5.65863410884049e-06 
0.100406177341938 -1.73595853993902e-05 -5.28614782524528e-06 5.70702604818507e-06 
0.104770064353943 -1.97048429981805e-05 -4.93989591632271e-06 5.47703939446365e-06 
0.108506083488464 -2.21767331822775e-05 -4.54218616141588e-06 5.08781886310317e-06 
0.111496023833752 -2.25904732360505e-05 -4.57150872534839e-06 4.79894970339956e-06 
0.114152260124683 -2.11746755667264e-05 -4.61527542938711e-06 4.18982745031826e-06 
0.116489581763744 -2.01281254703645e-05 -5.42759698873851e-06 3.55722318090557e-06 
0.11857395619154 -1.5800002074684e-05 -5.62294326300616e-06 3.18064485327341e-06 
0.12039341032505 -1.41357331813197e-05 -5.51035100215813e-06 2.56120097219537e-06 
0.122007928788662 -8.63032528286567e-06 -5.83622704652953e-06 1.89572506315017e-06 
0.123302191495895 -3.42754901794251e-06 -6.24253198111546e-06 1.77932872702513e-06 
0.124344550073147 1.52251391227765e-06 -6.19319735051249e-06 1.27159364637919e-06 
0.125076606869698 2.12378495234589e-06 -6.62580714561045e-06 4.0490292008144e-07 
0.125532299280167 2.15538898373779e-06 -6.79253753332887e-06 -2.76099854090717e-07 
0.125819578766823 -7.63361185818212e-07 -6.5193889895454e-06 -8.25927131131721e-08 
0.126025646924973 -2.14505371332052e-06 -6.26476003162679e-06 -5.53184122509265e-07 
0.126271411776543 -4.71176826977171e-06 -6.77883781463606e-06 -7.26111466065049e-07 
0.126545682549477 -3.49821311829146e-06 -7.53307676859549e-06 -5.56218537894893e-07 
0.126922890543938 -2.49381719186204e-06 -8.52627726999344e-06 -9.31595877773361e-07 
0.127325564622879 -1.86792624390364e-06 -9.07966477825539e-06 -1.25866711186973e-06 
0.127595379948616 -8.32709645237628e-07 -9.53825474425685e-06 -1.45304954912717e-06 
0.127812087535858 6.28211239472876e-07 -9.04123317013728e-06 -1.30039779833169e-06 
0.127917513251305 -6.47376680262823e-07 -7.94208062870894e-06 -2.39258906731266e-06 
0.127806395292282 4.05902574129868e-06 -6.79258801028482e-06 -2.33376181313361e-06 
0.127597644925117 3.03676915791584e-06 -5.81262293053442e-06 -2.62584626398166e-06 
0.127456545829773 -1.14544366169866e-06 -4.7287671804952e-06 -2.40999906964134e-06 
0.127065911889076 -6.21773324382957e-06 -3.60626063411473e-06 -2.97124165626883e-06 
0.126693427562714 -1.04750724858604e-05 -3.18764091389312e-06 -2.2142453417473e-06 
0.126319706439972 -1.9381390302442e-05 -2.36061032410362e-06 -1.63175297984708e-06 
0.12593124806881 -2.03359250008361e-05 -2.25785311158688e-06 -1.4017770126884e-06 
0.125386744737625 -2.2734711819794e-05 -2.6378188522358e-06 -1.39579253755073e-06 
0.124930746853352 -1.9340326616657e-05 -2.86034969576576e-06 -1.67428561326233e-06 
0.124394796788692 -1.44826381074381e-05 -2.70837790594669e-06 -1.53291853166593e-06 
0.123855859041214 -9.91009437711909e-06 -3.45331545759109e-06 -1.65358596859733e-06 
0.123200178146362 -1.05866720332415e-05 -3.18846718982968e-06 -1.69442785136198e-06 
0.122511953115463 -1.03631800811854e-05 -2.47715433943085e-06 -2.11501787816815e-06 
0.121737033128738 -1.24236648844089e-05 -1.97704252968833e-06 -1.26945997180883e-06 
0.120914831757545 -1.75136392499553e-05 -1.59944613642438e-06 -1.3108585790178e-06 
0.119925193488598 -2.19561752601294e-05 -7.30133933757315e-07 -1.18984280561563e-06 
0.118855021893978 -2.37036347243702e-05 3.44759598647215e-07 -1.26923782772792e-06 
0.117697991430759 -2.47721291088965e-05 8.5557479678755e-07 -4.51519866828676e-07 
0.116581156849861 -2.83474109892268e-05 1.1713507319655e-06 -4.6263593844742e-07 
0.115432977676392 -3.0548129871022e-05 2.05880246539891e-06 -7.59115437176661e-07 
0.114454828202724 -2.95711342914728e-05 2.45738351623004e-06 -1.18382615710289e-06 
0.113673500716686 -2.87111161014764e-05 2.52889572038839e-06 -1.34079186864255e-06 
0.113073445856571 -2.48174874286633e-05 2.0275040242268e-06 -1.6017949064917e-06 
0.11261472851038 -2.15194504562533e-05 2.33291984841344e-06 -2.0658246739913e-06 
0.112153932452202 -1.58175298565766e-05 2.00390104510006e-06 -1.83805479991861e-06 
0.111742489039898 -1.41197124321479e-05 2.06161803362193e-06 -1.71931674231018e-06 
0.111103214323521 -1.24549060274148e-05 1.45206820434396e-06 -1.84278087544953e-06 
0.110263727605343 -1.24992147902958e-05 2.63882452600228e-06 -2.12093732443464e-06 
0.10904585570097 -9.43618942983449e-06 3.9307333281613e-06 -1.85464728019724e-06 
0.107683308422565 -8.70456733537139e-06 5.22941763847484e-06 -1.54589133671834e-06 
0.105937972664833 -1.01320874819066e-05 6.17266687186202e-06 -1.03578508969804e-06 
0.104078441858292 -1.09886032078066e-05 7.36793572286842e-06 -8.49526031743153e-07 
0.102153420448303 -1.34318806885858e-05 7.15627447789302e-06 -7.27040855963423e-07 
0.10011101514101 -1.8597118469188e-05 7.08447350916686e-06 -5.30160093603627e-07 
0.0980107933282852 -2.16487460420467e-05 7.27167434888543e-06 -4.92101321469818e-07 
0.096102274954319 -2.37743770412635e-05 7.45660281609162e-06 -7.40616144412343e-07 
0.0942278206348419 -2.31523063121131e-05 8.10423171060393e-06 -5.34173750565969e-07 
0.0924636200070381 -2.23511269723531e-05 9.35715070227161e-06 -6.92985281602887e-07 
0.0909156203269958 -1.86603392648976e-05 9.16426688490901e-06 -5.82352697620081e-07 
0.0893939808011055 -1.56507230713032e-05 8.68826646183152e-06 -6.57940290693659e-07 
0.0879556387662888 -8.48283070808975e-06 9.20381899049971e-06 -9.16991211852292e-07 
0.0864258706569672 -4.90598722535651e-06 8.83140000951244e-06 -1.04172909232148e-06 
0.0847584903240204 1.01293517218437e-06 8.8368688011542e-06 -1.02750448149891e-06 
0.083031453192234 8.46625061967643e-06 9.19958620215766e-06 -1.14384238258936e-06 
0.0811503231525421 1.14413933260948e-05 1.05725521279965e-05 -1.28438932733843e-06 
0.0790112689137459 1.18619918794138e-05 1.12308462121291e-05 -1.14603335532593e-06 
0.076996237039566 1.58122020366136e-05 1.21412176667945e-05 -6.83987309457734e-07 
0.0748046264052391 1.71544143086066e-05 1.23137933769613e-05 -2.62162075159722e-07 
0.0725210756063461 1.56488495122176e-05 1.28367737488588e-05 -2.99714059792677e-07 
0.0703011825680733 1.73866228578845e-05 1.24533817142947e-05 -1.19326188041669e-07 
0.0680582895874977 2.21414211409865e-05 1.17383633551071e-05 3.34830730253088e-07 
0.0656469091773033 2.44179282162804e-05 1.15201837616041e-05 1.4497021538773e-07 
0.0632200315594673 2.85699152300367e-05 1.13056012196466e-05 -5.757830212616e-09 
0.0607989579439163 3.33099633280654e-05 1.08513413579203e-05 3.15636015102427e-07 
0.0582901053130627 3.99847922381014e-05 1.07349978861748e-05 7.46703449294728e-07 
0.055797141045332 4.64685472252313e-05 1.00019187811995e-05 9.5105866648737e-07 
0.0532807260751724 5.55860278836917e-05 9.18395562621299e-06 1.25826068142487e-06 
0.0509353578090668 6.64047838654369e-05 8.12773942016065e-06 1.61123568886978e-06 
0.0485468693077564 7.89648329373449e-05 7.53280983190052e-06 1.70941268606839e-06 
0.0462293811142445 9.05507549759932e-05 6.3854708969302e-06 1.41465909564431e-06 
0.0438357070088387 0.000104394515801687 5.75717012907262e-06 1.03554782526771e-06 
0.0414833724498749 0.000116185510705691 4.86890667161788e-06 8.54849076858955e-07 
0.0390683189034462 0.000126853803521954 4.48181162937544e-06 7.70729570831463e-07 
0.0366197116672993 0.000138852003146894 3.54087910636736e-06 6.18792512341315e-07 
0.0340725854039192 0.000152081687701866 2.69682209363964e-06 7.4296747243352e-07 
0.0315196588635445 0.000164286539074965 1.78124639660382e-06 8.58260932545818e-07 
0.0289374310523272 0.000176669942447916 9.56731923906773e-07 8.26498535388964e-07 
0.0263578370213509 0.000190075603313744 1.06127998833472e-07 7.17682837603206e-07 
0.0238395798951387 0.000201048300368711 -7.57166844778112e-07 6.01710496539454e-07 
0.0214686915278435 0.000210584825254045 -1.85547946784936e-06 5.53344875697803e-07 
0.0191775988787413 0.000216518819797784 -2.79344408227189e-06 3.81310229613518e-07 
0.0169964618980885 0.00021971577371005 -3.75078002434748e-06 1.56326663613982e-07 
0.0148764103651047 0.000217579130548984 -4.62464095107862e-06 -1.44176397043339e-07 
0.0128352325409651 0.000210491882171482 -5.2313966989459e-06 -5.55930284917849e-07 
0.0108498763293028 0.000196594060980715 -5.42613634024747e-06 -9.59993712967844e-07 
0.00898725911974907 0.00017754417785909 -5.11842063133372e-06 -1.1913430171262e-06 
0.00724959094077349 0.000153854256495833 -4.39935729446006e-06 -1.18729838050058e-06 
0.00568685634061694 0.000128165702335536 -3.47771356246085e-06 -9.81414814305026e-07 
0.00430867541581392 0.000101417608675547 -2.38096617977135e-06 -4.00062646122024e-07 
0.00317230098880827 7.73561332607642e-05 -1.32334253066801e-06 2.66476689603223e-07 
0.00224439916200936 5.69201074540615e-05 -3.89017714041984e-07 9.06236607534083e-07 
0.00153691100422293 4.08294145017862e-05 2.60293575138348e-07 1.40419672334247e-06 
0.00101240770891309 2.84630459645996e-05 7.22414426945761e-07 1.82453300112684e-06 
0.000641787075437605 1.97780991584295e-05 9.99857547867578e-07 2.01485772777232e-06 
0.000370589084923267 1.3697534086532e-05 1.21781670259224e-06 2.05223432203638e-06 
0.000198043388081715 9.53144353843527e-06 1.27809653349686e-06 2.02068804355804e-06 
8.18737098597921e-05 6.42279837848037e-06 1.30471698867041e-06 2.01001307686965e-06 
1.35566278913757e-06 4.5449905883288e-06 1.31727028929163e-06 1.92258744391438e-06 
-5.56414051970933e-05 3.16585806103831e-06 1.27807311400829e-06 1.86070417385054e-06 
-8.85479457792826e-05 2.14516262531106e-06 1.21631615002116e-06 1.8193135247202e-06 
-0.000110252280137502 1.45557510222716e-06 1.15642865239352e-06 1.79877281425433e-06 
-0.000132685454445891 1.06861330095853e-06 1.12649343009252e-06 1.71992405739729e-06 
-0.000150866166222841 5.67004178719799e-07 1.10081896309566e-06 1.65092012593959e-06 
-0.000173056512721814 6.23012567757542e-07 1.10626058358321e-06 1.50225275774574e-06 
0 0 0 0 
0 0 0 0 
0 0 0 0 
0 0 0 0 
0 0 0 0 
0 0 0 0 
0 0 0 0 
0 0 0 0 
0 0 0 0 
0 0 0 0 
0 0 0 0 
0 0 0 0 
0 0 0 0 
0 0 0 0 
99.9057388305664 0.0795860141515732 0.00685535976663232 0.00274145719595253 
