0 0 0 0 
0 0 0 0 
0 0 0 0 
0 0 0 0 
0 0 0 0 
0 0 0 0 
0 0 0 0 
0 0 0 0 
0 0 0 0 
0 0 0 0 
0.00148938747588545 -2.51781457336619e-05 2.98211261906545e-06 1.32276318254299e-05 
0.00203471234999597 -3.76197640434839e-05 7.31457248548395e-06 1.70536823134171e-05 
0.00263931462541223 -4.86904973513447e-05 1.45989943121094e-05 2.08105502679246e-05 
0.00327474903315306 -5.84138506383169e-05 2.28205626626732e-05 2.41644793277374e-05 
0.00406820187345147 -6.55862386338413e-05 3.32298841385636e-05 2.67443156189984e-05 
0.00494546303525567 -6.88345389789902e-05 4.51713385700714e-05 2.85572823486291e-05 
0.00583402812480927 -6.72308669891208e-05 5.47462950635236e-05 2.92081786028575e-05 
0.00668307207524776 -6.10027746006381e-05 6.05454697506502e-05 2.81778338830918e-05 
0.00744295865297318 -5.03378687426448e-05 6.19205602561124e-05 2.57979809248354e-05 
0.00796678103506565 -3.74594528693706e-05 5.89099508943036e-05 2.26781867240788e-05 
0.008268260397017 -2.42911319219274e-05 5.18375636602286e-05 1.89146558113862e-05 
0.00839607324451208 -1.24968528325553e-05 4.46745871158782e-05 1.53286382555962e-05 
0.00837947521358728 -3.59023420060112e-06 3.89421657018829e-05 1.23734389489982e-05 
0.00822185352444649 2.18366608351062e-06 3.48547000612598e-05 1.03426027635578e-05 
0.00798805616796017 6.00019711782807e-06 3.20477156492416e-05 8.98649977898458e-06 
0.0077277198433876 8.59528336150106e-06 3.03672732115956e-05 8.03493185230764e-06 
0.00745981652289629 1.06618799691205e-05 2.92297245323425e-05 7.33829301680089e-06 
0.00719974189996719 1.2157370292698e-05 2.85837068076944e-05 6.92183948558522e-06 
0.00696326373144984 1.3951345863461e-05 2.78196475846926e-05 6.5010458456527e-06 
0.00672397715970874 1.53933797264472e-05 2.73524656222435e-05 6.13117799730389e-06 
0.00648228824138641 1.68011029018089e-05 2.68686198978685e-05 5.86820488024387e-06 
0.00623909663408995 1.78558238985715e-05 2.67291925410973e-05 5.59887303097639e-06 
0.00599886337295175 1.89929141924949e-05 2.65464423137018e-05 5.40037171958829e-06 
0.00577046861872077 1.99801743292483e-05 2.64884019998135e-05 5.23908784089144e-06 
0.00554483756422997 2.12164668482728e-05 2.61654367932351e-05 5.05689331475878e-06 
0.00530774146318436 2.21478039748035e-05 2.59811931755394e-05 4.86689941681107e-06 
0.00510448962450027 2.3081069230102e-05 2.56446728599258e-05 4.71067187390872e-06 
0.00495058903470635 2.4078961359919e-05 2.51545843639178e-05 4.45399791715317e-06 
0.0048389034345746 2.47445077548036e-05 2.47005082201213e-05 4.30466388934292e-06 
0.00479767611250281 2.53494799835607e-05 2.43555950873997e-05 4.25539519710583e-06 
0.00485148513689637 2.63604288193164e-05 2.38806769630173e-05 4.22787479692488e-06 
0.00497056730091572 2.73833520623157e-05 2.33362661674619e-05 4.2428882807144e-06 
0.00513765495270491 2.85792302747723e-05 2.27763393922942e-05 4.44480838268646e-06 
0.00537466397508979 3.02402404486202e-05 2.19840367208235e-05 4.6738514356548e-06 
0.00568045536056161 3.21032384817954e-05 2.10921316465829e-05 5.00477426612633e-06 
0.00604878785088658 3.43284737027716e-05 2.00071644940181e-05 5.45745979252388e-06 
0.0064592924900353 3.67475258826744e-05 1.89570200745948e-05 6.0721336012648e-06 
0.00690329726785421 3.93826230720151e-05 1.78283607965568e-05 6.86900648361188e-06 
0.00734323682263494 4.18123636336531e-05 1.68442675203551e-05 7.67210622143466e-06 
0.0077693248167634 4.41146403318271e-05 1.55755788000533e-05 8.45910926727811e-06 
0.00815122295171022 4.58989961771294e-05 1.42268536365009e-05 9.28192639548797e-06 
0.00850138999521732 4.75183951493818e-05 1.27479552247678e-05 9.89283034869004e-06 
0.00881271623075008 4.89138474222273e-05 1.12510606413707e-05 1.03609982033959e-05 
0.00911623053252697 5.00430796819273e-05 9.8111904662801e-06 1.07408295662026e-05 
0.00940908212214708 5.08145822095685e-05 8.71945758262882e-06 1.11851559267961e-05 
0.00971774477511644 5.15016945428215e-05 7.81814560468774e-06 1.14463373392937e-05 
0.0100437859073281 5.19052809977438e-05 6.96202368999366e-06 1.18299603855121e-05 
0.0104033816605806 5.18872038810514e-05 6.13947986494168e-06 1.21789289551089e-05 
0.0107885347679257 5.17787593707908e-05 5.27022484675399e-06 1.24538419186138e-05 
0.0111993588507175 5.16197869728785e-05 4.45377281721449e-06 1.26506674860138e-05 
0.0116370767354965 5.11843863932882e-05 3.88462694900227e-06 1.28899946503225e-05 
0.0120982546359301 5.06216056237463e-05 3.53339987668733e-06 1.31474243971752e-05 
0.0126009993255138 5.00283422297798e-05 3.23542462865589e-06 1.32784398374497e-05 
0.013167985714972 4.93011502840091e-05 2.85685109702172e-06 1.35336831590394e-05 
0.0138231813907623 4.86385797557887e-05 2.57149645221944e-06 1.37663728310145e-05 
0.0145956324413419 4.79243026347831e-05 2.44075658883958e-06 1.39821440825472e-05 
0.0154965948313475 4.72043902846053e-05 2.24960899686266e-06 1.43985807881108e-05 
0.0165067128837109 4.62021598650608e-05 2.41637690123753e-06 1.49480583786499e-05 
0.0175956077873707 4.53471184300724e-05 2.7332264380675e-06 1.54019035107922e-05 
0.0187312066555023 4.36339832958765e-05 3.41726490660221e-06 1.58523653226439e-05 
0.0198177415877581 4.13860616390593e-05 4.17388628193294e-06 1.66431200341322e-05 
0.020787188783288 3.77656979253516e-05 5.19141622135066e-06 1.69699742400553e-05 
0.0215603690594435 3.33364951075055e-05 5.73054285268881e-06 1.70099337992724e-05 
0.0220393072813749 2.73762525466736e-05 6.73084150548675e-06 1.72220588865457e-05 
0.0221754685044289 2.217007750005e-05 7.29404519006494e-06 1.73829539562576e-05 
0.0219569373875856 1.77538149728207e-05 7.79197125666542e-06 1.71207375387894e-05 
0.0214345045387745 1.53473174577812e-05 7.9371893662028e-06 1.65536075655837e-05 
0.0206361617892981 1.4974995792727e-05 7.47724106986425e-06 1.58773364091758e-05 
0.0196933783590794 1.64480788953369e-05 5.91800335314474e-06 1.4896921129548e-05 
0.0186994094401598 1.86585548362928e-05 3.96822315451573e-06 1.37059596454492e-05 
0.0177548117935658 2.18799959839089e-05 1.19409367016488e-06 1.25111127999844e-05 
0.0168940145522356 2.49850472755497e-05 -1.2062334917573e-06 1.17119607239147e-05 
0.0162168256938457 2.77333401754731e-05 -2.86455383502471e-06 1.12519064714434e-05 
0.0157035030424595 3.10464602080174e-05 -4.02282103095786e-06 1.09018119474058e-05 
0.015362280420959 3.42528328474145e-05 -4.96410984851536e-06 1.06794213934336e-05 
0.0151483593508601 3.67368738807272e-05 -5.24261349710287e-06 1.05760700535029e-05 
0.015064506791532 3.93112204619683e-05 -5.88560760661494e-06 1.01266741694417e-05 
0.0150712365284562 4.12317021982744e-05 -6.60863133816747e-06 9.54635379457613e-06 
0.0151500394567847 4.27156155637931e-05 -7.60288730816683e-06 9.14011616259813e-06 
0.0152901019901037 4.37247581430711e-05 -8.45680824568262e-06 8.68664847075706e-06 
0.0155632281675935 4.50551633548457e-05 -9.34251420403598e-06 7.7931936175446e-06 
0.0159914083778858 4.6694101911271e-05 -1.0292556908098e-05 7.08303286955925e-06 
0.0167474467307329 5.09864985360764e-05 -1.18910966193653e-05 6.1333880694292e-06 
0.0181654132902622 5.88030416110996e-05 -1.49231009345385e-05 4.11484597862e-06 
0.0208616945892572 7.62011477490887e-05 -1.99545920622768e-05 1.36360085889464e-06 
0.0258343238383532 0.000107024039607495 -2.85460482700728e-05 -1.5809915794307e-06 
0.0340437814593315 0.000151615269714966 -4.22473458456807e-05 -5.24061351825367e-06 
0.0466580837965012 0.000209774661925621 -5.98046572122257e-05 -8.37781772133894e-06 
0.0641157925128937 0.000269768439466134 -7.94906518422067e-05 -1.08037256723037e-05 
0.0858772918581963 0.000316801306325942 -0.000100121193099767 -1.22920419016737e-05 
0.110267728567123 0.00033882845309563 -0.000116241637442727 -9.85654696705751e-06 
0.1350277364254 0.000331814313540235 -0.000124200465506874 -5.47323952559964e-06 
0.157490968704224 0.00028812320670113 -0.000118790529086255 3.85068233299535e-06 
0.175957381725311 0.000231870377319865 -0.000106400984805077 1.14958365884377e-05 
0.189600273966789 0.000172845902852714 -9.32031616684981e-05 2.02508254005807e-05 
0.198411330580711 0.000114555929030757 -7.57067537051626e-05 2.57841220445698e-05 
0.203175410628319 6.25525281066075e-05 -5.51794837519992e-05 2.99212078971323e-05 
0.20504766702652 2.65171911451034e-05 -4.25492908107117e-05 2.76102382485988e-05 
0.204772964119911 -1.4744623513252e-06 -3.55066731572151e-05 2.63171859842259e-05 
0.202978610992432 -2.90296902676346e-05 -2.51220026257215e-05 2.35660481848754e-05 
0.200113192200661 -5.02707589475904e-05 -1.96975288417889e-05 1.81576615432277e-05 
0.196632534265518 -5.71657801629044e-05 -2.56291805271758e-05 1.24409843920148e-05 
0.1926598995924 -6.6666783823166e-05 -2.98641043627867e-05 6.28845236860798e-06 
0.188693970441818 -7.93901272118092e-05 -3.32429772242904e-05 -4.48011718390262e-07 
0.18451052904129 -8.38993291836232e-05 -3.71906935470179e-05 -5.56432314624544e-06 
0.180516079068184 -8.42164226924069e-05 -3.99307136831339e-05 -9.02239935385296e-06 
0.176601082086563 -9.03310719877481e-05 -3.51140552083962e-05 -1.12383268060512e-05 
0.172768622636795 -9.06172499526292e-05 -2.95746376650641e-05 -1.07187015601085e-05 
0.168873444199562 -8.83237808011472e-05 -2.17375127249397e-05 -9.81440098257735e-06 
0.164923921227455 -9.10224844119512e-05 -1.15385164463078e-05 -1.06960196717409e-05 
0.16067773103714 -9.3404196377378e-05 -2.89551485366246e-06 -8.7129837993416e-06 
0.156276986002922 -9.76383744273335e-05 6.124462288426e-06 -7.27143378753681e-06 
0.151960611343384 -0.000105578743387014 1.64688444783678e-05 -7.47607964513008e-06 
0.147246658802032 -0.000109716529550496 2.69305619440274e-05 -5.58920191906509e-06 
0.142670929431915 -0.000110739762021694 3.7253528716974e-05 -3.51345647686685e-06 
0.138236492872238 -0.00011288326641079 4.99087509524543e-05 -3.09470647152921e-06 
0.133824065327644 -0.000110812921775505 5.95321398577653e-05 -2.66336473941919e-06 
0.12919482588768 -0.000104703882243484 6.2440762121696e-05 -2.55065128840215e-06 
0.124603539705276 -0.000103845770354383 6.43857129034586e-05 -3.9563874452142e-06 
0.119842566549778 -0.00010104233660968 6.40977377770469e-05 -5.61531305720564e-06 
0.114893138408661 -9.9111050076317e-05 6.59105789964087e-05 -8.25525148684392e-06 
0.109742127358913 -9.89202744676732e-05 7.04308622516692e-05 -9.69742995948764e-06 
0.104537673294544 -0.000100175166153349 8.05663657956757e-05 -1.01844934761175e-05 
0.0992802456021309 -9.78697717073373e-05 9.22839535633102e-05 -9.59250155574409e-06 
0.0939977914094925 -9.76527517195791e-05 0.000104133818240371 -9.27680048334878e-06 
0.0886931344866753 -9.58484160946682e-05 0.000112413254100829 -8.94430013431702e-06 
0.0835715904831886 -8.99972365004942e-05 0.000118664916954003 -1.08378235381679e-05 
0.0785785317420959 -7.79611655161716e-05 0.000122894402011298 -1.31961760416743e-05 
0.0737346559762955 -6.33036906947382e-05 0.000126442319015041 -1.70997882378288e-05 
0.0690401047468185 -4.23360252170824e-05 0.000128260857309215 -2.17752440221375e-05 
0.0644673928618431 -1.51862732309382e-05 0.000128333413158543 -2.71587887255009e-05 
0.0597952529788017 1.36838452817756e-05 0.000127300882013515 -3.2372263376601e-05 
0.0548902936279774 4.46325684606563e-05 0.000124616490211338 -3.76790267182514e-05 
0.0499681830406189 7.54544889787212e-05 0.000119911557703745 -4.3216143239988e-05 
0.0449598580598831 0.000103100253909361 0.000114114533062093 -4.72438259748742e-05 
0.0399761497974396 0.000126232640468515 0.000107267231214792 -5.04109448229428e-05 
0.0351822525262833 0.000142908640555106 9.89716136245988e-05 -5.24346432939637e-05 
0.0307044312357903 0.000152683249325491 8.82068125065416e-05 -5.32376725459471e-05 
0.0264015831053257 0.000154648703755811 7.67612000345252e-05 -5.21890578966122e-05 
0.0223652925342321 0.000149708284880035 6.47531778668053e-05 -5.04436648043338e-05 
0.0185949448496103 0.000139263065648265 5.19574859936256e-05 -4.68836042273324e-05 
0.0151720261201262 0.000125571474200115 3.93339578295127e-05 -4.26704682467971e-05 
0.0121211390942335 0.000109381224319804 2.78280585916946e-05 -3.77915348508395e-05 
0.00951196346431971 9.28588196984492e-05 1.72133313753875e-05 -3.25061701005325e-05 
0.00733969360589981 7.62312629376538e-05 9.07328649191186e-06 -2.71654371317709e-05 
0.00561251165345311 6.07587353442796e-05 3.35906997861457e-06 -2.22878425120143e-05 
0.00424469169229269 4.63999749626964e-05 2.48370124467101e-08 -1.76890644070227e-05 
0.00320255826227367 3.47364839399233e-05 -1.8332660829401e-06 -1.41711698233848e-05 
0.00241913553327322 2.53774214797886e-05 -2.46070771936502e-06 -1.13232517833239e-05 
0.00183430395554751 1.92066818271996e-05 -2.15562681660231e-06 -8.67282415129011e-06 
0.00143424712587148 1.60795443662209e-05 -1.36372591441614e-07 -6.56823067402001e-06 
0.00117417285218835 1.68344740814064e-05 3.99838381781592e-06 -4.43674298367114e-06 
0.00102466170210391 2.11528877116507e-05 1.2110304851376e-05 -1.6152257558133e-06 
0.000980273121967912 3.03880169667536e-05 2.54230908467434e-05 1.83864744940365e-06 
0.00106016430072486 4.55630288342945e-05 4.49542858405039e-05 6.11377754466957e-06 
0.00122693821322173 6.76022900734097e-05 7.22448749002069e-05 1.17754334496567e-05 
0.00150971510447562 9.70759574556723e-05 0.000108428183011711 1.90193004527828e-05 
0.00191241723950952 0.000135475507704541 0.000154647379531525 2.78889310720842e-05 
0.00242972583509982 0.000183254174771719 0.000212260798434727 3.8992082409095e-05 
0.00297792884521186 0.00023398149642162 0.00027316395426169 5.08148259541485e-05 
0.00368625717237592 0.000298509025014937 0.00035171874333173 6.58970748190768e-05 
0 0 0 0 
0 0 0 0 
0 0 0 0 
0 0 0 0 
0 0 0 0 
0 0 0 0 
0 0 0 0 
0 0 0 0 
0 0 0 0 
0 0 0 0 
0 0 0 0 
0 0 0 0 
0 0 0 0 
0 0 0 0 
99.7540054321289 0.12036794424057 0.0828441381454468 0.0247536059468985 
