0 0 0 0 
0 0 0 0 
0 0 0 0 
0 0 0 0 
0 0 0 0 
0 0 0 0 
0 0 0 0 
0 0 0 0 
0 0 0 0 
0 0 0 0 
0.00100069958716631 -1.8801827536663e-05 -3.13453165290412e-06 4.68766165795387e-06 
0.00112134777009487 -2.05931974051055e-05 -4.40750591224059e-06 5.22889195053722e-06 
0.00126984901726246 -2.02051069209119e-05 -5.55261203771806e-06 5.45426973985741e-06 
0.00147362845018506 -1.90506216313224e-05 -6.57390228298027e-06 5.55461792828282e-06 
0.0018405964365229 -1.5958094081725e-05 -7.34459536033683e-06 4.92790968564805e-06 
0.00233207596465945 -1.06451780084171e-05 -7.66897755966056e-06 4.15817930843332e-06 
0.00288523151539266 -4.04180491386796e-06 -7.44395401852671e-06 3.31102114614623e-06 
0.00347176240757108 2.47991806645587e-06 -6.7157311605115e-06 2.16724492929643e-06 
0.00402578944340348 8.45153408590704e-06 -5.71696318729664e-06 8.69627058364131e-07 
0.00440263003110886 1.34540205181111e-05 -4.53733446192928e-06 7.98010049152253e-08 
0.00462658796459436 1.64811117429053e-05 -3.49793845089152e-06 -7.60774639729789e-07 
0.00475265737622976 1.83656611625338e-05 -2.78020957011904e-06 -1.60576848884375e-06 
0.00481761107221246 2.03998843062436e-05 -2.18834406950918e-06 -2.23831762014015e-06 
0.00485784653574228 2.23070237552747e-05 -1.73197906860878e-06 -2.67495397565654e-06 
0.00494129071012139 2.45630471908953e-05 -1.29311661112297e-06 -2.97079805022804e-06 
0.00512214377522469 2.7241916541243e-05 -9.10843709789333e-07 -3.26643726111797e-06 
0.00541766313835979 3.03895121760434e-05 -4.80196376884123e-07 -3.57575527232257e-06 
0.00582105899229646 3.34612668666523e-05 -1.95867059460397e-07 -3.8866710383445e-06 
0.00630855653434992 3.67073917004745e-05 -2.02173957575269e-08 -4.28455814471818e-06 
0.0068413857370615 3.95090610254556e-05 1.13185123495896e-07 -4.85432747154846e-06 
0.0073479050770402 4.15897957282141e-05 9.54925383211958e-08 -5.42101270184503e-06 
0.00777374114841223 4.27463237429038e-05 -8.80741950481934e-08 -6.0542060964508e-06 
0.00808273907750845 4.33495806646533e-05 -2.56697376244119e-07 -6.68424127070466e-06 
0.00828556809574366 4.29183601227123e-05 -5.37807693490322e-07 -7.44869703339646e-06 
0.00839763041585684 4.19972202507779e-05 -1.10346832116193e-06 -8.40263146528741e-06 
0.00848903320729733 4.15313807025086e-05 -1.48861761317676e-06 -9.4722081485088e-06 
0.00866182614117861 4.3150572309969e-05 -1.42811052228353e-06 -1.03419224615209e-05 
0.00904196221381426 4.71045386802871e-05 -1.06414302081248e-06 -1.11449871837976e-05 
0.0097252344712615 5.44080066902097e-05 -3.07377462149816e-07 -1.17827830763417e-05 
0.0108705116435885 6.60798614262603e-05 1.10043242784741e-06 -1.21838502309402e-05 
0.0126429749652743 8.31303186714649e-05 2.91169340016495e-06 -1.24045936900075e-05 
0.0152362193912268 0.000104585502413101 5.07882396050263e-06 -1.3022858183831e-05 
0.0188050661236048 0.000131275010062382 7.39939969207626e-06 -1.3602274520963e-05 
0.023596053943038 0.000163548611453734 1.02914973467705e-05 -1.41261625685729e-05 
0.0297160595655441 0.000199406917090528 1.34407473524334e-05 -1.41941736728768e-05 
0.0372298806905746 0.000236133870203048 1.67938924278133e-05 -1.35145483000088e-05 
0.046030480414629 0.000272299628704786 2.01299681066303e-05 -1.14696204036591e-05 
0.0558387599885464 0.000303448061458766 2.29819452215452e-05 -8.01823716756189e-06 
0.0661545619368553 0.00032481097150594 2.42918267758796e-05 -3.20710842061089e-06 
0.0766490548849106 0.000334942771587521 2.49806780630024e-05 2.20221477320592e-06 
0.0867935046553612 0.000331541785271838 2.40207573369844e-05 7.4488466452749e-06 
0.0962288454174995 0.000314468663418666 2.20716265175724e-05 1.19833794087754e-05 
0.104811750352383 0.000288750714389607 1.72340514836833e-05 1.54686258611036e-05 
0.112626597285271 0.000258918153122067 1.14436397780082e-05 1.68124952324433e-05 
0.119378291070461 0.000225155832595192 4.46609192295e-06 1.68254100572085e-05 
0.125185057520866 0.000192941981367767 -3.51941935150535e-06 1.55591060320148e-05 
0.130129754543304 0.000162564552738331 -1.13498799692024e-05 1.37779434226104e-05 
0.134278178215027 0.00013364409096539 -1.6436413716292e-05 1.13480200525373e-05 
0.137746632099152 0.000106611325463746 -1.9909148250008e-05 8.91547279024962e-06 
0.14069676399231 8.42803347040899e-05 -2.32885158766294e-05 6.49511093797628e-06 
0.143248021602631 6.61308295093477e-05 -2.42986116063548e-05 4.31056014349451e-06 
0.145385339856148 5.33006787009072e-05 -2.47988336923299e-05 2.23485176320537e-06 
0.147245079278946 4.50618099421263e-05 -2.41148063651053e-05 1.03939022721988e-07 
0.148549050092697 3.73973743990064e-05 -2.39848886849359e-05 -1.16246042125567e-06 
0.149509981274605 3.29715658153873e-05 -2.27917698794045e-05 -2.21304730985139e-06 
0.150097355246544 2.65787657554029e-05 -2.2581532903132e-05 -3.34984815708594e-06 
0.150522410869598 2.33629707508953e-05 -2.1639876649715e-05 -3.96023551729741e-06 
0.150477021932602 1.71333886100911e-05 -2.17070919461548e-05 -3.5939685858466e-06 
0.150520190596581 1.560846430948e-05 -1.9921237253584e-05 -3.56965074388427e-06 
0.150460541248322 9.18854675546754e-06 -1.89556067198282e-05 -3.48236244462896e-06 
0.150366112589836 6.90319575369358e-06 -1.79966555151623e-05 -2.59488729170698e-06 
0.15014223754406 -1.50985056279751e-06 -1.92375919141341e-05 -2.14520105146221e-06 
0.150099322199821 -1.0605252100504e-05 -1.83007905434351e-05 -2.96377515951463e-06 
0.149771481752396 -2.50777429755544e-05 -1.70752355188597e-05 -3.02255239148508e-06 
0.149545297026634 -3.34977303282358e-05 -1.54376775753917e-05 -3.13315945277282e-06 
0.149248525500298 -4.39677278336603e-05 -1.4639839719166e-05 -3.58514989784453e-06 
0.149052262306213 -5.03764604218304e-05 -1.03375159596908e-05 -4.32942215411458e-06 
0.148636981844902 -5.28660275449511e-05 -7.05435377312824e-06 -4.25827420258429e-06 
0.148037686944008 -5.62898603675421e-05 -6.85044733472751e-06 -5.004118065699e-06 
0.147086843848228 -6.56723277643323e-05 -3.73859802493826e-06 -5.33379852640792e-06 
0.146071925759315 -6.95892595103942e-05 1.27291377793881e-06 -5.14219891556422e-06 
0.144493594765663 -8.0599966167938e-05 3.3857886592159e-06 -4.99993075209204e-06 
0.142906919121742 -9.11889655981213e-05 2.87029683931905e-06 -4.40872690887772e-06 
0.141312465071678 -9.48048909776844e-05 4.40596841144725e-06 -3.4638771921891e-06 
0.139732450246811 -9.39915044000372e-05 4.94529831485124e-06 -2.45672208620817e-06 
0.137827634811401 -9.67909509199671e-05 4.369908310764e-06 -2.34684671340801e-06 
0.136039823293686 -9.21847095014527e-05 5.93526874581585e-06 -1.77539300239005e-06 
0.133928909897804 -9.05020788195543e-05 8.77092224982334e-06 -2.07488619707874e-06 
0.131446689367294 -9.0499350335449e-05 1.15997463581152e-05 -1.19926198749454e-06 
0.128682538866997 -9.19927697395906e-05 1.2122887710575e-05 -1.49532365867344e-06 
0.125817894935608 -9.64757055044174e-05 1.46607644637697e-05 -9.65386107054655e-07 
0.122670121490955 -0.000102652949863113 1.46087559187436e-05 -1.15449631721276e-06 
0.119408279657364 -0.000107982319605071 1.5782557966304e-05 -1.71484407474054e-06 
0.116152942180634 -0.000114619440864772 1.66026347869774e-05 -2.71363273895986e-06 
0.112744726240635 -0.000117766176117584 1.75594050233485e-05 -2.74615194939543e-06 
0.109400920569897 -0.000116282324597705 1.74627057276666e-05 -3.04242735182925e-06 
0.105947777628899 -0.000113489681098145 1.79259550350253e-05 -2.24362429435132e-06 
0.102642126381397 -0.000108382271719165 1.75647637661314e-05 -1.00518138879124e-06 
0.0995220392942429 -0.000105377883301117 1.7912976545631e-05 -1.21305458833376e-06 
0.096497043967247 -0.000105002218333539 1.91771650861483e-05 -1.79148719325894e-06 
0.0932786241173744 -0.000104454200481996 2.05984688363969e-05 -1.89488025625906e-06 
0.0901570990681648 -0.000102722129668109 2.24788163905032e-05 -2.27407713282446e-06 
0.0866966173052788 -0.000103164638858289 2.30723071581451e-05 -1.90365221897082e-06 
0.0830198302865028 -9.97874085442163e-05 2.27349974011304e-05 -7.36860840788722e-07 
0.0790877863764763 -9.45930005400442e-05 2.21146783587756e-05 8.83022835296288e-07 
0.0747845396399498 -9.37056465772912e-05 2.07967514143093e-05 2.05667129193898e-06 
0.0701210275292397 -9.39242745516822e-05 1.92129300558008e-05 3.0255141609814e-06 
0.0653568431735039 -9.17806682991795e-05 1.81774466909701e-05 3.61633601642097e-06 
0.0603971481323242 -9.00670493138023e-05 1.7433665561839e-05 4.09694030167884e-06 
0.0553742274641991 -8.91766030690633e-05 1.67546040756861e-05 4.65747280031792e-06 
0.0505014732480049 -8.69787618285045e-05 1.55535544763552e-05 5.04537410961348e-06 
0.0458696596324444 -8.26083050924353e-05 1.42149110615719e-05 5.58915053261444e-06 
0.0414617098867893 -7.91336060501635e-05 1.36067383209593e-05 5.95980054640677e-06 
0.037384208291769 -7.56853260099888e-05 1.28038227558136e-05 6.27401141173323e-06 
0.0336629822850227 -7.09639862179756e-05 1.15310358523857e-05 6.42542045170558e-06 
0.0304012503474951 -6.47202468826436e-05 1.09349548438331e-05 6.56955398881109e-06 
0.0275310296565294 -5.93900258536451e-05 1.05409144453006e-05 6.68910206513829e-06 
0.0250254962593317 -5.32206540810876e-05 9.96139078779379e-06 6.70782901579514e-06 
0.0228287596255541 -4.65420926047955e-05 9.32764032768318e-06 6.74824377711047e-06 
0.0209224708378315 -4.0680606616661e-05 9.05531942407833e-06 6.53919232718181e-06 
0.019259549677372 -3.45475746144075e-05 8.8111692093662e-06 6.45578120384016e-06 
0.017803130671382 -2.90089919872116e-05 8.56855422171066e-06 6.036637842044e-06 
0.0165500119328499 -2.38194661505986e-05 8.2398009908502e-06 5.52745268578292e-06 
0.0154208689928055 -1.82663079613121e-05 7.79149559093639e-06 5.02154034620617e-06 
0.0144453821703792 -1.29796953842742e-05 7.46035721022054e-06 4.52159110864159e-06 
0.0135631319135427 -8.29934378998587e-06 7.03603518559248e-06 3.93327127312659e-06 
0.0127907581627369 -3.25855444316403e-06 6.7950177253806e-06 3.38483664563682e-06 
0.0120680695399642 1.38140489980287e-06 6.54126051813364e-06 2.83104941445345e-06 
0.0113783488050103 4.91988475914695e-06 6.60252908346592e-06 2.42140254158585e-06 
0.0107063855975866 8.15561634226469e-06 6.43963176116813e-06 1.87327395906323e-06 
0.010063424706459 1.09848742795293e-05 6.47211709292606e-06 1.29097679746337e-06 
0.00940492376685143 1.30271619127598e-05 6.21206254436402e-06 7.87589215178741e-07 
0.00877610873430967 1.50970854519983e-05 5.81563836021814e-06 2.60226272530417e-07 
0.00819734670221806 1.74332744791172e-05 5.24721690453589e-06 -3.94403798509302e-07 
0.00764443399384618 1.99514543055557e-05 4.67212385046878e-06 -9.84363396128174e-07 
0.00710798427462578 2.25586336455308e-05 4.07343304686947e-06 -1.60167303420167e-06 
0.00662970682606101 2.51407345785992e-05 3.62260493602662e-06 -2.25587632485258e-06 
0.00619120895862579 2.82778510154458e-05 3.47507307196793e-06 -2.89710737888527e-06 
0.0057980022393167 3.14519857056439e-05 3.43156466442451e-06 -3.74268006453349e-06 
0.00545246247202158 3.49572001141496e-05 3.51402877640794e-06 -4.54555583928595e-06 
0.00516564678400755 3.86434330721386e-05 3.62220339411579e-06 -5.28351256434689e-06 
0.00490421010181308 4.17444825870916e-05 3.87258523915079e-06 -5.94951279708766e-06 
0.00465200608596206 4.35387046309188e-05 3.95360393667943e-06 -6.54312998449313e-06 
0.00441365875303745 4.46239464508835e-05 4.16372995459824e-06 -6.85886107021361e-06 
0.00417876848950982 4.42856398876756e-05 4.44186071035801e-06 -6.90959132043645e-06 
0.00392515305429697 4.27923223469406e-05 4.55810277344426e-06 -6.79697268424206e-06 
0.0036717290058732 4.10284665122163e-05 4.89728518004995e-06 -6.56850079394644e-06 
0.00339487357996404 3.88654952985235e-05 5.14522707817378e-06 -6.12140820521745e-06 
0.00308899884112179 3.58822544512805e-05 5.236934612185e-06 -5.54114785700222e-06 
0.00275530270300806 3.24072061630432e-05 5.1166912271583e-06 -4.97982273373054e-06 
0.00241682934574783 2.84519010165241e-05 4.88969362777425e-06 -4.38294682680862e-06 
0.00206348672509193 2.38444190472364e-05 4.49140952696325e-06 -3.73778493667487e-06 
0.00173340295441449 1.9526685719029e-05 4.01297484131646e-06 -3.11524900098448e-06 
0.00141310342587531 1.55130001076031e-05 3.44228647009004e-06 -2.54965016210917e-06 
0.00113713974133134 1.20856593639473e-05 2.77918911706365e-06 -1.99636451725382e-06 
0.000891058763954788 9.39446817938006e-06 2.43614317696483e-06 -1.43544639286119e-06 
0.000676964875310659 7.23621724318946e-06 1.82877647603163e-06 -1.02258547940437e-06 
0.000501032278407365 5.42272346137906e-06 1.45422416153451e-06 -6.67847189106396e-07 
0.000374009046936408 4.03185595132527e-06 1.21151936127717e-06 -3.37839367148263e-07 
0.000268032075837255 2.63421543422737e-06 1.02647572930437e-06 -1.813620684743e-07 
0.000199737696675584 1.44702460147528e-06 8.39316896872333e-07 -1.3113772467932e-07 
0.000152433261973783 5.49155913631694e-07 8.4426494595391e-07 -6.65132091626219e-08 
0.000119709082355257 -1.93409150028856e-07 8.44630733354279e-07 -1.12875810032165e-07 
8.60023137647659e-05 -1.02227556908474e-06 8.72543864716135e-07 -1.68394464594712e-07 
6.2745479226578e-05 -1.50700009271532e-06 1.06510606201482e-06 -1.72416406485354e-07 
4.50032166554593e-05 -2.04727120944881e-06 1.20175548090629e-06 -2.48761978127732e-07 
1.68572078109719e-05 -2.53292637353297e-06 1.39566884627129e-06 -2.6137428221773e-07 
-1.46415243307274e-06 -2.92496224574279e-06 1.60758020228968e-06 -2.67946461462998e-07 
-1.21566226880532e-05 -3.3475921554782e-06 1.7329552974843e-06 -3.35529506401144e-07 
-3.75250056094956e-05 -3.79391553906316e-06 1.92034144674835e-06 -3.6182495932735e-07 
-3.92169204133097e-05 -4.54780229119933e-06 1.98776956494839e-06 -5.44390047707566e-07 
0 0 0 0 
0 0 0 0 
0 0 0 0 
0 0 0 0 
0 0 0 0 
0 0 0 0 
0 0 0 0 
0 0 0 0 
0 0 0 0 
0 0 0 0 
0 0 0 0 
0 0 0 0 
0 0 0 0 
0 0 0 0 
99.84716796875 0.121575921773911 0.0152381276711822 0.00751848286017776 
