{
    "resId":"nlu_chat_relationshipName_zh_group",
    "domain":"nlu",
    "district":"china",
    "deviceType":"common",
    "productName":"common",
    "romVersion":"common",
    "osVersion":"common",
    "version":"0x01010000",
    "releaseNotes":"",
    "digest":"",
    "fileName":"",
    "ResMetaData":[
        {
            "origin_id":"0x000000000200131c",
            "res_value":"",
            "res_path":"nlu/domainDic/business/chat_relationshipName_zh.dat",
            "domain":"nlu",
            "data_version":"0x01010000",
            "encrypt_mode":"0"
        },
        {
            "origin_id":"0x000000000200131d",
            "res_value":"",
            "res_path":"nlu/domainDic/business/chat_relationshipName_zh.pos",
            "domain":"nlu",
            "data_version":"0x01010000",
            "encrypt_mode":"0"
        }
    ]
}