0.000247255142312497 -0.000909578055143356 
0.00017094612121582 8.02197100711055e-05 
0.000184578602784313 0.00036543607711792 
0.000273944693617523 -9.74535942077637e-06 
0.000403230485972017 -0.00014131456555333 
0.000491090060677379 -0.000560200656764209 
0.000665131898131222 -0.00195126223843545 
0.000942640355788171 -0.00373015902005136 
0.00138592720031738 -0.0055934963747859 
0.00198580347932875 -0.00706176739186049 
0.00268678553402424 -0.00919526163488626 
0.00348405609838665 -0.0111181614920497 
0.00425399653613567 -0.0131121687591076 
0.00505489250645041 -0.0134683204814792 
0.00588618824258447 -0.0136581789702177 
0.00685394462198019 -0.0121820857748389 
0.00775454146787524 -0.0101498765870929 
0.00841023400425911 -0.00813229940831661 
0.00863522570580244 -0.00653061782941222 
0.00862355157732964 -0.00582552142441273 
0.00846296176314354 -0.00443170499056578 
0.0082100685685873 -0.0042018867097795 
0.00786166172474623 -0.00326869892887771 
0.00748504977673292 -0.00267229718156159 
0.00714193237945437 -0.00168475520331413 
0.00683927908539772 -0.00147852778900415 
0.00654338346794248 -0.00198371917940676 
0.00628998642787337 -0.00209107715636492 
0.00602932320907712 -0.00209408067166805 
0.0057824719697237 -0.0018860436975956 
0.00552351539954543 -0.001589419785887 
0.00525857508182526 -0.00168354180641472 
0.00502766901627183 -0.00123596924822778 
0.00477978680282831 -0.00144327047746629 
0.00457450933754444 -0.00128350057639182 
0.00431585498154163 -0.00153513054829091 
0.00409436179324985 -0.00129149435088038 
0.00390764093026519 -0.00137793982867151 
0.00383035442791879 -0.00115706468932331 
0.00381611078046262 -0.00140065758023411 
0.00384853244759142 -0.00155282206833363 
0.00396509561687708 -0.00180707382969558 
0.00412843888625503 -0.00197892170399427 
0.00435665994882584 -0.00206818850710988 
0.0046063419431448 -0.0025980812497437 
0.00494684278964996 -0.00277429120615125 
0.00536387367174029 -0.00277196592651308 
0.00585268391296268 -0.00288066477514803 
0.00633536325767636 -0.00298758037388325 
0.006830969825387 -0.00293157552368939 
0.00727992737665772 -0.00260606617666781 
0.00770903378725052 -0.00307858898304403 
0.00806005671620369 -0.00333816697821021 
0.00841761473566294 -0.00358274718746543 
0.00883470103144646 -0.00299495924264193 
0.00931292213499546 -0.00255977059714496 
0.00981327891349792 -0.00203184271231294 
0.0102865593507886 -0.00200908444821835 
0.01076340675354 -0.00208151852712035 
0.0112251257523894 -0.00260659609921277 
0.0116910934448242 -0.00244675623252988 
0.0121499840170145 -0.00284351035952568 
0.0126621183007956 -0.00225042132660747 
0.0132283363491297 -0.00319410860538483 
0.0138838421553373 -0.00320597109384835 
0.0146901626139879 -0.00370348989963531 
0.0156094720587134 -0.00265418644994497 
0.0166735332459211 -0.00274977018125355 
0.0178015232086182 -0.0034638571087271 
0.0190123785287142 -0.00326671544462442 
0.0201856326311827 -0.00223648105747998 
0.0212897770106792 -0.00212530186399817 
0.0222222022712231 -0.00298267276957631 
0.0228530690073967 -0.00375798204913735 
0.0230849571526051 -0.00327687570825219 
0.0228213239461184 -0.00347489770501852 
0.0222633592784405 -0.00278085609897971 
0.02136723510921 -0.00451597198843956 
0.020364498719573 -0.0043449280783534 
0.0193188618868589 -0.00555847166106105 
0.0184476636350155 -0.00385094503872097 
0.017695639282465 -0.00357644935138524 
0.0171320978552103 -0.00305550661869347 
0.0167195033282042 -0.0039627137593925 
0.0164903849363327 -0.00409106863662601 
0.0163883380591869 -0.00507454434409738 
0.0163412094116211 -0.0047967042773962 
0.0164053179323673 -0.00471664872020483 
0.0165124032646418 -0.00391252804547548 
0.0167255476117134 -0.00336898560635746 
0.0169963110238314 -0.00383594259619713 
0.0173575542867184 -0.00578160490840673 
0.0179187878966331 -0.00582920014858246 
0.0188756883144379 -0.00685147987678647 
0.0207222886383533 -0.0062093804590404 
0.0242662876844406 -0.00666155060753226 
0.0309779196977615 -0.00673750601708889 
0.0422932989895344 -0.00687969708815217 
0.0592647269368172 -0.00834835786372423 
0.0816349387168884 -0.00485775945708156 
0.107652433216572 0.00304969726130366 
0.134332358837128 0.00898929871618748 
0.157757639884949 0.00800453592091799 
0.17597608268261 -0.000845348404254764 
0.188172414898872 -0.00220912625081837 
0.195706859230995 -0.00930272787809372 
0.199270337820053 -0.00577908148989081 
0.200897008180618 -0.0145845115184784 
0.20067223906517 -0.0185656268149614 
0.198735877871513 -0.0230959709733725 
0.19568558037281 -0.0225440170615911 
0.191961526870728 -0.0175729766488075 
0.188332661986351 -0.0234509781002998 
0.184667304158211 -0.0238582249730825 
0.181003570556641 -0.0340730398893356 
0.178003057837486 -0.0375869460403919 
0.174814701080322 -0.0313286446034908 
0.171473607420921 -0.0170472264289856 
0.168436080217361 -0.00840905774384737 
0.164911553263664 -0.0142241790890694 
0.161655858159065 -0.0147941680625081 
0.157890602946281 -0.0197911765426397 
0.15401616692543 -0.0159024074673653 
0.150116622447968 -0.0183251798152924 
0.146369248628616 -0.0152904409915209 
0.142541289329529 -0.0123140225186944 
0.13843759894371 -0.00925305485725403 
0.133881524205208 0.000517561275046319 
0.129520013928413 0.0031841357704252 
0.125099644064903 0.012804782949388 
0.120070345699787 0.016780249774456 
0.115105479955673 0.0283473394811153 
0.110000126063824 0.0315812863409519 
0.105195514857769 0.0385598763823509 
0.100082069635391 0.0342440344393253 
0.0951502695679665 0.0427413806319237 
0.0901655182242393 0.0447317771613598 
0.0851832404732704 0.0591745860874653 
0.0798185244202614 0.0638579949736595 
0.0745384022593498 0.0775528252124786 
0.0693292841315269 0.0810578241944313 
0.0640810206532478 0.0859720706939697 
0.0582916997373104 0.086435504257679 
0.0521423555910587 0.088842049241066 
0.0462603755295277 0.0918908715248108 
0.0407814122736454 0.0931792333722115 
0.0356982350349426 0.0944307148456573 
0.0308118015527725 0.0920026376843452 
0.0262536704540253 0.0881229713559151 
0.0220104157924652 0.079744465649128 
0.0181992556899786 0.0725043416023254 
0.0147830387577415 0.0637845322489738 
0.0118955206125975 0.0570556148886681 
0.00937269907444715 0.0473679527640343 
0.00725584803149104 0.0391183868050575 
0.00545480521395802 0.0298224072903395 
0.0039666430093348 0.0218200497329235 
0.00287252198904753 0.0152891166508198 
0.00204069050960243 0.0109122162684798 
0.00150105950888246 0.00821838341653347 
0.00111450487747788 0.0056267804466188 
0.000829297816380858 0.00328230834566057 
0.000644620973616838 0.00165825500153005 
0.000523141061421484 0.000830558245070279 
0.000459727802081034 0.000780283298809081 
0.000392933434341103 0.000582043081521988 
0.00031566817779094 0.000431113236118108 
0.000263567169895396 0.000193438259884715 
0.000245977338636294 0.000211837628739886 
0.00021951632515993 0.000145218946272507 
0.000196492328541353 -5.7071174524026e-05 
0.000164241559104994 -0.000277352228295058 
0.000133075460325927 -0.000146571910590865 
0.000139155235956423 -3.29887479892932e-05 
0.000128411731566302 0.000233386483159848 
0.000130485786939971 0.000179462222149596 
8.47824630909599e-05 -0.00037905725184828 
6.46793705527671e-05 -0.000523457478266209 
6.08484733675141e-05 -0.000538173015229404 
3.57296157744713e-05 -0.000239975634030998 
2.54662936640671e-05 -0.000319045881042257 
3.22704431710008e-06 -0.000462730007711798 
2.44922703132033e-05 -0.000284005422145128 
1.55633533722721e-05 -0.000196296226931736 
2.28293611144181e-05 -0.000349182751961052 
