{
    "simple_rule": [
        {
            "event_name": "InstallationFreeResult",
            "eventid": 951000207,
            "params": {
                "BUNDLE_NAME":"BUNDLE_NAME",
                "ABILITY_NAME":"ABILITY_NAME",
                "ERROR_TYPE":"ERROR_TYPE",
                "START_TYPE":"START_TYPE",
                "CALLER_BUNDLE_NAME":"CALLER_BUNDLE_NAME",
                "SCENE":"SCENE",
                "IS_ALLOW":"IS_ALLOW",
                "REDIRECT_COMPONENT":"REDIRECT_COMPONENT"
            }
        },
        {
            "event_name": "BmsBundleScanFailed",
            "eventid": 951000208
        },
        {
            "event_name": "AccountInterfaceFailed",
            "eventid": 951000205
        },
        {
            "event_name": "DbInterfaceException",
            "eventid": 950004000
        },
        {
            "event_name": "UninstallFailed",
            "eventid": 951000203
        },
        {
            "event_name": "RegisterNotificationException",
            "eventid": 951000201
        },
        {
            "event_name": "BmsInitFailed",
            "eventid": 951000200
        },
        {
            "event_name": "GlobalInterfaceFailed",
            "eventid": 951000103
        },
        {
            "event_name": "DmsInterfaceFailed",
            "eventid": 950004202
        },
        {
            "event_name": "ConnectAbilityFailed",
            "eventid": 951000002
        },
        {
            "event_name": "InstallFailed",
            "eventid": 951000202
        },
        {
            "event_name": "LoadAbilityFailed",
            "eventid": 951000001
        },
        {
            "event_name": "DmsServiceFailed",
            "eventid": 950004201
        },
        {
            "event_name": "DmsCallbackFailed",
            "eventid": 950004203
        },
        {
            "event_name": "BmsServiceFailed",
            "eventid": 951000101
        },
        {
            "event_name": "BmsInterfaceFailed",
            "eventid": 951000102
        },
        {
            "event_name": "DistributedDatamgrInterfaceFailed",
            "eventid": 951000104
        },
        {
            "event_name": "InitEnvironmentFailed",
            "eventid": 951000105
        },
        {
            "event_name": "StartRemoteAbility",
            "eventid": 991310072
        },
        {
            "event_name": "ConnectRemoteAbility",
            "eventid": 991310073
        },
        {
            "event_name": "DBSyncResult",
            "eventid": 951000209
        },
        {
            "event_name": "FmsInitFailed",
            "eventid": 951000020
        },
        {
            "event_name": "FmsDataStorageFailed",
            "eventid": 951000021
        },
        {
            "event_name": "FmsFARefreshTimes",
            "eventid": 951000025,
            "params": {
                "BUNDLE_NAME":"BUNDLE_NAME",
                "MODULE_NAME":"MODULE_NAME",
                "FORM_NAME":"FORM_NAME",
                "FORM_ID":"FORM_ID",
                "DAILY_REFRESH_TIMES":"DAILY_REFRESH_TIMES",
                "INVISIBLE_REFRESH_TIMES":"INVISIBLE_REFRESH_TIMES",
                "HF_REFRESH_BLOCK_TIMES":"HF_REFRESH_BLOCK_TIMES",
                "INVISIBLE_REFRESH_BLOCK_TIMES":"INVISIBLE_REFRESH_BLOCK_TIMES",
                "HIGH_LOAD_REFRESH_BLOCK_TIMES":"HIGH_LOAD_REFRESH_BLOCK_TIMES",
                "RECOVER_REFRESH_TIMES":"RECOVER_REFRESH_TIMES"
            }
        },
        {
            "event_name": "FmsPushRefreshReport",
            "eventid": 951000026,
            "params": {
                "BUNDLE_NAME":"BUNDLE_NAME",
                "MODULE_NAME":"MODULE_NAME",
                "FORM_NAME":"FORM_NAME",
                "FORM_ID":"FORM_ID",
                "SPECIFICATION":"SPECIFICATION",
                "ABILITY_NAME":"ABILITY_NAME"
            }
        },
        {
            "event_name": "FmsIllegalPublishReport",
            "eventid": 951000027,
            "params": {
                "HOST_BUNDLE_NAME":"HOST_BUNDLE_NAME",
                "CLIENT_BUNDLE_NAME":"CLIENT_BUNDLE_NAME",
                "FORM_BUNDLE_NAME":"FORM_BUNDLE_NAME",
                "MODULE_NAME":"MODULE_NAME",
                "FORM_NAME":"FORM_NAME",
                "SPECIFICATION":"SPECIFICATION",
                "ABILITY_NAME":"ABILITY_NAME"
            }
        }
    ]
}
