0 0 0 0 
0 0 0 0 
0 0 0 0 
0 0 0 0 
0 0 0 0 
0 0 0 0 
0 0 0 0 
0 0 0 0 
0 0 0 0 
0 0 0 0 
0.0023589925840497 -0.000159677278134041 2.0575102098519e-05 8.71032511895464e-07 
0.00282080308534205 -0.00018211777205579 2.77079270745162e-05 -1.4361908142746e-06 
0.00324532529339194 -0.000195007043657824 3.62794562533963e-05 -4.05935088565457e-06 
0.00372726563364267 -0.000202281138626859 4.43364297098015e-05 -6.5527042352187e-06 
0.00436480762436986 -0.000196042616153136 5.12527185492218e-05 -8.6853851826163e-06 
0.00511743687093258 -0.000176308807567693 5.67722308915108e-05 -9.99717576632975e-06 
0.00592583138495684 -0.000148660619743168 5.94301563978661e-05 -1.03329857665813e-05 
0.00676189363002777 -0.000116239287308417 5.85982634220272e-05 -1.03821648735902e-05 
0.00754533056169748 -8.21034118416719e-05 5.51546727365348e-05 -9.75290822680108e-06 
0.00809681043028831 -5.34497230546549e-05 5.05013413203415e-05 -8.9333634605282e-06 
0.00841217394918203 -3.14860117214266e-05 4.46753874712158e-05 -8.18475018604659e-06 
0.00855370610952377 -1.38837258418789e-05 3.95140923501458e-05 -7.75510852690786e-06 
0.00852504000067711 7.6856764508193e-07 3.5560082324082e-05 -7.19440595275955e-06 
0.00835364405065775 1.10506698547397e-05 3.2781383197289e-05 -6.72329178996733e-06 
0.00810911040753126 1.83913562068483e-05 3.08515955111943e-05 -6.31688908470096e-06 
0.00786362495273352 2.41662964981515e-05 2.94466626655776e-05 -6.00283465246321e-06 
0.00761375995352864 2.88943683699472e-05 2.83679764834233e-05 -5.58765168534592e-06 
0.00737635931000113 3.20443068630993e-05 2.75888069154462e-05 -5.33011643710779e-06 
0.00715904589742422 3.49625624949113e-05 2.68585681624245e-05 -4.88056821268401e-06 
0.00694087706506252 3.75512936443556e-05 2.63557831203798e-05 -4.51302275905618e-06 
0.00670952489599586 3.94838716601953e-05 2.61501427303301e-05 -4.13294083045912e-06 
0.00647547282278538 4.13313682656735e-05 2.61049990513129e-05 -3.8573521123908e-06 
0.00623240694403648 4.32901506428607e-05 2.61323384620482e-05 -3.4420099837007e-06 
0.00600806344300508 4.52160638815258e-05 2.60735887422925e-05 -3.1867587040324e-06 
0.00578478304669261 4.71348976134323e-05 2.58641957771033e-05 -2.98544568977377e-06 
0.00555866118520498 4.87413053633645e-05 2.56089679169236e-05 -2.93849825538928e-06 
0.00536111928522587 5.02265393151902e-05 2.53741854976397e-05 -2.69059864876908e-06 
0.00521603645756841 5.17927619512193e-05 2.49681816058001e-05 -2.52521317634091e-06 
0.00510703818872571 5.2107367082499e-05 2.47287334786961e-05 -2.32724232773762e-06 
0.00508192786946893 5.26362891832832e-05 2.45231458393391e-05 -2.08361302611593e-06 
0.0051496266387403 5.3848052630201e-05 2.44453622144647e-05 -1.66924382938305e-06 
0.00529426988214254 5.52854908164591e-05 2.42481401073746e-05 -1.35014602165029e-06 
0.00548600917682052 5.64681467949413e-05 2.42478290601866e-05 -9.56274107011268e-07 
0.00575732765719295 5.87913891649805e-05 2.41109228227288e-05 -5.3761766594107e-07 
0.00609190529212356 6.10127426625695e-05 2.40822446357924e-05 3.50798181614209e-08 
0.0064864051528275 6.27624176559038e-05 2.41592406382551e-05 7.83607276844123e-07 
0.0069225924089551 6.41896185697988e-05 2.44236362050287e-05 1.61826778821705e-06 
0.0074020866304636 6.54634277452715e-05 2.48007454501931e-05 2.54267479249393e-06 
0.00786874070763588 6.59674115013331e-05 2.53929320024326e-05 3.45766534337599e-06 
0.00832032971084118 6.5990214352496e-05 2.58824657066725e-05 4.48314040113473e-06 
0.00873316265642643 6.5607309807092e-05 2.61616733041592e-05 5.40669316251297e-06 
0.00912147480994463 6.51410664431751e-05 2.62596331594978e-05 6.22079232925898e-06 
0.00946601945906878 6.4930078224279e-05 2.63426773017272e-05 7.11479879100807e-06 
0.00980435498058796 6.51267400826328e-05 2.6335883376305e-05 8.02431986812735e-06 
0.0101288864389062 6.53429451631382e-05 2.64485552179394e-05 8.76903231983306e-06 
0.0104556661099195 6.60036894259974e-05 2.65519938693615e-05 9.40222525969148e-06 
0.0107937678694725 6.6783199144993e-05 2.6602845537127e-05 1.00958541224827e-05 
0.0111520141363144 6.75296469125897e-05 2.64283644355601e-05 1.05569752122392e-05 
0.0115391109138727 6.84209808241576e-05 2.60435299423989e-05 1.09341526695061e-05 
0.0119455922394991 6.93184119882062e-05 2.56748371612048e-05 1.12800007627811e-05 
0.0123887890949845 7.01504468452185e-05 2.53770795097807e-05 1.16317078209249e-05 
0.0128478249534965 7.06225691828877e-05 2.52692552749068e-05 1.18942625704221e-05 
0.013362635858357 7.12234032107517e-05 2.50584289460676e-05 1.22360606837901e-05 
0.0139307696372271 7.07387662259862e-05 2.50117609539302e-05 1.26484828797402e-05 
0.0146006550639868 7.08055522409268e-05 2.48853993980447e-05 1.31229471662664e-05 
0.0153850931674242 7.06668724888004e-05 2.48759133683052e-05 1.34949896164471e-05 
0.0163069665431976 7.00071759638377e-05 2.50133361987537e-05 1.413812606188e-05 
0.0173228662461042 6.77439675200731e-05 2.5710145564517e-05 1.45232716022292e-05 
0.0184255447238684 6.58872522762977e-05 2.64539394265739e-05 1.4800798453507e-05 
0.0195577330887318 6.18910053162836e-05 2.7389240131015e-05 1.47928221849725e-05 
0.0206415429711342 5.6368917284999e-05 2.84759498754283e-05 1.48809594975319e-05 
0.0215842090547085 4.89897720399313e-05 2.9183493097662e-05 1.41897126013646e-05 
0.0223453957587481 4.12866575061344e-05 2.89854324364569e-05 1.34017536765896e-05 
0.0227908119559288 3.12514275719877e-05 2.90223542833701e-05 1.23215095300111e-05 
0.0229086354374886 2.25862004299415e-05 2.89938088826602e-05 1.13066407720908e-05 
0.0226715337485075 1.58669845404802e-05 2.89099298242945e-05 1.00471688710968e-05 
0.0221590995788574 1.3357687748794e-05 2.86470331047894e-05 9.02928513824008e-06 
0.0213818568736315 1.35070476972032e-05 2.82498149317689e-05 8.38450250739697e-06 
0.0204947106540203 1.67914986377582e-05 2.69976844720077e-05 8.32732621347532e-06 
0.0195589624345303 2.16085863939952e-05 2.52741410804447e-05 8.41317614685977e-06 
0.0186936613172293 2.79707655863604e-05 2.28577737289015e-05 9.03395175555488e-06 
0.0179059244692326 3.29134527419228e-05 2.08951150852954e-05 9.92870536720147e-06 
0.0172900184988976 3.67615793948062e-05 1.96122491615824e-05 1.07110245153308e-05 
0.0168296527117491 4.14337555412203e-05 1.8816914234776e-05 1.14206777652726e-05 
0.016548328101635 4.5741591748083e-05 1.82315179699799e-05 1.21211969599244e-05 
0.0163822025060654 4.91333994432352e-05 1.81582927325508e-05 1.25480373753817e-05 
0.0163458958268166 5.30950601387303e-05 1.76423836819595e-05 1.27035109471763e-05 
0.0163944233208895 5.66960843570996e-05 1.67701582540758e-05 1.29446498249308e-05 
0.0165092516690493 5.90325726079755e-05 1.57615158968838e-05 1.31308834170341e-05 
0.0166757702827454 6.11703508184291e-05 1.46500669870875e-05 1.3143826436135e-05 
0.0169694814831018 6.33092422503978e-05 1.33922294480726e-05 1.29879854284809e-05 
0.0174295343458652 6.6225984483026e-05 1.21389311971143e-05 1.31934930323041e-05 
0.0182517785578966 7.32224871171638e-05 1.07374453364173e-05 1.37069746415364e-05 
0.0197920929640532 8.65569018060341e-05 8.04925002739765e-06 1.47868286148878e-05 
0.0227271728217602 0.000113379741378594 5.26752546647913e-06 1.78411646629684e-05 
0.0281147193163633 0.000158381837536581 2.39877567764779e-06 2.44590064539807e-05 
0.0369539521634579 0.000219575871597044 -1.7589798062545e-06 3.46686101693194e-05 
0.0503897331655025 0.000291310658212751 -5.25805717188632e-06 4.94425548822619e-05 
0.0687724575400352 0.000356366479536518 -8.53263372846413e-06 6.52768212603405e-05 
0.0913904681801796 0.000390416942536831 -1.30388543766458e-05 7.88841716712341e-05 
0.116399869322777 0.000374210503650829 -1.49854304254404e-05 8.85694971657358e-05 
0.141481339931488 0.000310819392325357 -1.46272896017763e-05 9.12210234673694e-05 
0.163812309503555 0.000190140985068865 -7.02600164004252e-06 8.58313651406206e-05 
0.18194705247879 5.85760681133252e-05 1.27748739942035e-06 7.54122447688133e-05 
0.195223659276962 -6.39301724731922e-05 8.4173998402548e-06 6.50154543109238e-05 
0.203584149479866 -0.00017233491234947 1.55111338244751e-05 5.18062988703605e-05 
0.207903444766998 -0.000262484914856032 2.45531828113599e-05 3.85419116355479e-05 
0.209467768669128 -0.000314369390252978 2.46059771598084e-05 2.65629187197192e-05 
0.208929389715195 -0.000348359753843397 2.19391258724499e-05 1.79139224201208e-05 
0.206743314862251 -0.00037813454400748 2.17292581510264e-05 8.19287106423872e-06 
0.203558713197708 -0.000392400397686288 1.69860632013297e-05 -8.44570422486868e-08 
0.199812710285187 -0.000386743049602956 6.41071528661996e-06 -2.77351159638783e-06 
0.195527508854866 -0.000381513818865642 -3.94152948501869e-06 -7.16509521225817e-06 
0.19112154841423 -0.000382718892069533 -1.34652764245402e-05 -1.33075427584117e-05 
0.186535462737083 -0.000372351380065084 -2.08589353860589e-05 -1.58784860104788e-05 
0.182148143649101 -0.000351389840943739 -2.5705940061016e-05 -1.89695583685534e-05 
0.177724957466125 -0.000332722556777298 -2.58025156654185e-05 -2.38360298681073e-05 
0.173388540744781 -0.000305819616187364 -2.27382970479084e-05 -2.66776769421995e-05 
0.169044971466064 -0.00026884040562436 -1.8930652004201e-05 -2.82883465843042e-05 
0.164566352963448 -0.000234906256082468 -1.71069041243754e-05 -3.35067561536562e-05 
0.159770429134369 -0.000198591995285824 -1.58055700012483e-05 -3.44980653608218e-05 
0.154789716005325 -0.000159512914251536 -1.5273582903319e-05 -3.64178158633877e-05 
0.149856969714165 -0.000116702729428653 -1.57410086103482e-05 -4.00920216634404e-05 
0.144535958766937 -6.96674178470857e-05 -1.33046005430515e-05 -4.10211796406657e-05 
0.139390528202057 -1.68781716638478e-05 -9.53920971369371e-06 -4.14444803027436e-05 
0.134353503584862 3.45594053214882e-05 -5.24438792126602e-06 -4.30454711022321e-05 
0.129323661327362 8.88674694579095e-05 -2.30315981752938e-06 -4.41390948253684e-05 
0.124136060476303 0.00014516401279252 -4.01242414227454e-06 -4.15070207964163e-05 
0.118884466588497 0.000196424109162763 -8.49227853905177e-06 -4.13759480579756e-05 
0.113468535244465 0.000250070006586611 -1.34304000312113e-05 -3.93382069887593e-05 
0.107825875282288 0.000303503184113652 -1.64902012329549e-05 -3.96321265725419e-05 
0.102032691240311 0.000354747549863532 -1.69108352565672e-05 -3.9298422052525e-05 
0.096083477139473 0.000402996607590467 -1.18356028906419e-05 -4.01616198359989e-05 
0.090122327208519 0.000454244407592341 -4.16660304836114e-06 -4.03025951527525e-05 
0.0841027572751045 0.0005016780924052 2.74800481747661e-06 -4.1190465708496e-05 
0.0781287401914597 0.000549412157852203 7.14991801942233e-06 -3.96988580178004e-05 
0.0724189430475235 0.000599177728872746 8.88049999048235e-06 -3.80051060346887e-05 
0.0669906213879585 0.000653444847557694 9.46684212976834e-06 -3.42804050887935e-05 
0.0618777088820934 0.000704134698025882 8.67365633894224e-06 -3.07510599668603e-05 
0.0571279898285866 0.000751937332097441 6.63180480842129e-06 -2.59170283243293e-05 
0.0527007281780243 0.000793140789028257 3.24587881550542e-06 -2.1303241737769e-05 
0.048384178429842 0.00082296459004283 -5.74276953102526e-07 -1.64106495503802e-05 
0.0441058352589607 0.000838561507407576 -5.18605293109431e-06 -1.16609262477141e-05 
0.0399546138942242 0.00084050337318331 -1.0735210707935e-05 -6.45176078251097e-06 
0.0358304716646671 0.000827131443656981 -1.58149978233268e-05 -1.87296063813847e-06 
0.0318131037056446 0.00079895491944626 -2.02850187633885e-05 3.122533826172e-06 
0.0280008390545845 0.000755973742343485 -2.43594058702001e-05 7.07719163983711e-06 
0.0244609657675028 0.000699530588462949 -2.83858389593661e-05 9.68584299698705e-06 
0.021066814661026 0.000630591239314526 -3.10355280817021e-05 1.14378663056414e-05 
0.0178658552467823 0.000552266661543399 -3.24134125548881e-05 1.1705457836797e-05 
0.0148526206612587 0.000468775659101084 -3.22903288179077e-05 1.09292404886219e-05 
0.0120976818725467 0.00038626030436717 -3.08832750306465e-05 9.65618073678343e-06 
0.0096470545977354 0.000308982911519706 -2.84354682662524e-05 8.24404105514986e-06 
0.00752495089545846 0.000240112203755416 -2.52489571721526e-05 6.69674000164378e-06 
0.00575688295066357 0.000181719311513007 -2.15381933230674e-05 5.53210202269838e-06 
0.00434199254959822 0.000133980604005046 -1.76201720023528e-05 4.23874280386372e-06 
0.00322543364018202 9.62968115345575e-05 -1.3954108908365e-05 3.07597497339884e-06 
0.00236310833133757 6.81350138620473e-05 -1.07384967122925e-05 2.20133938455547e-06 
0.00173249328508973 4.70684208266903e-05 -8.07022934168344e-06 1.52742154568841e-06 
0.00128787220455706 3.33490570483264e-05 -5.70077327211038e-06 9.75088255472656e-07 
0.000985636841505766 2.51157944148872e-05 -2.82794394479424e-06 5.18329045462451e-07 
0.000810589350294322 2.2164786059875e-05 1.05092647117999e-06 9.52445589064155e-08 
0.000727976381313056 2.3935892386362e-05 7.14747966412688e-06 -3.10829847194327e-07 
0.000715613481588662 3.15045326715335e-05 1.64246885105968e-05 -9.60782131187443e-07 
0.000822138856165111 4.46536942035891e-05 2.95472545985831e-05 -1.95027269001002e-06 
0.00101868226192892 6.48557470412925e-05 4.74839398520999e-05 -3.28687974615605e-06 
0.00130567059386522 9.19744925340638e-05 7.1312599175144e-05 -4.87571151097654e-06 
0.00168658653274179 0.000127488732687198 0.000101686164271086 -7.30209467292298e-06 
0.00217946851626039 0.000171149411471561 0.000139563984703273 -1.03421361927758e-05 
0.00269416207447648 0.000218160887015983 0.000179637732799165 -1.33644871311844e-05 
0.00333857163786888 0.000276682811090723 0.000231330850510858 -1.75544428202556e-05 
0 0 0 0 
0 0 0 0 
0 0 0 0 
0 0 0 0 
0 0 0 0 
0 0 0 0 
0 0 0 0 
0 0 0 0 
0 0 0 0 
0 0 0 0 
0 0 0 0 
0 0 0 0 
0 0 0 0 
0 0 0 0 
99.5559234619141 0.355047106742859 0.0461748205125332 0.0312100686132908 
