0.000645164109300822 0.00880112033337355 
0.000719070434570313 0.00103373185265809 
0.000815994630102068 -0.00405818223953247 
0.000996340881101787 -0.00884902477264404 
0.00122695451136678 -0.0125744510442019 
0.00154425064101815 -0.0185824744403362 
0.00184404395986348 -0.0236846450716257 
0.00216989102773368 -0.0296132285147905 
0.00248053367249668 -0.0332798101007938 
0.00281604053452611 -0.0367895811796188 
0.00312640541233122 -0.0378480479121208 
0.00338398525491357 -0.0376344583928585 
0.0036222159396857 -0.0353795140981674 
0.00381245650351048 -0.0323175713419914 
0.00401728693395853 -0.0275557730346918 
0.00411006016656756 -0.0209365095943213 
0.00412783492356539 -0.0141665954142809 
0.00400676624849439 -0.0104093486443162 
0.00385358324274421 -0.00828578043729067 
0.00364981708116829 -0.00594262173399329 
0.00342636951245368 -0.00348588242195547 
0.00316803413443267 -0.00131050788331777 
0.00293070753104985 -0.000499158864840865 
0.00276589742861688 0.000542233581654727 
0.00268238317221403 0.000943852413911372 
0.00268329889513552 0.000953592476435006 
0.00276820082217455 0.000405361846787855 
0.00295818410813808 0.000471382139949128 
0.0031828114297241 0.00049730361206457 
0.00340961362235248 0.000449137354735285 
0.00358923035673797 0.000460123701486737 
0.00371251511387527 0.000202968294615857 
0.00376654183492064 -0.000101696372439619 
0.00373989972285926 -0.0006870839279145 
0.00368894287385046 0.000213686042116024 
0.00360055593773723 0.00163595972117037 
0.00353418616577983 0.00260885991156101 
0.00356830074451864 0.00207283347845078 
0.00376750295981765 0.00137277704197913 
0.00423260265961289 8.48843410494737e-05 
0.00502271251752973 -0.000991088338196278 
0.00632622931152582 -0.00241277553141117 
0.00832916051149368 -0.00386123126372695 
0.0113324765115976 -0.00709383469074965 
0.0156374704092741 -0.0111207822337747 
0.021498316898942 -0.019096864387393 
0.0290374252945185 -0.0261358805000782 
0.0379011742770672 -0.0344952382147312 
0.0476229637861252 -0.038511335849762 
0.0576766654849052 -0.0402570031583309 
0.0673730000853539 -0.0346393696963787 
0.0765689685940742 -0.032371774315834 
0.0847116336226463 -0.0217688232660294 
0.0919426307082176 -0.016148179769516 
0.0982843935489655 -0.00394584657624364 
0.103670813143253 -0.000265174632659182 
0.108037993311882 0.0077160457149148 
0.111390687525272 0.0096663236618042 
0.114138044416904 0.0245034545660019 
0.116333648562431 0.0221000276505947 
0.118120424449444 0.0261709429323673 
0.119548670947552 0.0132503267377615 
0.12108438462019 0.0267677623778582 
0.122411109507084 0.0202811099588871 
0.123409174382687 0.0221870522946119 
0.124046117067337 0.0136096449568868 
0.124424546957016 0.0322322733700275 
0.124756306409836 0.0291924402117729 
0.124948628246784 0.0194574128836393 
0.125229582190514 0.00377433048561215 
0.12552136182785 -0.000718386494554579 
0.126012951135635 -0.00274923187680542 
0.126579746603966 -0.0114688165485859 
0.127307444810867 -0.00888529606163502 
0.127976194024086 -0.0238400623202324 
0.1284409314394 -0.0268456730991602 
0.128946214914322 -0.0347803495824337 
0.129097893834114 -0.0430296249687672 
0.129235997796059 -0.0526261515915394 
0.129243195056915 -0.0611787810921669 
0.129593685269356 -0.046771589666605 
0.129601612687111 -0.0487998127937317 
0.129427805542946 -0.035885039716959 
0.129093244671822 -0.0395227074623108 
0.128828480839729 -0.0207100342959166 
0.128542363643646 -0.0272662863135338 
0.127778589725494 -0.0178144164383411 
0.127170607447624 -0.0219050142914057 
0.12630569934845 -0.0165128502994776 
0.125731110572815 -0.0159544665366411 
0.124935135245323 -0.028713146224618 
0.124113798141479 -0.0420899577438831 
0.123161315917969 -0.0377578809857368 
0.121994905173779 -0.0412670597434044 
0.120807141065598 -0.0228254701942205 
0.119460999965668 -0.0313384495675564 
0.118397191166878 -0.0308937914669514 
0.117218159139156 -0.0549698546528816 
0.11630217730999 -0.0646544992923737 
0.115556970238686 -0.0505099147558212 
0.115110591053963 -0.0398709550499916 
0.114817887544632 -0.0287522040307522 
0.114304445683956 -0.0321252457797527 
0.113778799772263 -0.0389209873974323 
0.112877942621708 -0.0355434790253639 
0.111714117228985 -0.0399219170212746 
0.109975941479206 -0.032754223793745 
0.10828460007906 -0.0295446570962667 
0.106419242918491 -0.0346555262804031 
0.104270964860916 -0.0375653579831123 
0.101920329034328 -0.050616055727005 
0.0995333194732666 -0.0312626175582409 
0.0973125323653221 -0.0208600647747517 
0.0952484160661697 -0.0134122557938099 
0.0931565389037132 -0.014048951677978 
0.0913909748196602 -0.0139826294034719 
0.0894434973597527 -0.00200106552802026 
0.0873096808791161 0.00954266916960478 
0.0852618813514709 0.0262152906507254 
0.0828604996204376 0.0367923490703106 
0.0804361924529076 0.0545649342238903 
0.0776251927018166 0.0621755495667458 
0.0747039914131165 0.0656481683254242 
0.0718987062573433 0.0567054562270641 
0.0691323950886726 0.0666847676038742 
0.0663446485996246 0.0771520808339119 
0.0633406862616539 0.092360831797123 
0.0601667985320091 0.106255374848843 
0.0569770708680153 0.127202332019806 
0.0538276210427284 0.14455409348011 
0.0504328645765781 0.156843066215515 
0.0471173115074635 0.177547097206116 
0.0437118336558342 0.194677919149399 
0.0404851324856281 0.216007068753242 
0.0371666364371777 0.222870618104935 
0.0339415296912193 0.236480593681335 
0.0307583194226027 0.242138966917992 
0.0277268029749393 0.249498352408409 
0.0247148964554071 0.251266956329346 
0.0218808706849813 0.253554970026016 
0.0192014463245869 0.245360240340233 
0.0167409610003233 0.238612323999405 
0.0143066914752126 0.22290275990963 
0.0119845476001501 0.209103137254715 
0.0098603144288063 0.187621340155602 
0.00802920665591955 0.167139410972595 
0.00647547096014023 0.146708130836487 
0.00516114570200443 0.123816475272179 
0.00406275782734156 0.102171666920185 
0.00315130315721035 0.080011285841465 
0.00243305624462664 0.0611006356775761 
0.00186198682058603 0.0442006215453148 
0.00142967433203012 0.0307390205562115 
0.00110269209835678 0.0218580216169357 
0.000859725929331034 0.014822113327682 
0.000685801613144577 0.0110961804166436 
0.000555336009711027 0.00716359494253993 
0.00044400998740457 0.00482706120237708 
0.000360012927558273 0.00199794443324208 
0.000276228063739836 0.000230696867220104 
0.000233112747082487 -0.000928500900045037 
0.00020154808589723 -0.000729538267478347 
0.000158556300448254 -0.00108980154618621 
0.000118614487291779 -0.00122565904166549 
7.38075032131746e-05 -0.00180985557381064 
7.25378631614149e-05 -0.00126005802303553 
7.95928644947708e-05 -0.000987538951449096 
7.59277099859901e-05 -0.00109850475564599 
6.04173219471704e-05 -0.00141398631967604 
3.78630320483353e-05 -0.00133178278338164 
2.89688159682555e-05 -0.00127497676294297 
3.35903750965372e-05 -0.000630738388281316 
3.91934045183007e-05 -0.000592810451053083 
3.06204929074738e-05 -0.000357619253918529 
3.50806258211378e-05 -0.00101380923297256 
3.56675118382555e-05 -0.00103581859730184 
3.15030447382014e-05 -0.000887423055246472 
2.17176893784199e-05 -0.000495105981826782 
1.32340037453105e-05 -0.000645272200927138 
3.05045159620931e-05 -0.000662508304230869 
2.3714605049463e-05 -0.000511793536134064 
1.80342813109746e-05 -0.000385785126127303 
2.22817220674187e-06 -0.00066142959985882 
1.20324139061267e-05 -0.000462477502878755 
3.48105277225841e-06 -0.000403820275096223 
