[
  {
    "color": [
      1,
      0.81750857830047607,
      0.67528265714645386
    ],
    "ignore_ext_mv": true,
    "intensity_diff": 0.060000002384185791,
    "intensity_spec": 0,
    "ltc_two_sided": true,
    "name": "key",
    "onnoff": true,
    "rel_rot": [
      -0.16391682624816895,
      -0.55968159437179565,
      0
    ],
    "rel_scale": [
      2,
      1
    ],
    "rel_trans": [
      -0.31427988409996033,
      0.097910270094871521,
      0.50163906812667847
    ],
    "shadow_cast": false,
    "type": "POINT"
  },
  {
    "color": [
      0,
      1,
      0.85357564687728882
    ],
    "ignore_ext_mv": true,
    "intensity_diff": 6.5,
    "intensity_spec": 0,
    "ltc_two_sided": true,
    "name": "fill",
    "onnoff": true,
    "rel_rot": [
      0,
      0.51831483840942383,
      5
    ],
    "rel_scale": [
      2,
      2
    ],
    "rel_trans": [
      1.8082722425460815,
      0,
      3.1705918312072754
    ],
    "shadow_cast": false,
    "type": "POINT"
  },
  {
    "color": [
      0.95418095588684082,
      0.3320290744304657,
      0.86911815404891968
    ],
    "ignore_ext_mv": true,
    "intensity_diff": 15,
    "intensity_spec": 0,
    "ltc_two_sided": true,
    "name": "back",
    "onnoff": false,
    "rel_rot": [
      0.78539812564849854,
      0,
      0
    ],
    "rel_scale": [
      1,
      1
    ],
    "rel_trans": [
      0,
      -3,
      3
    ],
    "shadow_cast": false,
    "type": "AREA"
  }
]
