0 0 0 0 
0 0 0 0 
0 0 0 0 
0 0 0 0 
0 0 0 0 
0 0 0 0 
0 0 0 0 
0 0 0 0 
0 0 0 0 
0 0 0 0 
0.000820613000541925 -1.40840631956962e-06 1.45557487485348e-06 -3.48357343682437e-06 
0.00106052192859352 -5.28662576471106e-06 2.9147456643841e-06 -4.99316911373171e-06 
0.00133145658764988 -9.2883537945454e-06 4.26109545514919e-06 -6.53308870823821e-06 
0.00162793032359332 -1.3026139640715e-05 5.2612249419326e-06 -7.96797212387901e-06 
0.00203011580742896 -1.71698648046004e-05 5.42544512427412e-06 -9.06787863641512e-06 
0.00251351296901703 -1.92511361092329e-05 5.26837811776204e-06 -9.79995093075559e-06 
0.00302351615391672 -1.86143570317654e-05 4.6210170694394e-06 -9.90370062936563e-06 
0.00354418531060219 -1.55850739247398e-05 3.25876726492424e-06 -8.9819432105287e-06 
0.00402850238606334 -1.02628355307388e-05 1.44006730806723e-06 -7.14809948476613e-06 
0.0043820459395647 -1.74981585132628e-06 -2.31765881153478e-07 -4.83217218061327e-06 
0.00459205219522119 6.63721039018128e-06 -2.08932510759041e-06 -2.1452326564031e-06 
0.0047046821564436 1.39052253871341e-05 -3.89984688808909e-06 3.67148913937854e-07 
0.00474891532212496 2.04520474653691e-05 -5.28912369190948e-06 2.37106723943725e-06 
0.00475711701437831 2.62448356806999e-05 -6.18519379713689e-06 3.78598610950576e-06 
0.00478911958634853 3.09891547658481e-05 -6.88297905071522e-06 4.71118210043642e-06 
0.00490621943026781 3.59499936166685e-05 -7.35224375603138e-06 5.45408283869619e-06 
0.00512580294162035 4.14132846344728e-05 -7.82824008638272e-06 6.12617304796004e-06 
0.00544757442548871 4.68613361590542e-05 -8.36818708194187e-06 6.68083566779387e-06 
0.00585962226614356 5.20650464750361e-05 -9.27107976167463e-06 7.30013562133536e-06 
0.0063172965310514 5.66506168979686e-05 -1.02728026831755e-05 8.05668241810054e-06 
0.00676193227991462 5.93116674281191e-05 -1.16954024633742e-05 8.82560289028334e-06 
0.0071493280120194 5.9970494476147e-05 -1.33825815282762e-05 9.70615747064585e-06 
0.00744637055322528 5.89573828619905e-05 -1.53223390952917e-05 1.05976059785462e-05 
0.00764400325715542 5.54826692678034e-05 -1.75534441950731e-05 1.16714254545514e-05 
0.00775370374321938 5.05832067574374e-05 -2.01036291400669e-05 1.30378230096539e-05 
0.00781708490103483 4.67315221612807e-05 -2.269785363751e-05 1.47362225106917e-05 
0.00791278015822172 4.73605396109633e-05 -2.4671857318026e-05 1.62336255016271e-05 
0.00814370810985565 5.31430960108992e-05 -2.60265023825923e-05 1.77488618646748e-05 
0.00860614888370037 6.60240184515715e-05 -2.66853439825354e-05 1.91999151866185e-05 
0.00942857190966606 8.74931865837425e-05 -2.65199814748485e-05 2.05189935513772e-05 
0.0107681313529611 0.000118756433948874 -2.57452156802174e-05 2.17050910578109e-05 
0.0128028644248843 0.000157574206241407 -2.492496787454e-05 2.36556043091696e-05 
0.0157032981514931 0.000205796284717508 -2.36182149819797e-05 2.56881157838507e-05 
0.0196928549557924 0.000264584843534976 -2.13534713111585e-05 2.78465813607909e-05 
0.0249424856156111 0.000330588693032041 -1.72985110111767e-05 2.94223355012946e-05 
0.0315568372607231 0.00040066460496746 -1.04879936770885e-05 2.97975184366805e-05 
0.0395018234848976 0.000472286104923114 -7.40986081382289e-07 2.79757532553049e-05 
0.048574261367321 0.000538215623237193 1.15364955490804e-05 2.39816963585326e-05 
0.0583766289055347 0.00058814772637561 2.55295217357343e-05 1.76508201548131e-05 
0.0685689151287079 0.000621349492575973 3.83727019652724e-05 9.86492341326084e-06 
0.0786698907613754 0.000630183145403862 4.83398216601927e-05 1.73570549577562e-06 
0.0883299186825752 0.000612920499406755 5.41359113412909e-05 -5.37566347702523e-06 
0.0973023027181625 0.000574765668716282 5.3327592468122e-05 -1.23309846458142e-05 
0.105598129332066 0.000520457280799747 4.53100074082613e-05 -1.71392148331506e-05 
0.112968392670155 0.0004536944325082 3.37854944518767e-05 -2.04942934942665e-05 
0.119422368705273 0.000384420389309525 1.89502425200772e-05 -2.19361900235526e-05 
0.125062748789787 0.000317834201268852 4.71096427645534e-06 -2.31372578127775e-05 
0.129940703511238 0.000254655431490391 -7.86355576565256e-06 -2.27050750254421e-05 
0.134135872125626 0.000199696252821013 -1.70285893545952e-05 -2.14286701520905e-05 
0.137773334980011 0.000151150466990657 -2.46180879912572e-05 -2.00152171601076e-05 
0.140987783670425 0.000108812957478222 -2.96036596409976e-05 -1.89464662980754e-05 
0.143694072961807 7.49183745938353e-05 -3.47210516338237e-05 -1.83378633664688e-05 
0.145992338657379 4.77126013720408e-05 -3.77471296815202e-05 -1.71233277797e-05 
0.147785410284996 2.02815845113946e-05 -3.99435266444925e-05 -1.7508449673187e-05 
0.14911575615406 6.64579090425832e-07 -4.19493844674435e-05 -1.7681146346149e-05 
0.15005661547184 -1.98416928469669e-05 -4.3602725781966e-05 -1.67290199897252e-05 
0.150749891996384 -3.29886934196111e-05 -4.43653661932331e-05 -1.56585538206855e-05 
0.15109384059906 -4.7085020923987e-05 -4.40645926573779e-05 -1.58135408128146e-05 
0.151292189955711 -4.86771277792286e-05 -4.40391959273256e-05 -1.44461382660666e-05 
0.151449307799339 -5.68607101740781e-05 -4.31817934440915e-05 -1.25109836517368e-05 
0.151457265019417 -5.48145253560506e-05 -4.19382377003785e-05 -1.25488468256663e-05 
0.151347801089287 -6.57901182421483e-05 -4.01144934585318e-05 -1.13262740342179e-05 
0.151253327727318 -7.64473006711341e-05 -3.92984911741223e-05 -7.64501419325825e-06 
0.150995954871178 -9.37695658649318e-05 -3.62401442544069e-05 -5.06552987644682e-06 
0.150644227862358 -0.00010049476986751 -3.32587223965675e-05 -2.70208829533658e-06 
0.150251477956772 -0.000112855937913992 -3.12698248308152e-05 7.78988606953135e-08 
0.149866819381714 -0.000112598958367016 -2.85711139440536e-05 3.50676236848813e-06 
0.149255931377411 -0.00010595175990602 -2.58547206613002e-05 5.8931550483976e-06 
0.148496672511101 -0.000103799742646515 -2.54864062299021e-05 8.94670483830851e-06 
0.147584840655327 -0.000106735205918085 -2.29030738410074e-05 1.13519181468291e-05 
0.146480545401573 -9.86236846074462e-05 -1.85401786438888e-05 1.35924674395937e-05 
0.145025998353958 -0.000105900231574196 -1.64945977303432e-05 1.49869329106878e-05 
0.14360274374485 -0.000116541377792601 -1.43609286169522e-05 1.40663787533413e-05 
0.142020046710968 -0.000117436509754043 -1.15543325591716e-05 1.27030334624578e-05 
0.140333846211433 -0.000115318121970631 -8.34598267829278e-06 1.16505107143894e-05 
0.138425439596176 -0.000121732948173303 -6.36374306850485e-06 1.1603098755586e-05 
0.136431097984314 -0.00011557658581296 -3.32314266415779e-06 1.14269641926512e-05 
0.134215205907822 -0.000113410431367811 1.19041453672253e-06 1.34320080178441e-05 
0.131782338023186 -0.000110038592538331 7.33816932552145e-06 1.32775785459671e-05 
0.129138290882111 -0.000112289795652032 1.00821725936839e-05 1.40306592584238e-05 
0.126489594578743 -0.000116077841084916 1.54303415911272e-05 1.42313892865786e-05 
0.123661622405052 -0.000124968210002407 1.93065297935391e-05 1.45295653055655e-05 
0.120682872831821 -0.000130594067741185 2.19485373236239e-05 1.51335170812672e-05 
0.11772596091032 -0.000142585107823834 2.50679386226693e-05 1.63826825883007e-05 
0.114580370485783 -0.000148554157931358 2.82302462437656e-05 1.62728265422629e-05 
0.11142210662365 -0.000150118285091594 3.02779644698603e-05 1.59480041475035e-05 
0.108175605535507 -0.000148795777931809 3.35678741976153e-05 1.39574285640265e-05 
0.104991942644119 -0.000144284058478661 3.58385950676166e-05 1.13332598630222e-05 
0.101943366229534 -0.000142507531563751 3.61536403943319e-05 1.14956064862781e-05 
0.0990113019943237 -0.000142793156555854 3.77417709387373e-05 1.22717565318453e-05 
0.0959191024303436 -0.000140056014060974 3.93826376239303e-05 1.23053723655175e-05 
0.0928668603301048 -0.000134435016661882 4.06255712732673e-05 1.30377547975513e-05 
0.0896447524428368 -0.000133562949486077 4.28385101258755e-05 1.23951831483282e-05 
0.0861382335424423 -0.000126011655083857 4.46997291874141e-05 1.02917310869088e-05 
0.0823844149708748 -0.000116304800030775 4.7973186156014e-05 7.63395746616879e-06 
0.0783269628882408 -0.00011662643373711 4.95869571750518e-05 5.08565017298679e-06 
0.0739105045795441 -0.000121178338304162 5.1385497499723e-05 3.10720292873157e-06 
0.0692385360598564 -0.000122197365271859 5.2880172006553e-05 2.01001148525393e-06 
0.0643788129091263 -0.000123522142530419 5.4837844800204e-05 1.07911080249323e-06 
0.0594389215111732 -0.000126575367175974 5.62310124223586e-05 -2.24393417624924e-07 
0.0545699521899223 -0.00012720785161946 5.72645367356017e-05 -8.23073435185506e-07 
0.0498833879828453 -0.000122377925436012 5.78841463720892e-05 -1.94085896509932e-06 
0.0454152710735798 -0.000118607829790562 5.80858140892815e-05 -2.66050665231887e-06 
0.0412697792053223 -0.000115638780698646 5.77475984755438e-05 -3.36971606884617e-06 
0.0374374836683273 -0.000109950218757149 5.58440151507966e-05 -4.04931779485196e-06 
0.0340212173759937 -0.000100730299891438 5.42353300261311e-05 -4.71295516035752e-06 
0.0310015175491571 -9.30467576836236e-05 5.29539502167609e-05 -5.23100652571884e-06 
0.028334517031908 -8.35239989100955e-05 5.15126375830732e-05 -5.91566367802443e-06 
0.0259633958339691 -7.30582323740236e-05 4.98183326271828e-05 -6.60515570416464e-06 
0.0238853059709072 -6.48568966425955e-05 4.80467133456841e-05 -6.55338499200298e-06 
0.0220414660871029 -5.57145540369675e-05 4.69829319627024e-05 -7.03583009453723e-06 
0.0204274654388428 -4.81481220049318e-05 4.53980719612446e-05 -7.17382181392168e-06 
0.0190307348966599 -4.18699455622118e-05 4.37468916061334e-05 -7.18256660547922e-06 
0.0177699644118547 -3.55963748006616e-05 4.20498545281589e-05 -7.21557262295391e-06 
0.016681794077158 -2.96131238428643e-05 4.05425635108259e-05 -7.28172335584532e-06 
0.0157253816723824 -2.58781838056166e-05 3.86012179660611e-05 -6.97377072356176e-06 
0.014860556460917 -2.18689601751976e-05 3.70955567632336e-05 -6.58508997730678e-06 
0.0140468375757337 -1.80985880433582e-05 3.52581992046908e-05 -6.11358791502425e-06 
0.0132943410426378 -1.55301677295938e-05 3.3717409678502e-05 -5.73996430830448e-06 
0.0125628709793091 -1.33378216560232e-05 3.19670434691943e-05 -5.30100214746199e-06 
0.0118603175505996 -1.16799210445606e-05 3.04230634355918e-05 -4.79236268802197e-06 
0.0111845377832651 -1.08018666651333e-05 2.87128095806111e-05 -4.48120908913552e-06 
0.0105399368330836 -1.0536969966779e-05 2.70934815489454e-05 -4.19036086896085e-06 
0.00992635078728199 -1.04628898043302e-05 2.54952083196258e-05 -3.84890427085338e-06 
0.0093526029959321 -1.04124428617069e-05 2.39398705161875e-05 -3.71811051991244e-06 
0.00881349109113216 -1.01129444374237e-05 2.22820381168276e-05 -3.62864284397801e-06 
0.00831970945000648 -9.50517096498515e-06 2.07518660317874e-05 -3.47755008078821e-06 
0.00787005387246609 -8.3010017988272e-06 1.93478826986393e-05 -3.32982494910539e-06 
0.00746690575033426 -6.79509867040906e-06 1.78551708813757e-05 -2.97597512144421e-06 
0.007102913223207 -4.66691290057497e-06 1.63744589372072e-05 -2.52928884947323e-06 
0.00676877703517675 -1.58681223183521e-06 1.48232365972945e-05 -1.97286226466531e-06 
0.00644732872024179 1.68807787304104e-06 1.30543749037315e-05 -1.2249295195943e-06 
0.00612026453018188 5.45304374099942e-06 1.12067518784897e-05 -5.40629116585478e-07 
0.0058001521974802 9.42679889703868e-06 9.26040138438111e-06 6.31761594149793e-08 
0.00546472566202283 1.33972098410595e-05 7.28130999050336e-06 7.98614280483889e-07 
0.00511326361447573 1.62888863997068e-05 5.23164953847299e-06 1.43810007102729e-06 
0.00475279474630952 1.87300374818733e-05 3.40612928084738e-06 2.0934121494065e-06 
0.00437773065641522 2.02151113626314e-05 1.88496858299914e-06 2.7181156383449e-06 
0.00396816851571202 2.11634924198734e-05 5.02076943575958e-07 3.41590794050717e-06 
0.00353734567761421 2.07915672945092e-05 -7.86608666203392e-07 3.93767822970403e-06 
0.00308549869805574 2.05505602934863e-05 -1.91001026905724e-06 4.28564453613944e-06 
0.00263586454093456 1.93553860299289e-05 -2.87760622086353e-06 4.43363705926458e-06 
0.00221164640970528 1.79414200829342e-05 -3.69531267097045e-06 4.58861222796259e-06 
0.0018225529929623 1.57829181262059e-05 -4.1178745959769e-06 4.3501836444193e-06 
0.00148293876554817 1.38269151648274e-05 -4.04579441237729e-06 4.00929275201634e-06 
0.00119881832506508 1.11756280603004e-05 -3.69600229532807e-06 3.65677942681941e-06 
0.000959852884989232 8.75405748956837e-06 -3.16093905894377e-06 3.09401866616099e-06 
0.000764757685828954 7.01841872796649e-06 -2.464636509103e-06 2.51055803346389e-06 
0.000608617265243083 5.45808597962605e-06 -1.87119917427481e-06 1.98423413166893e-06 
0.000486435921629891 4.41316933574853e-06 -1.3857578551324e-06 1.55263421675045e-06 
0.000398359261453152 3.8515549931617e-06 -1.00107411071804e-06 1.1348745374562e-06 
0.000329915637848899 3.53409859599196e-06 -7.29730118109728e-07 7.9795256624493e-07 
0.000275695172604173 3.2647481020831e-06 -8.61441094457405e-07 4.10128649264152e-07 
0.000246283685555682 3.77026435671723e-06 -1.11363294763578e-06 1.05628750191045e-07 
0.000232010381296277 4.64768436359009e-06 -1.59051205628202e-06 -3.0974342735135e-07 
0.000232350037549622 6.26047176410793e-06 -2.28654675993312e-06 -7.06355024249206e-07 
0.000249315955443308 8.91555464477278e-06 -3.22320124723774e-06 -1.15510624709714e-06 
0.000291073287371546 1.22275396279292e-05 -4.43545695816283e-06 -1.67766097547428e-06 
0.000342811894370243 1.65948058565846e-05 -5.92246806263574e-06 -2.421708586553e-06 
0.000398496427806094 2.10883717954857e-05 -7.56087774789194e-06 -3.18118918585242e-06 
0.000482323841424659 2.69841893896228e-05 -9.63082129601389e-06 -4.19874049839564e-06 
0 0 0 0 
0 0 0 0 
0 0 0 0 
0 0 0 0 
0 0 0 0 
0 0 0 0 
0 0 0 0 
0 0 0 0 
0 0 0 0 
0 0 0 0 
0 0 0 0 
0 0 0 0 
0 0 0 0 
0 0 0 0 
99.7310791015625 0.20960159599781 0.0367922224104404 0.0145312082022429 
