0 0 0 0 
0 0 0 0 
0 0 0 0 
0 0 0 0 
0 0 0 0 
0 0 0 0 
0 0 0 0 
0 0 0 0 
0 0 0 0 
0 0 0 0 
0.00130492832977325 -1.89482143468922e-05 -4.94515370519366e-06 1.18431435112143e-05 
0.00184754957444966 -3.10495088342577e-05 -4.9494310587761e-06 1.57908161781961e-05 
0.00244892225600779 -4.36266782344319e-05 -2.17843330574397e-06 2.00054637389258e-05 
0.00308069935999811 -5.54243815713562e-05 1.72237878359738e-06 2.39811579376692e-05 
0.00388094247318804 -6.63913378957659e-05 8.3284985521459e-06 2.74246758635854e-05 
0.00478031625971198 -7.44071148801595e-05 1.73432199517265e-05 3.02120424748864e-05 
0.00569636421278119 -7.74853542679921e-05 2.58114559983369e-05 3.17960511893034e-05 
0.00657539162784815 -7.46343066566624e-05 3.24003995046951e-05 3.14082790282555e-05 
0.00737499864771962 -6.61808153381571e-05 3.65692358172964e-05 2.92592249024892e-05 
0.00792250409722328 -5.35438703082036e-05 3.75408053514548e-05 2.60652905126335e-05 
0.00823839567601681 -3.91062421840616e-05 3.50771988451015e-05 2.19783560169162e-05 
0.0083761615678668 -2.56570638157427e-05 3.22239575325511e-05 1.79002636286896e-05 
0.00835156999528408 -1.57012091221986e-05 2.99492785416078e-05 1.47512055264087e-05 
0.00819035992026329 -8.68238385010045e-06 2.81551328953356e-05 1.25201149785426e-05 
0.00796026736497879 -4.03498461309937e-06 2.68606545432704e-05 1.10551591205876e-05 
0.00769399665296078 -1.02373007848655e-06 2.63055044342764e-05 1.00389206636464e-05 
0.00742834061384201 1.24565713122138e-06 2.5924180590664e-05 9.35732441575965e-06 
0.00718296505510807 2.89478543891164e-06 2.58050567936152e-05 8.77706679602852e-06 
0.00694473693147302 4.47431557404343e-06 2.56857401836896e-05 8.38945197756402e-06 
0.00670733582228422 5.76186494072317e-06 2.57002520811511e-05 8.04458613856696e-06 
0.00646703969687223 6.93012270858162e-06 2.56652801908785e-05 7.84797703090589e-06 
0.00622536800801754 7.73133160691941e-06 2.58439904428087e-05 7.59066142563825e-06 
0.00598835246637464 8.900171451387e-06 2.58703694271389e-05 7.33870319891139e-06 
0.00576306553557515 9.64109403867042e-06 2.60614051512675e-05 6.98760595696513e-06 
0.0055301571264863 1.05001554402406e-05 2.60711731243646e-05 6.8073259171797e-06 
0.00530142989009619 1.1517640814418e-05 2.61075638263719e-05 6.43639486952452e-06 
0.00508995773270726 1.24460275401361e-05 2.6081244868692e-05 6.23828009338467e-06 
0.00493031926453114 1.33205703605199e-05 2.59956359514035e-05 5.93459481024183e-06 
0.00482117338106036 1.43280603879248e-05 2.56660605373327e-05 5.76138427277328e-06 
0.00478678150102496 1.53281362145208e-05 2.54676069744164e-05 5.5075115596992e-06 
0.00483242934569716 1.63075328600826e-05 2.53947073360905e-05 5.45170814802987e-06 
0.00495171267539263 1.74436681845691e-05 2.52565932896687e-05 5.43136502528796e-06 
0.00512105925008655 1.90178579941858e-05 2.50938064709771e-05 5.62300328965648e-06 
0.00535695627331734 2.10142352443654e-05 2.49763543251902e-05 5.85410271014553e-06 
0.0056642172858119 2.33718819799833e-05 2.48569067480275e-05 6.10746155871311e-06 
0.00603370182216167 2.59527114394587e-05 2.46294439421035e-05 6.48149170956458e-06 
0.00644991686567664 2.91492651740555e-05 2.43545000557788e-05 6.94678101353929e-06 
0.00688767060637474 3.221847146051e-05 2.41903653659392e-05 7.56489907871583e-06 
0.00732059311121702 3.49223009834532e-05 2.40382887568558e-05 8.32918249216164e-06 
0.00773982331156731 3.78145632566884e-05 2.35854022321291e-05 9.0856192400679e-06 
0.00811825040727854 4.03536905650981e-05 2.29421984840883e-05 9.78149819275131e-06 
0.00846364255994558 4.23523997596931e-05 2.23570350499358e-05 1.03636903077131e-05 
0.00877624563872814 4.44006582256407e-05 2.17486885958351e-05 1.09113852886367e-05 
0.00908489339053631 4.64376935269684e-05 2.12294507946353e-05 1.13739579319372e-05 
0.00937755778431892 4.7787616495043e-05 2.10472317121457e-05 1.19461637950735e-05 
0.00968278758227825 4.90520724270027e-05 2.10096841328777e-05 1.25028946058592e-05 
0.0100040826946497 4.99369562021457e-05 2.08790916076396e-05 1.31135730043752e-05 
0.0103567978367209 5.05092903040349e-05 2.03921335923951e-05 1.36205535454792e-05 
0.0107376677915454 5.07347540406045e-05 1.96800610865466e-05 1.39980993481004e-05 
0.011138528585434 5.06124488310888e-05 1.89840775419725e-05 1.43414445119561e-05 
0.0115760751068592 5.02336879435461e-05 1.83896445378195e-05 1.4635485058534e-05 
0.0120386332273483 5.00704700243659e-05 1.78176633198746e-05 1.50020496221259e-05 
0.0125512536615133 4.97668806929141e-05 1.73686585185351e-05 1.52654483827064e-05 
0.0131112542003393 4.91971550218295e-05 1.70007679116679e-05 1.56631285790354e-05 
0.0137744722887874 4.90560196340084e-05 1.66407462529605e-05 1.59381634148303e-05 
0.0145448986440897 4.87459874420892e-05 1.65305609698407e-05 1.61730968102347e-05 
0.0154416197910905 4.83619696751703e-05 1.6337527995347e-05 1.66563513630535e-05 
0.0164352729916573 4.71509629278444e-05 1.65021519933362e-05 1.74161614268087e-05 
0.0175276882946491 4.64894619653933e-05 1.66681911650812e-05 1.8026485122391e-05 
0.0186585243791342 4.46735612058546e-05 1.68774622579804e-05 1.87461719178827e-05 
0.0197451878339052 4.25489124609157e-05 1.67619473359082e-05 1.97844856302254e-05 
0.0207156389951706 3.86798201361671e-05 1.67043308465509e-05 2.03345898626139e-05 
0.0215014182031155 3.43802530551329e-05 1.61193838721374e-05 2.04924454010325e-05 
0.0219835862517357 2.84560919681098e-05 1.57260437845252e-05 2.0811503418372e-05 
0.0221199709922075 2.32041711569764e-05 1.53019227582263e-05 2.10489215533016e-05 
0.0219023860991001 1.86381839739624e-05 1.50771766129765e-05 2.08856490644393e-05 
0.0213841088116169 1.63981530931778e-05 1.49259703903226e-05 2.04857224161969e-05 
0.0205950308591127 1.62501437444007e-05 1.47386626849766e-05 1.98826674022712e-05 
0.0196574740111828 1.81239920493681e-05 1.40450038088602e-05 1.89291586139007e-05 
0.0186751019209623 2.09581667149905e-05 1.30553107737796e-05 1.77281090145698e-05 
0.017744917422533 2.51624751399504e-05 1.15846059998148e-05 1.63502681971295e-05 
0.0168919432908297 2.88967512460658e-05 1.03616639535176e-05 1.53094097186113e-05 
0.0162134785205126 3.22822415910196e-05 9.57345037022606e-06 1.45713638630696e-05 
0.0157036315649748 3.58008910552599e-05 9.2407490228652e-06 1.4060975445318e-05 
0.0153606366366148 3.91123394365422e-05 9.15963755687699e-06 1.3607068467536e-05 
0.0151443025097251 4.14813075622078e-05 9.45501142268768e-06 1.33302182803163e-05 
0.0150579605251551 4.40656913269777e-05 9.53638664213941e-06 1.27359699035878e-05 
0.0150567181408405 4.59276379842777e-05 9.37800177780446e-06 1.20471322588855e-05 
0.0151233216747642 4.73023246740922e-05 8.82485710462788e-06 1.15073335109628e-05 
0.0152619648724794 4.86659591842908e-05 8.18867920315824e-06 1.08192434709053e-05 
0.0155338440090418 5.00277055834886e-05 7.64328888180899e-06 9.86784016276943e-06 
0.0159579981118441 5.18233100592624e-05 7.01386852597352e-06 9.03369527804898e-06 
0.0167137589305639 5.62776258448139e-05 6.55940948490752e-06 7.72281418903731e-06 
0.0181324351578951 6.47005363134667e-05 5.72547924093669e-06 5.3648500397685e-06 
0.0208132937550545 8.22888905531727e-05 5.6813141782186e-06 2.17999854612572e-06 
0.0257648210972548 0.000114616712380666 5.86811711400514e-06 -1.94162748812232e-06 
0.0339347533881664 0.00016126393165905 5.15343390361522e-06 -6.90449860485387e-06 
0.0465044006705284 0.000222682283492759 3.90154627893935e-06 -1.18627858682885e-05 
0.0639058351516724 0.000286283378954977 1.5126491916817e-06 -1.66657609952381e-05 
0.0856123268604279 0.00033926239120774 -4.85567079522298e-06 -2.03307281481102e-05 
0.109952487051487 0.000367318600183353 -1.38770419653156e-05 -1.90718001249479e-05 
0.134681358933449 0.000366504973499104 -2.306863279955e-05 -1.51779877342051e-05 
0.157117769122124 0.00032643330632709 -2.97431979561225e-05 -5.12235419591889e-06 
0.17556169629097 0.000271289376541972 -3.3751581213437e-05 4.59293187304866e-06 
0.189199969172478 0.000213012870517559 -3.83289261662867e-05 1.49234629134298e-05 
0.197995781898499 0.000152301581692882 -3.87118707294576e-05 2.22791277337819e-05 
0.202784106135368 9.61364639806561e-05 -3.50816262653098e-05 2.77075669146143e-05 
0.204693108797073 5.70425108890049e-05 -3.41416125593241e-05 2.61069581029005e-05 
0.204438477754593 2.78176084975712e-05 -3.573367575882e-05 2.45993851422099e-05 
0.202639847993851 -3.58724514626374e-06 -3.35654258378781e-05 2.23650040425127e-05 
0.199801787734032 -2.64529462583596e-05 -3.38828103849664e-05 1.63853728736285e-05 
0.196316659450531 -3.29304093611427e-05 -4.03385784011334e-05 9.95880691334605e-06 
0.192317098379135 -4.20272008341271e-05 -4.52664935437497e-05 3.36358016284066e-06 
0.188396900892258 -5.5041895393515e-05 -4.96806933369953e-05 -4.27603890784667e-06 
0.184289321303368 -5.78035542275757e-05 -5.33105303475168e-05 -1.04509372249595e-05 
0.180354654788971 -5.72096869291272e-05 -5.46309747733176e-05 -1.4284836652223e-05 
0.176498621702194 -6.447979103541e-05 -5.07553522766102e-05 -1.66093814186752e-05 
0.172698333859444 -6.74452967359684e-05 -4.55924273410346e-05 -1.53083528857678e-05 
0.168817237019539 -6.73728718538769e-05 -3.82664547942113e-05 -1.37557508423924e-05 
0.164861306548119 -7.54385837353766e-05 -2.95118079520762e-05 -1.40228039526846e-05 
0.160619288682938 -8.18549015093595e-05 -2.32178554142592e-05 -1.10456530819647e-05 
0.156197845935822 -9.06944333110005e-05 -1.65777091751806e-05 -8.9033565018326e-06 
0.151891604065895 -0.000102032587165013 -9.49396689975401e-06 -8.63542481965851e-06 
0.147188574075699 -0.000109935324871913 -2.29423926612071e-06 -5.49502237845445e-06 
0.142622485756874 -0.000115689028461929 5.41061172043555e-06 -1.36899393510248e-06 
0.138212621212006 -0.000123943551443517 1.51162203110289e-05 7.56862377215839e-08 
0.133856698870659 -0.000127623206935823 2.29341021622531e-05 1.37410393108439e-06 
0.129308819770813 -0.00012551003601402 2.62397734331898e-05 1.16433261609927e-06 
0.124791391193867 -0.000129201274830848 2.8054608264938e-05 -1.40820560545762e-07 
0.120096102356911 -0.000128383762785234 2.80686399491969e-05 -2.3580225843034e-06 
0.115188121795654 -0.000131632230477408 3.01925119856605e-05 -4.0958657336887e-06 
0.110100634396076 -0.000136452363221906 3.3748281566659e-05 -4.57883470517118e-06 
0.104985944926739 -0.000144703895784914 4.15154172515031e-05 -4.05422997573623e-06 
0.0998038202524185 -0.000149756597238593 5.15366227773484e-05 -2.77095909950731e-06 
0.0946462899446487 -0.000156475376570597 6.14153977949172e-05 -1.58722832566127e-06 
0.0894372686743736 -0.000159713250468485 6.94461705279537e-05 -8.33952981338371e-07 
0.0844215601682663 -0.0001590957690496 7.73005449445918e-05 -1.99888017959893e-06 
0.0794768556952477 -0.000153273053001612 8.52366501931101e-05 -2.53857933785184e-06 
0.0747100189328194 -0.000143468889291398 9.30195601540618e-05 -5.10734435010818e-06 
0.0700587779283524 -0.000128316474729218 0.000100991943327244 -8.92979642230785e-06 
0.0655420422554016 -0.000105197250377387 0.000107879481220152 -1.37754041134031e-05 
0.0608989223837852 -7.931482832646e-05 0.000113922265882138 -1.88513658940792e-05 
0.0560597255825996 -4.88937985210214e-05 0.000119225180242211 -2.47570460487623e-05 
0.0511501841247082 -1.86414999916451e-05 0.000123923338833265 -3.03174929285888e-05 
0.0461301580071449 1.04854789242381e-05 0.000127286752103828 -3.44584695994854e-05 
0.0411491617560387 3.6260094930185e-05 0.000128939267597161 -3.77719770767726e-05 
0.0363206751644611 5.79770348849706e-05 0.000128282932564616 -4.02963669330347e-05 
0.0317376144230366 7.35772555344738e-05 0.000123614037875086 -4.14488786191214e-05 
0.0273324102163315 8.38040359667502e-05 0.0001153035191237 -4.14623355027288e-05 
0.0231826491653919 8.72495656949468e-05 0.000104230515717063 -4.05315913667437e-05 
0.019275788217783 8.67116104927845e-05 9.05830675037578e-05 -3.84222403226886e-05 
0.0157432537525892 8.13768710941076e-05 7.55599030526355e-05 -3.54758267349098e-05 
0.0126154012978077 7.38889430067502e-05 6.03085754846688e-05 -3.23388994729612e-05 
0.00990185141563416 6.47836641292088e-05 4.57972164440434e-05 -2.83399458567146e-05 
0.00765417283400893 5.53315476281568e-05 3.3167605579365e-05 -2.41742782236543e-05 
0.00585496099665761 4.46342382929288e-05 2.35448242165148e-05 -2.01818820642075e-05 
0.00441288482397795 3.49070978700183e-05 1.62096348503837e-05 -1.62162905326113e-05 
0.00330508593469858 2.61276527453447e-05 1.10294640762731e-05 -1.29356712932349e-05 
0.0024863847065717 1.88258945854614e-05 7.28521399651072e-06 -1.03448655863758e-05 
0.00188069476280361 1.35857799250516e-05 4.99964835398714e-06 -8.29203872854123e-06 
0.00145283585879952 1.071262795449e-05 4.28876319347182e-06 -6.49400180918747e-06 
0.00115659949369729 9.63445108936867e-06 5.73022043681704e-06 -4.63485685031628e-06 
0.000973489426542073 1.05908065961557e-05 1.02339336081059e-05 -2.32916045206366e-06 
0.000887928472366184 1.36746457428671e-05 1.88096528290771e-05 5.69944347716955e-07 
0.000898217957001179 1.95423144759843e-05 3.20558865496423e-05 4.39726591139333e-06 
0.000988804385997355 2.80448457488092e-05 5.10804893565364e-05 9.40899099077797e-06 
0.00117501197382808 4.0010163502302e-05 7.66127341194078e-05 1.57195117935771e-05 
0.00144359190016985 5.53146928723436e-05 0.000109565218735952 2.36943869822426e-05 
0.0018069475190714 7.44999342714436e-05 0.000150771913467906 3.34240903612226e-05 
0.00219384604133666 9.45300926105119e-05 0.000194566251593642 4.37284252257086e-05 
0.00270066712982953 0.000119916199764702 0.000250922428676859 5.68176546948962e-05 
0 0 0 0 
0 0 0 0 
0 0 0 0 
0 0 0 0 
0 0 0 0 
0 0 0 0 
0 0 0 0 
0 0 0 0 
0 0 0 0 
0 0 0 0 
0 0 0 0 
0 0 0 0 
0 0 0 0 
0 0 0 0 
99.7751083374023 0.119939379394054 0.0653943940997124 0.0226089395582676 
