{
	"centerX" : 0.5,
	"centerY" : 0.5,
	"angle" : 0,
	"scale" : 1,
	"width" : 340,
	"height" : 130,
	"contents" : [{
            "type": "text",
            "centerX": 0.12,
            "centerY": 0.2,
            "width": 65,
            "height": 60,
            "angle": 0,
            "color": "#ffffffff",
            "isVertical": 0,
			"alignment": 0,
            "text": "{mmM}",
            "zorder": 2
        },{
            "type": "text",
            "centerX": 0.35,
            "centerY": 0.15,
            "width": 64,
            "height": 16,
            "angle": 0,
            "color": "#ffffffff",
            "isVertical": 0,
			"alignment": 1,
            "text": "{LOCATION}",
            "font":"roboto",
			"editable":true,
            "zorder": 2
		},{
            "type": "text",
            "centerX": 0.35,
            "centerY": 0.3,
			"width": 64,
            "height": 16,
            "angle": 0,
            "color": "#ffffffff",
            "isVertical": 0,
			"alignment": 1,
            "text": "{HH:mm}",
            "zorder": 2
		},{
            "type": "text",
            "centerX": 0.1,
            "centerY": 0.5,
			"width": 46,
            "height": 22,
            "angle": 0,
            "color": "#ffffffff",
            "isVertical": 0,
			"alignment": 0,
            "text": "{SUN_TITLE}",
            "zorder": 2
		}
		,{
            "type": "text",
            "centerX": 0.23,
            "centerY": 0.5,
			"width": 46,
            "height": 22,
            "angle": 0,
            "color": "#ffffffff",
            "isVertical": 0,
			"alignment": 0,
            "text": "{MON_TITLE}",
            "zorder": 2
		},{
            "type": "text",
            "centerX": 0.36,
            "centerY": 0.5,
			"width": 46,
            "height": 22,
            "angle": 0,
            "color": "#ffffffff",
            "isVertical": 0,
			"alignment": 0,
            "text": "{TUE_TITLE}",
            "zorder": 2
		},{
            "type": "text",
            "centerX": 0.49,
            "centerY": 0.5,
			"width": 46,
            "height": 22,
            "angle": 0,
            "color": "#ffffffff",
            "isVertical": 0,
			"alignment": 0,
            "text": "{WED_TITLE}",
            "zorder": 2
		},{
            "type": "text",
            "centerX": 0.62,
            "centerY": 0.5,
			"width": 46,
            "height": 22,
            "angle": 0,
            "color": "#ffffffff",
            "isVertical": 0,
			"alignment": 0,
            "text": "{THU_TITLE}",
            "zorder": 2
		},{
            "type": "text",
            "centerX": 0.75,
            "centerY": 0.5,
			"width": 46,
            "height": 22,
            "angle": 0,
            "color": "#ffffffff",
            "isVertical": 0,
			"alignment": 0,
            "text": "{FRI_TITLE}",
            "zorder": 2
		},{
            "type": "text",
            "centerX": 0.88,
            "centerY": 0.5,
			"width": 46,
            "height": 22,
            "angle": 0,
            "color": "#ffffffff",
            "isVertical": 0,
			"alignment": 0,
            "text": "{SAT_TITLE}",
            "zorder": 2
		},{
            "type": "text",
            "centerX": 0.1,
            "centerY": 0.75,
			"width": 46,
            "height": 22,
            "angle": 0,
            "color": "#ffffffff",
            "isVertical": 0,
			"alignment": 0,
            "text": "{WeekDay_SUN}",
            "zorder": 2
		}
		,{
            "type": "text",
            "centerX": 0.23,
            "centerY": 0.75,
			"width": 46,
            "height": 22,
            "angle": 0,
            "color": "#ffffffff",
            "isVertical": 0,
			"alignment": 0,
            "text": "{WeekDay_MON}",
            "zorder": 2
		},{
            "type": "text",
            "centerX": 0.36,
            "centerY": 0.75,
			"width": 46,
            "height": 22,
            "angle": 0,
            "color": "#ffffffff",
            "isVertical": 0,
			"alignment": 0,
            "text": "{WeekDay_TUE}",
            "zorder": 2
		},{
            "type": "text",
            "centerX": 0.49,
            "centerY": 0.75,
			"width": 46,
            "height": 22,
            "angle": 0,
            "color": "#ffffffff",
            "isVertical": 0,
			"alignment": 0,
            "text": "{WeekDay_WED}",
            "zorder": 2
		},{
            "type": "text",
            "centerX": 0.62,
            "centerY": 0.75,
			"width": 46,
            "height": 22,
            "angle": 0,
            "color": "#ffffffff",
            "isVertical": 0,
			"alignment": 0,
            "text": "{WeekDay_THU}",
            "zorder": 2
		},{
            "type": "text",
            "centerX": 0.75,
            "centerY": 0.75,
			"width": 46,
            "height": 22,
            "angle": 0,
            "color": "#ffffffff",
            "isVertical": 0,
			"alignment": 0,
            "text": "{WeekDay_FRI}",
            "zorder": 2
		},{
            "type": "text",
            "centerX": 0.88,
            "centerY": 0.75,
			"width": 46,
            "height": 22,
            "angle": 0,
            "color": "#ffffffff",
            "isVertical": 0,
			"alignment": 0,
            "text": "{WeekDay_SAT}",
            "zorder": 2
		}
	,{
            "type" : "image",
			"resource" : {
				"type" : "static",
				"path" : "res/calendar_mark.png"
			},
            "centerX": 0.88,
            "centerY": 0.70,
			"width": 36,
            "height": 16,
            "angle": 0,
            "color": "#ffffffff",
            "isVertical": 0,
			"alignment": 0,
            "zorder": 2
		}		
		
	]
}
