0 0 0 0 
0 0 0 0 
0 0 0 0 
0 0 0 0 
0 0 0 0 
0 0 0 0 
0 0 0 0 
0 0 0 0 
0 0 0 0 
0 0 0 0 
0.00295317475683987 -0.00039500099956058 -2.60644155787304e-05 9.10187463887269e-06 
0.00343001447618008 -0.00042743471567519 -2.65130656771362e-05 9.10983726498671e-06 
0.003782904939726 -0.000425869249738753 -2.8163063689135e-05 9.01773364603287e-06 
0.00421703234314919 -0.00040202253148891 -3.15720026264898e-05 8.5955107351765e-06 
0.00484048901125789 -0.00033270928543061 -3.42710081895348e-05 8.22254787635757e-06 
0.00565308891236782 -0.000228627672186121 -3.72292961401399e-05 8.02410704636713e-06 
0.00651790574193001 -0.00012223154772073 -4.03375161113217e-05 7.68760219216347e-06 
0.00726748537272215 -3.20976287184749e-05 -4.25038597313687e-05 6.90776141709648e-06 
0.00785998534411192 2.99042712867958e-05 -4.27502018283121e-05 6.47646083962172e-06 
0.00808343570679426 5.14219209435396e-05 -4.41686570411548e-05 6.14431337453425e-06 
0.00796406622976065 3.69735607819166e-05 -4.52868698630482e-05 4.76052082376555e-06 
0.00771402660757303 2.16084717976628e-05 -4.64022814412601e-05 4.11021846957738e-06 
0.00736589170992374 7.130384346965e-06 -4.76166569569614e-05 3.36455786964507e-06 
0.00703455554321408 -3.32524973600812e-06 -4.82290051877499e-05 2.7751202651416e-06 
0.00671843392774463 -1.12479528979748e-05 -4.82099130749702e-05 2.19336925511016e-06 
0.00642564985901117 -1.33890926008462e-05 -4.73447507829405e-05 2.22946300709737e-06 
0.00615888880565763 -1.51790027302923e-05 -4.60213414044119e-05 1.87921932592872e-06 
0.00591607065871358 -1.52913344209082e-05 -4.4173160858918e-05 1.83382951490785e-06 
0.00567514495924115 -1.61524185386952e-05 -4.21954209741671e-05 1.78718016741186e-06 
0.00545136537402868 -1.15118591565988e-05 -4.0171442378778e-05 1.85942838015762e-06 
0.00521342316642404 -1.20656313811196e-05 -3.81906102120411e-05 1.46295985814504e-06 
0.00497532822191715 -1.19338137665181e-05 -3.60104786523152e-05 1.43454440149071e-06 
0.00472276424989104 -9.41591952141607e-06 -3.43020947184414e-05 1.41277757848002e-06 
0.00443264096975327 -4.58700424132985e-06 -3.32988383888733e-05 1.3229389423941e-06 
0.0041028200648725 -7.4031158874277e-06 -3.240907608415e-05 1.07297330487199e-06 
0.00380818569101393 -1.57119700361363e-07 -3.13026757794432e-05 1.80553422524099e-06 
0.00352810579352081 3.63376807399618e-06 -2.99713992717443e-05 1.82317216967931e-06 
0.00337565527297556 4.37784638052108e-06 -2.7695823519025e-05 1.63013112342014e-06 
0.00332221854478121 5.80162077312707e-06 -2.48815067607211e-05 1.59454168624507e-06 
0.0033889589831233 1.1885001185874e-05 -2.1914533135714e-05 1.73355579136114e-06 
0.0034889061935246 1.10903738459456e-05 -1.91020226338878e-05 9.51002220972441e-07 
0.00365314166992903 1.52077591337729e-05 -1.67918278748402e-05 9.03538875718368e-07 
0.00378955062478781 1.74559481820324e-05 -1.51163103510044e-05 1.19230458039965e-06 
0.00396031327545643 2.06360364245484e-05 -1.3796983694192e-05 1.32175637190812e-06 
0.00420422200113535 2.31072426686296e-05 -1.23112440633122e-05 1.41398970754381e-06 
0.00451637804508209 2.38674838328734e-05 -1.10524360934505e-05 1.68576798387221e-06 
0.00486290780827403 2.14459905691911e-05 -9.73101941781351e-06 1.93593950825743e-06 
0.00525835435837507 1.99456644622842e-05 -8.69272844283842e-06 1.89838226560823e-06 
0.00569253601133823 1.68959613802144e-05 -7.4817035056185e-06 2.08687720260059e-06 
0.00608839280903339 1.1684662240441e-05 -6.25320853941957e-06 2.37505719269393e-06 
0.00643453700467944 5.16055797561421e-06 -5.49329524801578e-06 2.73378964266158e-06 
0.0067548481747508 -2.23560459744476e-06 -4.88768682771479e-06 2.76391733677883e-06 
0.00704941619187593 -7.24468236512621e-06 -3.86274041375145e-06 3.09157894662349e-06 
0.0073158061131835 -1.49059342220426e-05 -2.60030856225058e-06 3.17156923301809e-06 
0.00757167069241405 -2.35698862525169e-05 -1.29236718748871e-06 2.97182850772515e-06 
0.00787278823554516 -2.70754298981046e-05 6.44764554635913e-07 2.96987377623736e-06 
0.00816593319177628 -3.15293727908283e-05 2.91601895696658e-06 3.20410049425846e-06 
0.0084824413061142 -3.30329421558417e-05 5.31058094566106e-06 3.14793396682944e-06 
0.00880979560315609 -3.21603802149184e-05 7.36734318707022e-06 3.33650768880034e-06 
0.00916347932070494 -2.72905344900209e-05 9.44502971833572e-06 3.68598307431967e-06 
0.00952975638210773 -2.23223923967453e-05 1.1491389159346e-05 3.81464928977948e-06 
0.00994320306926966 -1.37950019052369e-05 1.34985557451728e-05 3.93836444345652e-06 
0.0104121910408139 -8.61962598719401e-06 1.55011857714271e-05 4.28581688538543e-06 
0.0109772067517042 6.99990437169618e-07 1.79617290996248e-05 4.67610561827314e-06 
0.0116508901119232 9.52185018832097e-06 2.02937444555573e-05 4.82432915305253e-06 
0.0124548505991697 1.90861665032571e-05 2.31432059081271e-05 5.19678224009112e-06 
0.0134000713005662 2.67712202912662e-05 2.64657082880149e-05 5.45161719855969e-06 
0.0144524183124304 3.39735233865213e-05 3.02709795505507e-05 5.67963161302032e-06 
0.0155555456876755 3.70139823644422e-05 3.39048820023891e-05 5.63104777029366e-06 
0.0167132373899221 4.1479645005893e-05 3.7950900150463e-05 5.86624582865625e-06 
0.017851559445262 4.46954072685912e-05 4.15142458223272e-05 5.75891317566857e-06 
0.0188940241932869 5.15525207447354e-05 4.45043187937699e-05 5.75513195144595e-06 
0.0197384785860777 5.42037050763611e-05 4.70023005618714e-05 5.81668246013578e-06 
0.0203183349221945 5.72718126932159e-05 4.85894488519989e-05 5.7090182963293e-06 
0.0205001104623079 5.44845097465441e-05 4.88845544168726e-05 5.56175928068114e-06 
0.0203434769064188 5.24441347806714e-05 4.84480697195977e-05 5.57421526536928e-06 
0.0198494326323271 4.70711202069651e-05 4.72111569251865e-05 5.92299966228893e-06 
0.0191031694412231 4.4673968659481e-05 4.46742305939551e-05 6.16512761553167e-06 
0.0182130485773087 3.48181602021214e-05 4.23111341660842e-05 6.69028077027178e-06 
0.01731869392097 2.4777193175396e-05 4.01512006646954e-05 6.79536969983019e-06 
0.0164381936192513 1.02493559097638e-05 3.80841702281032e-05 6.9403458837769e-06 
0.0157056078314781 -4.33795958088012e-06 3.62458231393248e-05 6.64035042063915e-06 
0.0151243256404996 -2.11515180126298e-05 3.49512374668848e-05 6.25632856099401e-06 
0.0147229200229049 -2.84629149973625e-05 3.37722449330613e-05 5.82060147280572e-06 
0.0144834956154227 -3.31650444422849e-05 3.2824813388288e-05 5.9737694755313e-06 
0.0143747879192233 -3.52936840499751e-05 3.18347083521076e-05 5.84233521294664e-06 
0.0143600450828671 -3.52653551090043e-05 3.11528710881248e-05 5.87199292567675e-06 
0.0144330402836204 -3.24563188769389e-05 3.06783367705066e-05 5.99699023950961e-06 
0.0145634384825826 -3.48954526998568e-05 3.06383662973531e-05 6.09682729191263e-06 
0.0147598776966333 -3.58736906491686e-05 3.04411150864325e-05 5.8778405218618e-06 
0.0150898117572069 -3.59190526069142e-05 3.09089009533636e-05 6.17011255599209e-06 
0.0155733646824956 -3.91894864151254e-05 3.22665146086365e-05 6.25233178652707e-06 
0.0163384918123484 -4.2302690417273e-05 3.47488858096767e-05 6.09078097113525e-06 
0.0176589600741863 -4.54842884209938e-05 3.92783331335522e-05 5.88589909966686e-06 
0.0201451200991869 -4.92325125378557e-05 4.82262439618353e-05 6.44617875877884e-06 
0.0247566793113947 -5.90962226851843e-05 6.39370191493072e-05 6.54371842756518e-06 
0.0326647236943245 -8.43920352053829e-05 8.71631200425327e-05 6.11940367889474e-06 
0.0450258925557137 -0.000127905266708694 0.000115542527055368 5.66476728636189e-06 
0.0622921846807003 -0.000200970374862663 0.000143306300742552 5.88212515140185e-06 
0.0841666832566261 -0.000306314643239602 0.000166224534041248 4.60689170722617e-06 
0.109021119773388 -0.000469441263703629 0.000176417932379991 4.31898570241174e-06 
0.134083434939384 -0.000655245268717408 0.000168097074492835 4.62941306977882e-06 
0.157231837511063 -0.000851520686410367 0.0001449272967875 4.46807098342106e-06 
0.176266983151436 -0.00104651204310358 0.000113323352707084 3.9437404666387e-06 
0.190276101231575 -0.00122044142335653 7.23398698028177e-05 2.72461329586804e-06 
0.199179038405418 -0.00133693334646523 3.53489667759277e-05 -2.83281309521044e-07 
0.20427280664444 -0.0014121679123491 3.73630655303714e-06 1.25264179473561e-07 
0.205886825919151 -0.00148967583663762 -2.13193543459056e-05 3.9879441260382e-07 
0.205577835440636 -0.00151181337423623 -3.77240612579044e-05 -8.09960397418763e-07 
0.203852400183678 -0.00151399883907288 -4.43861208623275e-05 -1.61499804107734e-06 
0.201027229428291 -0.00151361210737377 -5.35418585059233e-05 -1.65012625075178e-06 
0.197600901126862 -0.00145055307075381 -6.17959958617575e-05 -5.07146251038648e-06 
0.194035798311234 -0.00137528905179352 -6.24565000180155e-05 -6.79712456985726e-06 
0.190225422382355 -0.00126228912267834 -6.89038206473924e-05 -7.07813387634815e-06 
0.186301857233047 -0.00115964945871383 -7.21442775102332e-05 -5.72734370507533e-06 
0.182558164000511 -0.00101501611061394 -7.14127818355337e-05 -3.47134118783288e-06 
0.178617641329765 -0.00089730677427724 -6.80566154187545e-05 -1.96254995898926e-06 
0.174896717071533 -0.000716554408427328 -6.56779375276528e-05 -1.67183304711216e-06 
0.17077474296093 -0.000573712459299713 -5.9780493756989e-05 3.7944695918668e-07 
0.166408509016037 -0.000376268668333068 -5.5599619372515e-05 2.46502145273553e-06 
0.161928921937943 -0.000156694484758191 -5.03965384268668e-05 3.83131555281579e-06 
0.15700601041317 1.50775631482247e-05 -4.43576427642256e-05 4.21124286731356e-06 
0.151544481515884 0.000169876453583129 -3.94396083720494e-05 4.47190541308373e-06 
0.14637391269207 0.000356463191565126 -3.08759990730323e-05 2.75916363534634e-06 
0.140815287828445 0.000514938146807253 -2.27063428610563e-05 3.43220381182618e-06 
0.134996891021729 0.00064690929139033 -1.33276416818262e-05 1.98879865820345e-06 
0.129396080970764 0.000817799591459334 -3.40259634867834e-06 2.83272447632044e-06 
0.123650759458542 0.00100149714853615 4.77993125969078e-06 2.53054508903006e-06 
0.117708168923855 0.0011907338630408 1.16451437861542e-05 1.45182605137961e-06 
0.11188517510891 0.00140141579322517 1.7549986296217e-05 -1.7808373513617e-06 
0.106044083833694 0.00161618110723794 2.24031391553581e-05 -3.54027338289598e-06 
0.100057274103165 0.00185821321792901 2.71795888693305e-05 -5.68738232686883e-06 
0.0942244082689285 0.00211461936123669 2.99674647976644e-05 -8.09866924100788e-06 
0.0882144272327423 0.00235948036424816 3.02232219837606e-05 -7.43324562790804e-06 
0.0824975594878197 0.00261053862050176 3.03934612020385e-05 -8.57169015944237e-06 
0.0769448578357697 0.0028646185528487 2.94455876428401e-05 -1.05142535176128e-05 
0.0715857744216919 0.00309153599664569 2.76639384537702e-05 -1.23475756481639e-05 
0.0663530752062798 0.0033025317825377 2.50605917244684e-05 -1.06355555544724e-05 
0.0615404173731804 0.00348946498706937 2.14332576433662e-05 -1.15828679554397e-05 
0.0567612797021866 0.00362260430119932 1.63360728038242e-05 -1.1389548490115e-05 
0.0522489957511425 0.00373177602887154 9.37347249418963e-06 -9.97903316601878e-06 
0.0479970797896385 0.00380844948813319 1.40966881190252e-06 -9.78106527327327e-06 
0.0440180376172066 0.00384754594415426 -6.77191246722941e-06 -1.03030988611863e-05 
0.0400989837944508 0.00382144842296839 -1.44669766086736e-05 -8.63451532495674e-06 
0.0364321656525135 0.00376396742649376 -2.14130141102942e-05 -6.67739323034766e-06 
0.0328886546194553 0.00364691880531609 -2.66999377345201e-05 -2.4598903110018e-06 
0.0295291766524315 0.00347894337028265 -3.06505207845476e-05 3.45783405464317e-06 
0.0261588729918003 0.00323699717409909 -3.31779519910924e-05 9.96440576273017e-06 
0.0229668486863375 0.00297395349480212 -3.45138578268234e-05 1.58452985488111e-05 
0.0197313018143177 0.0026579627301544 -3.40584701916669e-05 2.18777004192816e-05 
0.0164977163076401 0.00230779754929245 -3.26214903907385e-05 2.67807081399951e-05 
0.013413860462606 0.00194394658319652 -3.03708657156676e-05 2.97292972391006e-05 
0.0105884624645114 0.00159541598986834 -2.77206818282139e-05 3.0971485102782e-05 
0.00797259900718927 0.0012620318448171 -2.55191753240069e-05 3.0061548386584e-05 
0.00584708945825696 0.000980121432803571 -2.32436759688426e-05 2.77642811852274e-05 
0.00410531787201762 0.000740756397135556 -2.19227076740935e-05 2.36142786889104e-05 
0.00272188056260347 0.000550130498595536 -2.05007727345219e-05 2.01286457013339e-05 
0.00168738549109548 0.000404487160267308 -1.90663849934936e-05 1.5714535038569e-05 
0.00097545247990638 0.000295660109259188 -1.71661049535032e-05 1.24739744933322e-05 
0.000425908772740513 0.000210141733987257 -1.62295982590877e-05 9.96951530396473e-06 
8.10999699751846e-05 0.000157699003466405 -1.53715609485516e-05 8.11739118944388e-06 
-0.000125408871099353 0.000120169868750963 -1.46569600474322e-05 6.35664946457837e-06 
-0.000261025008512661 9.40801692195237e-05 -1.38729519676417e-05 5.34088485437678e-06 
-0.000346642569638789 7.51934639993124e-05 -1.31802817122662e-05 4.26678479925613e-06 
-0.000375462434021756 6.52707894914784e-05 -1.2527173566923e-05 3.26849044540722e-06 
-0.000392034446122125 5.1248320232844e-05 -1.11871686385712e-05 2.69890688286978e-06 
-0.000441638228949159 4.24260324507486e-05 -1.04730261227814e-05 2.50567927650991e-06 
-0.00044164207065478 3.60303565685172e-05 -1.02159428934101e-05 2.66202664533921e-06 
-0.000447655649622902 2.73695859505096e-05 -9.59969383984571e-06 2.54614269579179e-06 
-0.000483970361528918 2.19716639549006e-05 -9.29736961552408e-06 2.48506466959952e-06 
-0.000493711209855974 1.06808120108326e-05 -7.86114742368227e-06 1.99949931811716e-06 
0 0 0 0 
0 0 0 0 
0 0 0 0 
0 0 0 0 
0 0 0 0 
0 0 0 0 
0 0 0 0 
0 0 0 0 
0 0 0 0 
0 0 0 0 
0 0 0 0 
0 0 0 0 
0 0 0 0 
0 0 0 0 
98.3334121704102 1.57875144481659 0.0579670257866383 0.0102986227720976 
