0 0 0 0 
0 0 0 0 
0 0 0 0 
0 0 0 0 
0 0 0 0 
0 0 0 0 
0 0 0 0 
0 0 0 0 
0 0 0 0 
0 0 0 0 
0.000961166864726692 -1.5866997273406e-05 3.08885773847578e-06 1.67861173849815e-06 
0.00119911890942603 -1.87928872037446e-05 3.46197748513077e-06 1.82561313977203e-06 
0.00141373137012124 -2.13762541534379e-05 3.98568226955831e-06 2.088433575409e-06 
0.00165138940792531 -2.25208605115768e-05 4.48726495960727e-06 2.41256043409521e-06 
0.00196354580111802 -2.07741395570338e-05 4.92463323098491e-06 2.67336099568638e-06 
0.0023229958023876 -1.72056898009032e-05 5.13419672643067e-06 2.87298144030501e-06 
0.00266236229799688 -1.23486570373643e-05 5.00978921991191e-06 2.90326602225832e-06 
0.00294489273801446 -6.96101096764323e-06 4.68400594400009e-06 2.71067460744234e-06 
0.00312764965929091 -2.57360352406977e-06 4.15745671489276e-06 2.38524012274866e-06 
0.00314083858393133 -7.12734220087441e-07 3.5489053971105e-06 2.07028074328264e-06 
0.00301241152919829 -2.9130609391359e-07 3.04302943732182e-06 1.80258393811528e-06 
0.00282923551276326 -5.50239178664924e-07 2.68460303232132e-06 1.60200147547584e-06 
0.00264330301433802 -1.28419367229071e-06 2.36725691138417e-06 1.51427070704813e-06 
0.00249843578785658 -1.99628721020417e-06 2.09532799999579e-06 1.45819626595767e-06 
0.00242360355332494 -2.4400360416621e-06 1.88720309779455e-06 1.40848715091124e-06 
0.00243517523631454 -2.88332262243784e-06 1.67931250416586e-06 1.36127084715554e-06 
0.00253236317075789 -3.28214559885964e-06 1.54170072619308e-06 1.35855088956305e-06 
0.00269052525982261 -3.58253305421385e-06 1.41747614179621e-06 1.34270703711081e-06 
0.00288707949221134 -3.81583458874957e-06 1.33208072838897e-06 1.33004505187273e-06 
0.00308871921151876 -4.0423888094665e-06 1.23119787076575e-06 1.31267404412938e-06 
0.00326362857595086 -4.1414973566134e-06 1.1663619261526e-06 1.30157843614143e-06 
0.00337701337412 -4.33936520494171e-06 1.12286386411142e-06 1.29846364416153e-06 
0.00342521839775145 -4.41976135334698e-06 1.11370013655687e-06 1.310297989221e-06 
0.0033959774300456 -4.67010158899939e-06 1.16390162929747e-06 1.36933897465497e-06 
0.00331065710633993 -4.7903040467645e-06 1.24190626138443e-06 1.48244521369634e-06 
0.00321884523145854 -4.83095209347084e-06 1.2601561820702e-06 1.57955719259917e-06 
0.00319802318699658 -4.84132215206046e-06 1.25815279261587e-06 1.59902663199318e-06 
0.00329680647701025 -4.91892569698393e-06 1.19227274808509e-06 1.57862905325601e-06 
0.00358866108581424 -4.69674751002458e-06 9.97787424239505e-07 1.49938784943515e-06 
0.00415719579905272 -4.7007602006488e-06 7.86776524819288e-07 1.36340793233103e-06 
0.00511964131146669 -4.71388875666889e-06 5.60378452973964e-07 1.30907108086831e-06 
0.00660562282428145 -4.80048083772999e-06 2.78186035984618e-07 1.4166096207191e-06 
0.00884591601788998 -5.12195174451335e-06 6.1769199533046e-08 1.63419701948442e-06 
0.0120939556509256 -5.64069114261656e-06 -1.57105276343827e-07 1.95004668057663e-06 
0.0165966488420963 -7.0765186137578e-06 -4.60958915482479e-07 2.52372092290898e-06 
0.0225016549229622 -9.06813875189982e-06 -7.99625013314653e-07 3.16009186462907e-06 
0.0297724157571793 -1.06192046587239e-05 -1.33839091631671e-06 3.95656843465986e-06 
0.0381716154515743 -1.19163023555302e-05 -1.78014170160168e-06 4.65812445327174e-06 
0.0473660156130791 -1.21420898722135e-05 -2.22899279833655e-06 5.41269673703937e-06 
0.0568159334361553 -1.09506299850182e-05 -3.10213931697945e-06 5.77218588659889e-06 
0.0660175383090973 -1.09603006421821e-05 -3.48921139448066e-06 5.96662403040682e-06 
0.0745553001761436 -1.03639440567349e-05 -4.10247139370767e-06 5.7372567425773e-06 
0.0822885781526566 -8.718728167878e-06 -4.80575909023173e-06 5.69800067751203e-06 
0.0892156735062599 -1.01492814792437e-05 -5.28701275470667e-06 5.20425555805559e-06 
0.0951824486255646 -1.33092707983451e-05 -5.07153163198382e-06 4.83263602291117e-06 
0.100235335528851 -1.44204723255825e-05 -5.23807557328837e-06 4.6920908971515e-06 
0.104600891470909 -1.80641472979914e-05 -4.84709335069056e-06 4.455858743313e-06 
0.108361028134823 -2.0290732209105e-05 -4.64766162622254e-06 4.11683868151158e-06 
0.111354127526283 -2.04982843570178e-05 -4.70734948976315e-06 3.98353631680948e-06 
0.114029034972191 -1.92010338651016e-05 -4.83021904074121e-06 3.675050493257e-06 
0.116391099989414 -1.81169125426095e-05 -5.63334333492094e-06 3.32829949911684e-06 
0.118497535586357 -1.3231202501629e-05 -5.85081716053537e-06 3.29379872709978e-06 
0.120318725705147 -1.24840044009034e-05 -5.65366326554795e-06 3.00848364531703e-06 
0.1219452470541 -7.67327310313703e-06 -5.8771470321517e-06 2.56968178291572e-06 
0.123260892927647 -2.14110514207277e-06 -6.20688160779537e-06 2.65318067249609e-06 
0.124320365488529 2.36967139244371e-06 -5.97955795456073e-06 2.10839903047599e-06 
0.125088334083557 3.39186476594477e-06 -6.40009920971352e-06 1.12557393094903e-06 
0.125553324818611 3.74936939806503e-06 -6.5246945268882e-06 2.69751808446017e-07 
0.125869438052177 1.27330940813408e-06 -6.29941132501699e-06 2.09440273124528e-07 
0.126093298196793 -7.6297260420688e-07 -6.06404137215577e-06 -7.28736665678298e-07 
0.126348048448563 -3.05527714772325e-06 -6.65804282107274e-06 -1.21425557608745e-06 
0.126616612076759 -1.8405140735922e-06 -7.24982919564354e-06 -1.28211490846297e-06 
0.127005457878113 -1.10520988982898e-06 -8.22235051600728e-06 -1.84832549621206e-06 
0.127397641539574 -5.41411679932935e-07 -8.700567377673e-06 -2.20525043914677e-06 
0.127657622098923 9.0923413154087e-07 -9.19301783142146e-06 -2.44371335611504e-06 
0.127865195274353 2.02748833544319e-06 -8.72901364346035e-06 -2.31750163948163e-06 
0.127971202135086 3.28398641613603e-07 -7.71191844251007e-06 -3.25561973113508e-06 
0.12785929441452 4.64418417323031e-06 -6.60581463307608e-06 -3.11649296236283e-06 
0.127652481198311 3.22089931614755e-06 -5.80682853978942e-06 -3.36500670528039e-06 
0.12749508023262 -1.50478433624812e-06 -4.79004847875331e-06 -2.97090468848182e-06 
0.127107948064804 -6.17666546531837e-06 -3.6409103358892e-06 -3.21885431731062e-06 
0.12672846019268 -9.95444679574575e-06 -3.21611628351093e-06 -2.42869623434672e-06 
0.126345485448837 -1.91238905244973e-05 -2.40333815781923e-06 -1.37475285555411e-06 
0.125954642891884 -1.98702782654436e-05 -2.24967675421794e-06 -8.06823720722605e-07 
0.125412225723267 -2.23786955757532e-05 -2.64644017988758e-06 -6.20327341493976e-07 
0.124953672289848 -1.93738724192372e-05 -2.86853673969745e-06 -8.19706713173218e-07 
0.124403715133667 -1.5330810128944e-05 -2.66501433543453e-06 -6.60874547975254e-07 
0.123841419816017 -1.08646227090503e-05 -3.24604025081499e-06 -1.25549263430003e-06 
0.123165033757687 -1.20907861855812e-05 -3.10612222165219e-06 -1.65773087701382e-06 
0.12248232960701 -1.15099055619794e-05 -2.28407043323386e-06 -2.20016568164283e-06 
0.121697440743446 -1.41602722578682e-05 -1.80617871592403e-06 -1.5661339602957e-06 
0.120861828327179 -1.96572655113414e-05 -1.51228766753775e-06 -1.52634504502203e-06 
0.119886800646782 -2.41088109760312e-05 -7.60289310619555e-07 -1.23415543384908e-06 
0.118826411664486 -2.5465134967817e-05 3.32770639488444e-07 -1.11309680050908e-06 
0.117637127637863 -2.68510575551772e-05 8.96954190920951e-07 -4.73805357614765e-07 
0.11650924384594 -3.00156461889856e-05 1.26775967146386e-06 -4.72135212703506e-07 
0.115384042263031 -3.17453232128173e-05 2.17507636079972e-06 -7.56218355491001e-07 
0.114437349140644 -2.9650102078449e-05 2.58929071605962e-06 -1.18153252515185e-06 
0.113657124340534 -2.94279579975409e-05 2.71017120212491e-06 -1.24385894650914e-06 
0.113084308803082 -2.46882718784036e-05 2.11605470212817e-06 -1.30866465042345e-06 
0.112637601792812 -2.14794672501739e-05 2.4389721602347e-06 -1.82419512384513e-06 
0.112176276743412 -1.63430649990914e-05 2.15909176404239e-06 -1.67454345501028e-06 
0.111732169985771 -1.46115826282767e-05 2.34112235375505e-06 -1.51725555497251e-06 
0.11110132932663 -1.2492199857661e-05 1.91848289432528e-06 -1.84503414857318e-06 
0.110252507030964 -1.33645935420645e-05 3.18384695674467e-06 -2.12584359360335e-06 
0.10904798656702 -1.01535115391016e-05 4.40234316556598e-06 -1.46222669172857e-06 
0.107687167823315 -8.88306840352016e-06 5.70064139537863e-06 -1.1568677109608e-06 
0.105960302054882 -1.12365332824993e-05 6.48040349915391e-06 -6.63290904867608e-07 
0.104096159338951 -1.24345533549786e-05 7.60239800001727e-06 -2.92220505571095e-07 
0.102181755006313 -1.46518977999222e-05 7.30843794372049e-06 -4.90522822360617e-08 
0.100131072103977 -1.97877689060988e-05 7.19246054359246e-06 5.40127125248091e-08 
0.0980307832360268 -2.24614359467523e-05 7.2404695856676e-06 1.96534315932695e-07 
0.0961148515343666 -2.45854880631668e-05 7.44542603570153e-06 -7.9636258476512e-08 
0.0942406430840492 -2.39164310187334e-05 8.01497117208783e-06 -4.02025612800117e-09 
0.0924777090549469 -2.33282917179167e-05 9.22013077797601e-06 -2.93006479523683e-07 
0.0909356698393822 -1.96598502952838e-05 9.04792887013173e-06 -5.45748321201245e-07 
0.08940439671278 -1.64565517479787e-05 8.63418426888529e-06 -8.96951519280265e-07 
0.0879681557416916 -8.82927270140499e-06 9.09694790607318e-06 -1.35727361794125e-06 
0.0864389911293983 -4.70126497020829e-06 8.8086053438019e-06 -1.8151312133341e-06 
0.0847652480006218 1.27650525882927e-06 8.88387603481533e-06 -2.14005717680266e-06 
0.0830447301268578 9.53756989474641e-06 9.21916034712922e-06 -2.41838574766007e-06 
0.0811818167567253 1.183693530038e-05 1.04524315247545e-05 -2.41786051446979e-06 
0.079041913151741 1.1513642675709e-05 1.09760048871976e-05 -2.19159323933127e-06 
0.0770093277096748 1.42641074489802e-05 1.16655992314918e-05 -1.55332895701576e-06 
0.0748076885938644 1.46217444125796e-05 1.1929431821045e-05 -1.10826249510865e-06 
0.0725197121500969 1.18600746645825e-05 1.24421057989821e-05 -9.73068722487369e-07 
0.0702932551503181 1.22840347103192e-05 1.21273014883627e-05 -7.82289191647578e-07 
0.0680283606052399 1.69099275808549e-05 1.14394952106522e-05 -1.47532077221513e-07 
0.0656397789716721 1.95067786989966e-05 1.12337411337649e-05 -2.09149220609106e-07 
0.063237801194191 2.34182261920068e-05 1.07814057628275e-05 1.46122758337697e-07 
0.0607987530529499 2.73717814707197e-05 1.02279364000424e-05 6.50032859539351e-07 
0.0582970455288887 3.46309752785601e-05 1.00679735623999e-05 1.29682121041697e-06 
0.0558450743556023 4.14015194110107e-05 9.38532230065903e-06 1.72885120264255e-06 
0.0533457100391388 5.01727190567181e-05 8.51973254611949e-06 2.24101017920475e-06 
0.0510107912123203 6.13617012277246e-05 7.4890931500704e-06 2.56688826993923e-06 
0.0486735962331295 7.43064665584825e-05 6.84933229422313e-06 2.90931780000392e-06 
0.046390350908041 8.68803617777303e-05 5.66029120818712e-06 2.74377134701353e-06 
0.0440026111900806 0.00010041437781183 5.08970788359875e-06 2.32761453844432e-06 
0.0416740924119949 0.000112694433482829 4.29767669629655e-06 2.3096363293007e-06 
0.039298452436924 0.000124367608805187 3.95219149140758e-06 2.39636938204058e-06 
0.0368610210716724 0.000137110444484279 3.2034695323091e-06 2.32120851251238e-06 
0.034327644854784 0.000150396503158845 2.56974317380809e-06 2.55035138252424e-06 
0.0318087227642536 0.000163731427164748 1.74099011474027e-06 2.69344081971212e-06 
0.0292368680238724 0.000176778674358502 1.06861239146383e-06 2.49764229920402e-06 
0.0266552641987801 0.000190822742297314 3.42174445222554e-07 2.23679990085657e-06 
0.0241420194506645 0.000202504932531156 -3.57346237933598e-07 1.78149264229432e-06 
0.0217700768262148 0.000212526254472323 -1.34388176320499e-06 1.4004325521455e-06 
0.0194762442260981 0.000219374414882623 -2.1603814275295e-06 8.36100014112162e-07 
0.0172982309013605 0.000223919661948457 -2.93210791824094e-06 8.04452398028843e-08 
0.0151703497394919 0.00022209226153791 -3.69057261195849e-06 -7.47902447528759e-07 
0.0131271248683333 0.000215339154237881 -4.26401220465777e-06 -1.74844603861857e-06 
0.0111200315877795 0.000201624541659839 -4.43746785094845e-06 -2.84040106635075e-06 
0.00922822300344706 0.000182102507096715 -4.1995954234153e-06 -3.65904566024255e-06 
0.00745485490188003 0.000157513830345124 -3.60115836883779e-06 -3.94654625779367e-06 
0.0058617596514523 0.0001314839173574 -2.80998028756585e-06 -3.93524169339798e-06 
0.00445139734074473 0.000104540427855682 -1.88006890766701e-06 -3.28638998325914e-06 
0.00328589417040348 8.04032024461776e-05 -9.60624447543523e-07 -2.4039227355388e-06 
0.00234178104437888 5.96037352806889e-05 -1.47101943070993e-07 -1.37946290124091e-06 
0.00160473491996527 4.32132073910907e-05 4.44315190861744e-07 -4.96434040542226e-07 
0.00105999037623405 3.04305885947542e-05 9.0410463826629e-07 2.7757565135289e-07 
0.000667191692627966 2.14159899769584e-05 1.17455999770755e-06 7.76236106503347e-07 
0.000392874906538054 1.48220497067086e-05 1.3183723694965e-06 1.09762356714782e-06 
0.000206697281100787 1.057789359038e-05 1.36597259370319e-06 1.22263747925899e-06 
9.51831680140458e-05 7.59260956328944e-06 1.34705135224067e-06 1.29155409922532e-06 
1.36397438836866e-05 5.51278162674862e-06 1.34387732941832e-06 1.28281203615188e-06 
-4.02577461500186e-05 3.97354870074196e-06 1.31133663217042e-06 1.27837074614945e-06 
-7.83929499448277e-05 3.11813687403628e-06 1.27144903672161e-06 1.24881592000747e-06 
-0.000105146391433664 2.38664097196306e-06 1.22404571811785e-06 1.24082430374983e-06 
-0.000124000405776314 1.84290934157616e-06 1.17105162189546e-06 1.21660013974179e-06 
-0.000143705561640672 1.53139603753516e-06 1.0945168469334e-06 1.18909338198137e-06 
-0.000141866883495823 1.42201031394507e-06 9.96893163573986e-07 1.12779912342376e-06 
0 0 0 0 
0 0 0 0 
0 0 0 0 
0 0 0 0 
0 0 0 0 
0 0 0 0 
0 0 0 0 
0 0 0 0 
0 0 0 0 
0 0 0 0 
0 0 0 0 
0 0 0 0 
0 0 0 0 
0 0 0 0 
99.905158996582 0.0800734758377075 0.0066646090708673 0.00291759357787669 
