0 0 0 0 
0 0 0 0 
0 0 0 0 
0 0 0 0 
0 0 0 0 
0 0 0 0 
0 0 0 0 
0 0 0 0 
0 0 0 0 
0 0 0 0 
0.00194619339890778 -9.1577458078973e-05 -1.22735154945985e-05 6.47909291728865e-06 
0.00269791507162154 -0.000112071589683183 -1.32228069560369e-05 6.93665288054035e-06 
0.0033629066310823 -0.000128133309772238 -1.41602649819106e-05 7.55804057916976e-06 
0.00408529490232468 -0.000139964366098866 -1.68914903042605e-05 7.78621961217141e-06 
0.00498233130201697 -0.000138709641760215 -2.09565314435167e-05 7.97337270341814e-06 
0.00594843784347177 -0.000126051047118381 -2.65925500571029e-05 7.69867801864166e-06 
0.00687916995957494 -0.000106956009403802 -3.34454671246931e-05 7.17477041689563e-06 
0.00770221604034305 -8.71994052431546e-05 -4.01712241000496e-05 6.28395446256036e-06 
0.00832988973706961 -7.0130372478161e-05 -4.57467176602222e-05 5.62720788366278e-06 
0.00860186573117971 -6.40561120235361e-05 -5.03822375321761e-05 4.78883703181054e-06 
0.00861665327101946 -6.65925181237981e-05 -5.32774720340967e-05 4.21895629187929e-06 
0.00847536884248257 -7.41214971640147e-05 -5.49824399058707e-05 3.56999771611299e-06 
0.00826142076402903 -8.22403017082252e-05 -5.63130670343526e-05 3.0820808660792e-06 
0.008004080504179 -8.80325533216819e-05 -5.69835428905208e-05 2.62761773228704e-06 
0.00770792458206415 -9.20147067517973e-05 -5.62218847335316e-05 2.16657031160139e-06 
0.00740913487970829 -9.38437879085541e-05 -5.48058160347864e-05 1.83155646027444e-06 
0.00711426045745611 -9.33453411562368e-05 -5.28824748471379e-05 1.61932837272616e-06 
0.00684384535998106 -9.02551182662137e-05 -5.05705465911888e-05 1.41032069223002e-06 
0.00656109349802136 -8.63964887685142e-05 -4.76022578368429e-05 1.26649570120207e-06 
0.0062779514119029 -8.16074607428163e-05 -4.50571860710625e-05 1.14440854304121e-06 
0.00599157391116023 -7.66954835853539e-05 -4.25795478804503e-05 1.10088149085641e-06 
0.00571807101368904 -7.16240901965648e-05 -3.98948177462444e-05 1.09692905425618e-06 
0.00542767765000463 -6.78544020047411e-05 -3.74873197870329e-05 1.16911064651504e-06 
0.00514402147382498 -6.48442583042197e-05 -3.52318129444029e-05 1.30224964323133e-06 
0.00483677862212062 -6.25104003120214e-05 -3.28468668158166e-05 1.59336741489824e-06 
0.00453561078757048 -5.74952136958018e-05 -3.05771864077542e-05 1.93450273400231e-06 
0.00426898710429668 -5.28296295669861e-05 -2.82338078250177e-05 2.06531194635318e-06 
0.00407027779147029 -4.71021994599141e-05 -2.51855435635662e-05 2.10424877877813e-06 
0.00394535437226295 -4.13772213505581e-05 -2.22840262722457e-05 1.93535674952727e-06 
0.00391557812690735 -3.47609347954858e-05 -1.95557877304964e-05 1.63945935582888e-06 
0.00396534753963351 -3.02510325127514e-05 -1.68844944710145e-05 1.35171512738452e-06 
0.00405170768499374 -2.54668902925914e-05 -1.45262138175895e-05 1.32751358705718e-06 
0.00416996376588941 -2.1621905034408e-05 -1.2158794561401e-05 1.34479932967224e-06 
0.00433712871745229 -1.70408529811539e-05 -1.02962540040608e-05 1.50960488554119e-06 
0.00456983270123601 -1.28948659039452e-05 -8.24064591142815e-06 1.69855104559247e-06 
0.00485206162557006 -9.93875983112957e-06 -6.21097251496394e-06 1.87821842700941e-06 
0.00518342992290854 -7.67165875004139e-06 -4.2961132749042e-06 2.06902609534154e-06 
0.00556169217452407 -5.05022808283684e-06 -2.89766558125848e-06 2.35241850532475e-06 
0.00594891514629126 -3.16253817800316e-06 -1.1163364206368e-06 2.66274855675874e-06 
0.00633295765146613 -1.98319503397215e-06 3.86994400969343e-07 3.06658535009774e-06 
0.00669731153175235 -1.25593385291722e-06 1.90198488780879e-06 3.54467510987888e-06 
0.00704169692471623 -5.35071706053714e-07 3.27506131725386e-06 3.9857268347987e-06 
0.00735116144642234 1.08802829856813e-07 4.94938876727247e-06 4.39048062617076e-06 
0.0076703024096787 3.49956053469214e-07 7.19621039024787e-06 4.73769705422455e-06 
0.00798918586224318 1.37921006171382e-06 9.70204382610973e-06 5.06140395373222e-06 
0.00832164473831654 3.75078229808423e-06 1.24604493976221e-05 5.24227925779996e-06 
0.00868125259876251 7.62505032980698e-06 1.55848192662233e-05 5.550192327064e-06 
0.00906893145292997 1.20977883852902e-05 1.89494094229303e-05 5.72329736314714e-06 
0.00945386942476034 1.67291855177609e-05 2.21852278627921e-05 5.92371952734538e-06 
0.00985091459006071 2.2030759282643e-05 2.52306799666258e-05 6.07212177783367e-06 
0.0102738197892904 2.74050853477092e-05 2.84155648841988e-05 6.25630127615295e-06 
0.0107091860845685 3.24697757605463e-05 3.14130047627259e-05 6.32289356872207e-06 
0.0111880041658878 3.76769858121406e-05 3.43436113325879e-05 6.44970532448497e-06 
0.0117337740957737 4.47090787929483e-05 3.69619301636703e-05 6.59118313706131e-06 
0.0123831769451499 5.21622969245072e-05 3.99869823013432e-05 6.74855027682497e-06 
0.0131351882591844 5.96634599787649e-05 4.31256194133312e-05 6.80424182064598e-06 
0.0140141425654292 6.78176002111286e-05 4.68604557681829e-05 6.94590335115208e-06 
0.0149857420474291 7.54606080590747e-05 5.10884601681028e-05 6.98305620971951e-06 
0.0160341635346413 8.21790235931985e-05 5.55199148948304e-05 7.07764593244065e-06 
0.017105545848608 8.94458426046185e-05 5.96810605202336e-05 7.14286397851538e-06 
0.0181712489575148 9.66898951446638e-05 6.3769897678867e-05 7.20533853382221e-06 
0.0191235560923815 0.00010312297672499 6.70698791509494e-05 7.37387927074451e-06 
0.0199117437005043 0.000109100801637396 6.94800473866053e-05 7.41043550078757e-06 
0.0204188115894794 0.00011331781570334 7.086342520779e-05 7.51646302887821e-06 
0.020581342279911 0.000115401111543179 7.1095630119089e-05 7.68757490732241e-06 
0.0203751344233751 0.000114989190478809 7.02635661582462e-05 8.02940303401556e-06 
0.0198673773556948 0.000113162270281464 6.83234320604242e-05 8.04678438726114e-06 
0.0191009808331728 0.000109629567305092 6.52278904453851e-05 8.29978398542153e-06 
0.0182202719151974 0.000104769766039681 6.23649102635682e-05 8.35070022731088e-06 
0.0173250921070576 9.75572183961049e-05 5.99118357058614e-05 8.36718299979111e-06 
0.0164890196174383 9.05519409570843e-05 5.77261635044124e-05 8.20333389128791e-06 
0.0157798640429974 8.35694518173113e-05 5.58306055609137e-05 8.18456555862213e-06 
0.0152275301516056 7.68566969782114e-05 5.48835050722118e-05 8.00443103798898e-06 
0.014834868721664 7.20133903087117e-05 5.39257671334781e-05 7.85677548265085e-06 
0.0145861972123384 6.90272136125714e-05 5.32611375092529e-05 7.70646511227824e-06 
0.0144621832296252 6.69875007588416e-05 5.24066599609796e-05 7.57470434109564e-06 
0.0144390966743231 6.63402897771448e-05 5.20824687555432e-05 7.45047464079107e-06 
0.0144978072494268 6.60879813949578e-05 5.19275527040008e-05 7.35965522835613e-06 
0.0146181546151638 6.59099459880963e-05 5.21700385434087e-05 7.26413782103918e-06 
0.0148237468674779 6.65749830659479e-05 5.2424435125431e-05 7.1069403020374e-06 
0.0151264546439052 6.8347915657796e-05 5.35360850335564e-05 6.8903023020539e-06 
0.015558841638267 6.95697453920729e-05 5.57296370971017e-05 6.48746390652377e-06 
0.0162468496710062 7.32306070858613e-05 5.92346332268789e-05 6.150239642011e-06 
0.0174847394227982 8.14988306956366e-05 6.55478870612569e-05 5.59309091840987e-06 
0.0198048893362284 9.55498253460974e-05 7.7254546340555e-05 5.03323190059746e-06 
0.0241292789578438 0.000119005773740355 9.68360618571751e-05 4.1585544749978e-06 
0.0316207520663738 0.000153375411173329 0.000125976031995378 2.53180428444466e-06 
0.0433311201632023 0.000193672705790959 0.00015950103988871 8.82732251739071e-07 
0.0597796253859997 0.000228670978685841 0.000191887811524794 -1.01411124830975e-07 
0.080682098865509 0.000251937832217664 0.000215598120121285 -1.68148244483746e-06 
0.104571677744389 0.000240784749621525 0.000222566071897745 -2.80033782473765e-06 
0.128834649920464 0.000198239693418145 0.000205447679036297 -2.64259915638831e-06 
0.151319488883018 0.00012419858830981 0.000171807652805001 -3.07157961287885e-06 
0.169911026954651 3.39614343829453e-05 0.000129097665194422 -3.05413618661987e-06 
0.183791920542717 -6.64212784613483e-05 7.8450160799548e-05 -2.43215231421345e-06 
0.192800655961037 -0.00014081661356613 3.43965875799768e-05 -4.11732298744028e-06 
0.198118299245834 -0.000199724017875269 -1.69634972735366e-06 -3.10444238493801e-06 
0.200201526284218 -0.000250896904617548 -2.6046762286569e-05 -5.7680011877892e-07 
0.200303643941879 -0.000280138658126816 -4.03035701310728e-05 -1.79057497007307e-06 
0.198898643255234 -0.000295242120046169 -4.29949104727712e-05 -2.34614071814576e-06 
0.196438699960709 -0.000321290717693046 -4.84736447106116e-05 -5.11031487349101e-07 
0.193189486861229 -0.000337060278980061 -5.29477329109795e-05 -2.55557802120165e-06 
0.189829558134079 -0.000337057950673625 -5.16486616106704e-05 -4.49968729299144e-06 
0.186226963996887 -0.000333187112119049 -5.7856654166244e-05 -3.47594072991342e-06 
0.182702019810677 -0.00032428078702651 -6.18419799138792e-05 -3.08567791762471e-06 
0.179362073540688 -0.000301097257761285 -6.19948477833532e-05 -1.68684357504389e-06 
0.176083236932755 -0.000278741877991706 -6.02996697125491e-05 -2.62377124471413e-08 
0.172984674572945 -0.000240541136008687 -6.13321026321501e-05 4.82132804791036e-07 
0.169797658920288 -0.00021407485473901 -5.88782349950634e-05 2.23626693696133e-06 
0.166323393583298 -0.000179786366061307 -5.9518679336179e-05 4.6674904297106e-06 
0.16276341676712 -0.000139100651722401 -6.08093650953379e-05 6.22335892330739e-06 
0.159074798226357 -0.000116090574010741 -5.79707957513165e-05 6.21174331172369e-06 
0.154989182949066 -0.000106199317087885 -5.48458010598551e-05 6.19055708739324e-06 
0.15102231502533 -7.72148559917696e-05 -5.02623697684612e-05 5.46742739970796e-06 
0.146847188472748 -6.01726897002663e-05 -4.36612754128873e-05 5.54971666133497e-06 
0.142545104026794 -5.03568189742509e-05 -3.11287803924643e-05 3.13690406983369e-06 
0.138187453150749 -2.90606367343571e-05 -2.01755410671467e-05 4.23413894168334e-06 
0.133724600076675 2.57339911513554e-06 -1.2469123248593e-05 4.30444106314098e-06 
0.129051685333252 2.84171783277998e-05 -3.74523960999795e-06 3.80072378902696e-06 
0.124300837516785 5.65082336834166e-05 4.03351987188216e-06 1.21548453080322e-06 
0.119451493024826 8.73883254826069e-05 9.05520937521942e-06 7.18058174697944e-07 
0.114432819187641 0.00013484554074239 1.38013238029089e-05 -1.40903841838735e-06 
0.10941993445158 0.000176730143721215 1.87614950846182e-05 -2.73555133389891e-06 
0.104253202676773 0.000222425514948554 2.04738262254978e-05 -4.08616142522078e-06 
0.0993342399597168 0.000279378524282947 2.16028929571621e-05 -4.29416559200035e-06 
0.0943540930747986 0.000342400482622907 2.00579179363558e-05 -5.22692744198139e-06 
0.0894483774900436 0.00040023130713962 1.90665959962644e-05 -6.05227478445158e-06 
0.0843511447310448 0.000464982411358505 1.55888119479641e-05 -6.63244463794399e-06 
0.0793454796075821 0.000524224655237049 1.35401805891888e-05 -7.06529772287467e-06 
0.074207492172718 0.000578717328608036 1.15953253043699e-05 -8.23566642793594e-06 
0.0689843222498894 0.000632453593425453 6.44626470602816e-06 -8.97570680535864e-06 
0.0635639727115631 0.000687946449033916 -2.98509303320316e-06 -9.53253402258269e-06 
0.0581488348543644 0.00073805043939501 -1.3559762010118e-05 -9.28628924157238e-06 
0.0526922903954983 0.000781764916609973 -2.60973374679452e-05 -8.52108405524632e-06 
0.0472544021904469 0.000822578615043312 -4.26731021434534e-05 -7.49817490941496e-06 
0.0419993586838245 0.000851223827339709 -5.80913183512166e-05 -5.60182115805219e-06 
0.0370931550860405 0.00086792791262269 -7.25872596376576e-05 -3.42214229931415e-06 
0.0324957519769669 0.000868088915012777 -8.65416004671715e-05 -1.32465788738045e-06 
0.0282306484878063 0.00085885648149997 -9.98429313767701e-05 4.6815017640256e-07 
0.024205144494772 0.000826987845357507 -0.000108091175206937 2.84934844785312e-06 
0.0204805769026279 0.000779604713898152 -0.000112817673652899 5.72445651414455e-06 
0.017013693228364 0.000711820495780557 -0.000111569170258008 8.68451843416551e-06 
0.0138325085863471 0.000630256545264274 -0.000105811886896845 1.11637800728204e-05 
0.010966801084578 0.000535340805072337 -9.51707916101441e-05 1.31785272969864e-05 
0.00845218356698751 0.0004397610318847 -8.24768503662199e-05 1.42655844683759e-05 
0.00630965642631054 0.000344860833138227 -6.7965462221764e-05 1.39205585583113e-05 
0.00455988105386496 0.000259319727774709 -5.41730187251233e-05 1.2693755707005e-05 
0.00320724933408201 0.000189127662451938 -4.19377938669641e-05 1.12196012196364e-05 
0.00215908489190042 0.000133287350763567 -3.20824692607857e-05 9.54984261625214e-06 
0.00142775743734092 9.12316609174013e-05 -2.44594248215435e-05 7.81472317612497e-06 
0.000909085618332028 6.20016071479768e-05 -1.88109170267126e-05 6.56242991681211e-06 
0.000561557768378407 4.19368116126861e-05 -1.47322034536046e-05 5.50416643818608e-06 
0.000324422551784664 2.76716345979366e-05 -1.19064079626696e-05 4.73342242912622e-06 
0.00019245375005994 1.82329076778842e-05 -9.38134871830698e-06 4.05754235544009e-06 
0.000118490315799136 1.27785242511891e-05 -8.02083650341956e-06 3.70592533727176e-06 
5.45493603567593e-05 7.9607325460529e-06 -6.93438869348029e-06 3.32339322994812e-06 
2.10176722248434e-06 4.55026565759908e-06 -6.17702607996762e-06 3.25947985402308e-06 
-3.22827763739042e-05 1.68848941939359e-06 -5.35211074748076e-06 3.02921762340702e-06 
-6.08861191722099e-05 -8.43508800585369e-08 -4.88790465169586e-06 2.87175771518378e-06 
-9.6228119218722e-05 -2.22375319935963e-06 -4.10029360864428e-06 2.80870222013618e-06 
-0.000102698664704803 -2.19878461393819e-06 -3.63021490557003e-06 2.50388416134228e-06 
0 0 0 0 
0 0 0 0 
0 0 0 0 
0 0 0 0 
0 0 0 0 
0 0 0 0 
0 0 0 0 
0 0 0 0 
0 0 0 0 
0 0 0 0 
0 0 0 0 
0 0 0 0 
0 0 0 0 
0 0 0 0 
99.5569152832031 0.344207167625427 0.0776187255978584 0.00724521931260824 
