0.000958457007072866 -0.00703914510086179 
0.000847339630126953 -0.000839578220620751 
0.000785684096626937 0.00315457582473755 
0.000851110264193267 0.00728702545166016 
0.00105855893343687 0.0144706144928932 
0.00158237642608583 0.0276402644813061 
0.00256204162724316 0.0465837679803371 
0.00422248616814613 0.0730875283479691 
0.00666518602520227 0.103495329618454 
0.0101023856550455 0.141320332884789 
0.0147138824686408 0.189835354685783 
0.0204926878213882 0.246611654758453 
0.0270638447254896 0.302669405937195 
0.0341834500432014 0.345471203327179 
0.0432067811489105 0.364657938480377 
0.0561832375824451 0.346722275018692 
0.0715371817350388 0.29426646232605 
0.0851913765072823 0.227889522910118 
0.0948752984404564 0.167487621307373 
0.101944953203201 0.118294715881348 
0.108701832592487 0.0792158097028732 
0.114915281534195 0.0454876609146595 
0.1202492415905 0.0127670532092452 
0.124669410288334 -0.0111625613644719 
0.12846839427948 -0.0308516211807728 
0.131835043430328 -0.0342180393636227 
0.135248869657516 -0.0358586125075817 
0.138886913657188 -0.0444198474287987 
0.142540171742439 -0.0432013235986233 
0.146271273493767 -0.0511751733720303 
0.14982545375824 -0.0482085980474949 
0.153271958231926 -0.0551046393811703 
0.156034559011459 -0.0499104969203472 
0.158396050333977 -0.0442071668803692 
0.160177871584892 -0.0481565147638321 
0.161757737398148 -0.0518295131623745 
0.16303862631321 -0.0559748187661171 
0.1644017547369 -0.0555953457951546 
0.165800958871841 -0.0600519701838493 
0.166930720210075 -0.0598232634365559 
0.167737647891045 -0.0485804192721844 
0.168173313140869 -0.0448746234178543 
0.16799983382225 -0.0492450743913651 
0.167556136846542 -0.0513693206012249 
0.166450560092926 -0.0504677146673203 
0.165114134550095 -0.0318139940500259 
0.163357794284821 -0.0263998229056597 
0.161089777946472 -0.00707385130226612 
0.158276185393333 -0.00303524639457464 
0.155243948101997 -0.0017673879629001 
0.151697084307671 -0.0117769502103329 
0.148148417472839 -0.0107894949615002 
0.143998041749001 -0.0124916471540928 
0.139805868268013 -0.00616822298616171 
0.134648784995079 -0.00731135485693812 
0.129269406199455 0.000388657033909112 
0.123711630702019 0.000188719452125952 
0.118578441441059 0.00867527164518833 
0.113377675414085 0.00984326284378767 
0.107960626482964 0.0203741602599621 
0.102431856095791 0.0222495105117559 
0.0966680645942688 0.0309467688202858 
0.0911445915699005 0.0198559109121561 
0.0854371637105942 0.0139525542035699 
0.0794867798686028 0.00824330374598503 
0.0732982382178307 0.0142828933894634 
0.0671608373522758 0.0107402596622705 
0.0614820085465908 0.0102136172354221 
0.0562705136835575 0.0111587643623352 
0.0517815388739109 0.0153698837384582 
0.0479255653917789 0.0163667984306812 
0.0446188040077686 0.0166746154427528 
0.0416785478591919 0.0172490011900663 
0.0391275100409985 0.016668813303113 
0.0369155704975128 0.0183319039642811 
0.0350033715367317 0.0171325150877237 
0.0334312319755554 0.0172443669289351 
0.0319784544408321 0.0182412434369326 
0.0306599624454975 0.0196412093937397 
0.0293581541627645 0.0210038162767887 
0.0281730536371469 0.0187621973454952 
0.0269802771508694 0.0187690015882254 
0.0257805176079273 0.0174598023295403 
0.0245836768299341 0.0167061761021614 
0.0234156977385283 0.0155367041006684 
0.0222292263060808 0.0152045320719481 
0.0209911298006773 0.0129180066287518 
0.0198649782687426 0.0129535989835858 
0.0188435837626457 0.0125391753390431 
0.0180317144840956 0.0136575223878026 
0.017292058095336 0.0128908790647984 
0.0166796911507845 0.0120538705959916 
0.0161525420844555 0.00935749523341656 
0.0157633237540722 0.00915477611124516 
0.0154463611543179 0.00704293930903077 
0.0151907159015536 0.00670799752697349 
0.0150241535156965 0.00505008734762669 
0.0149506470188498 0.00640584994107485 
0.0149582894518971 0.00776166701689363 
0.0150054041296244 0.00578575674444437 
0.0151141379028559 0.00559228239580989 
0.0152735691517591 0.00421648006886244 
0.0154205150902271 0.00530080078169703 
0.0155315790325403 0.00537705747410655 
0.0156068047508597 0.00648682424798608 
0.0156177952885628 0.00773411570116878 
0.0155595261603594 0.00757014099508524 
0.0154849290847778 0.00682981498539448 
0.0154048381373286 0.00675568962469697 
0.0152877690270543 0.00653478177264333 
0.0151643073186278 0.00744205247610807 
0.0150675978511572 0.00644769566133618 
0.0150186829268932 0.00645847478881478 
0.0149853508919477 0.00674109347164631 
0.0149647817015648 0.00845970679074526 
0.0150295970961452 0.00972259603440762 
0.0150964027270675 0.0107919592410326 
0.0151559095829725 0.0104034030809999 
0.0152239901944995 0.0101016042754054 
0.0152655253186822 0.00888417568057775 
0.0153179643675685 0.00790307484567165 
0.0153075912967324 0.00792090687900782 
0.0152683742344379 0.00811632536351681 
0.0152218462899327 0.0102212904021144 
0.0152070326730609 0.00884248223155737 
0.0151942111551762 0.00921995565295219 
0.0151351066306233 0.00912190321832895 
0.0150419287383556 0.0104552069678903 
0.0149063896387815 0.00875599589198828 
0.0147901605814695 0.00707645295187831 
0.0145675325766206 0.0047576786018908 
0.0143889226019382 0.00183872471097857 
0.0141338128596544 -0.000936267373617738 
0.0139215243980289 -0.00379123003222048 
0.0136037012562156 -0.0046705324202776 
0.0133368317037821 -0.00736821023747325 
0.0130670201033354 -0.0104697970673442 
0.0127913663163781 -0.0147179439663887 
0.0123797105625272 -0.0198470633476973 
0.011927604675293 -0.0250027719885111 
0.0113957962021232 -0.0299976971000433 
0.0108398264274001 -0.0340362004935741 
0.0101133212447166 -0.0363740026950836 
0.00937236379832029 -0.0388715490698814 
0.00854651816189289 -0.0414264053106308 
0.00774982944130898 -0.0454003661870956 
0.00691343937069178 -0.0474539399147034 
0.00615098793059587 -0.0478862002491951 
0.00535938749089837 -0.048378013074398 
0.00457968702539802 -0.0492146611213684 
0.00378428329713643 -0.0482384152710438 
0.00309673068113625 -0.043847169727087 
0.00247260881587863 -0.0378279685974121 
0.00194958073552698 -0.0328814759850502 
0.00149856077041477 -0.025689210742712 
0.00109723664354533 -0.0200981665402651 
0.000794525374658406 -0.0123026883229613 
0.000537178886588663 -0.00862963125109673 
0.00038557339576073 -0.0060041188262403 
0.000256265630014241 -0.00462129293009639 
0.000160941170179285 -0.00320279481820762 
9.05966080608778e-05 -0.000678042939398438 
5.10121462866664e-05 -0.000338065321557224 
5.75103476876393e-05 0.000808458717074245 
5.83480359637178e-05 0.000415849674027413 
5.80354862904642e-05 0.00085875706281513 
3.70093075616751e-05 0.000127950377645902 
2.80475906038191e-05 0.000164945682627149 
7.81148719397606e-06 0.000460833427496254 
-1.8992224795511e-05 0.000151513871969655 
-1.42683493322693e-05 0.000657062686514109 
5.10966492583975e-06 0.000449686398496851 
2.45910655394255e-06 0.00112880568485707 
2.85527003143216e-05 0.00183414330240339 
1.13370015242253e-05 0.00238290475681424 
2.44748371187598e-05 0.00215812190435827 
-6.77342222843436e-06 0.00121447863057256 
-1.8981672837981e-06 0.00023945135762915 
-3.05533376376843e-06 0.000394287751987576 
-1.45895392051898e-05 0.000723150849808007 
-7.2075636126101e-06 0.00103310286067426 
-1.58244420163101e-05 0.000867797702085227 
-1.09026314021321e-05 0.000367397005902603 
-1.77832571353065e-05 0.000429379928391427 
-2.02473711397033e-05 0.000812135811429471 
