0 0 0 0 
0 0 0 0 
0 0 0 0 
0 0 0 0 
0 0 0 0 
0 0 0 0 
0 0 0 0 
0 0 0 0 
0 0 0 0 
0 0 0 0 
0.00751133356243372 0.000452960026450455 -7.33175920686335e-06 2.71100434474647e-05 
0.0116836009547114 0.000694691319949925 -1.38191680889577e-05 3.30196999129839e-05 
0.0168602727353573 0.000970185559708625 -1.17523368317052e-05 3.58092183887493e-05 
0.0226320140063763 0.00124189956113696 -6.22424295215751e-06 3.81852223654278e-05 
0.0307217910885811 0.00152185291517526 5.58747660761583e-06 3.92218644265085e-05 
0.0409871302545071 0.00176129024475813 2.83662557194475e-05 3.20578947139438e-05 
0.0524175278842449 0.00190001260489225 5.48864481970668e-05 1.88832036656095e-05 
0.0647112056612968 0.00190481077879667 7.55129949538969e-05 5.7183774515579e-06 
0.0772937908768654 0.00176236301194876 8.84789260453545e-05 -6.77138950777589e-06 
0.0885968953371048 0.00149205524940044 9.20819511520676e-05 -1.96225246327231e-05 
0.0982353761792183 0.00115831638686359 8.09303164714947e-05 -2.47937041422119e-05 
0.106742441654205 0.000845229427795857 6.20352147961967e-05 -2.42619717027992e-05 
0.114012204110622 0.000600296538323164 4.33945788245182e-05 -2.40238932747161e-05 
0.119869820773602 0.000437552371295169 2.68169624177972e-05 -2.40105782722821e-05 
0.124658741056919 0.000343977910233662 1.28105966723524e-05 -2.32165039051324e-05 
0.12869493663311 0.000294079974992201 2.30086857300194e-06 -2.19967569137225e-05 
0.132324486970901 0.000255376100540161 -5.18079696121276e-06 -2.10288653761381e-05 
0.135854259133339 0.000230960635235533 -1.08884114524699e-05 -1.97144599951571e-05 
0.139376550912857 0.000210059370147064 -1.52861448441399e-05 -1.85564622370293e-05 
0.14278170466423 0.000191062441444956 -1.75596287590452e-05 -1.81346495082835e-05 
0.145991057157516 0.000178735455847345 -2.0218296413077e-05 -1.79029757418903e-05 
0.148895233869553 0.000181825671461411 -2.2054784494685e-05 -1.72694526554551e-05 
0.151397213339806 0.000180525879841298 -2.28726294153603e-05 -1.71566844073823e-05 
0.153676584362984 0.000181387818884104 -2.4078632122837e-05 -1.47132031997899e-05 
0.15573313832283 0.00017569430929143 -2.67057021119399e-05 -9.47734861256322e-06 
0.157659649848938 0.00016459402104374 -3.02152475342155e-05 -2.88572277895582e-06 
0.159456610679626 0.000142211982165463 -3.36420307576191e-05 1.10441885681212e-06 
0.161243945360184 0.000119438773253933 -3.79638695449103e-05 4.14382293456583e-06 
0.162914410233498 9.36617070692591e-05 -4.3114137952216e-05 4.9940349526878e-06 
0.164315670728683 7.33385531930253e-05 -4.56055095128249e-05 3.01596401186544e-06 
0.165351733565331 4.6157725591911e-05 -4.51927844551392e-05 -7.0971594823277e-07 
0.166180640459061 1.55402958625928e-05 -4.58164286101237e-05 4.30559026654009e-07 
0.166544541716576 -1.79678263521055e-05 -4.56171328551136e-05 2.76859054793022e-06 
0.166504517197609 -5.79021798330359e-05 -4.31501139246393e-05 5.32406511410954e-06 
0.166069090366364 -9.79605538304895e-05 -4.14562018704601e-05 9.09736172616249e-06 
0.165210038423538 -0.000133847250253893 -3.84233535442036e-05 1.28759465951589e-05 
0.163872480392456 -0.000168619444593787 -3.33241914631799e-05 1.29215286506223e-05 
0.162140965461731 -0.000205197007744573 -2.63474612438586e-05 1.31836577565991e-05 
0.159921810030937 -0.000233460988965817 -1.95644024643116e-05 1.38232571771368e-05 
0.157398030161858 -0.000262741959886625 -1.30465123220347e-05 1.29167956401943e-05 
0.154540359973907 -0.000289832358248532 -9.89965064945864e-06 1.25214182844502e-05 
0.151385650038719 -0.000309183029457927 -6.23294272372732e-06 1.33468083731714e-05 
0.147898644208908 -0.000324161577736959 -4.74041053166729e-06 1.32391614897642e-05 
0.143938764929771 -0.000329617381794378 -2.31943818107538e-06 1.15987277240492e-05 
0.139650866389275 -0.000329170317854732 4.50205391189229e-07 1.02677995528211e-05 
0.135070383548737 -0.000332018767949194 4.9449672587798e-06 8.65221045387443e-06 
0.130224287509918 -0.000334031996317208 8.21690809971187e-06 6.70816280035069e-06 
0.125221654772758 -0.000338415993610397 1.0872473467316e-05 4.95739868711098e-06 
0.120339050889015 -0.000356025178916752 1.16938253995613e-05 4.13700036006048e-06 
0.115295715630054 -0.000375032977899536 1.25113083413453e-05 3.79737866751384e-06 
0.110192656517029 -0.000389651249861345 1.40923302751617e-05 3.46818433172302e-06 
0.104898378252983 -0.000405183789553121 1.54472963913577e-05 3.190167944922e-06 
0.0994327068328857 -0.000420384661993012 1.79630987986457e-05 3.36934317601845e-06 
0.0936678051948547 -0.000427051360020414 2.11744300031569e-05 3.3415042253182e-06 
0.0876892358064651 -0.000435435678809881 2.49358345172368e-05 2.94994811156357e-06 
0.0815959423780441 -0.000442617165390402 2.81845950667048e-05 2.88833075501316e-06 
0.0756095424294472 -0.000449260172899812 3.2499465305591e-05 2.57500300904212e-06 
0.0698602274060249 -0.00045204081106931 3.62199098162819e-05 2.47643083639559e-06 
0.064584381878376 -0.000462048774352297 3.96757968701422e-05 2.50856214734085e-06 
0.0598884709179401 -0.000467895355541259 4.19108218920883e-05 3.06454080600815e-06 
0.0557277053594589 -0.000472104526124895 4.34057146776468e-05 3.12164229399059e-06 
0.0520578846335411 -0.000471465580631047 4.30991021858063e-05 3.7826200696145e-06 
0.0488588251173496 -0.000473624531878158 4.16494222008623e-05 4.70219265480409e-06 
0.0459907278418541 -0.000467167992610484 4.0299397369381e-05 5.76964293941273e-06 
0.0434625931084156 -0.000463298085378483 3.94244671042543e-05 6.27589133728179e-06 
0.0412549786269665 -0.000456466630566865 3.8986199797364e-05 6.66247888148064e-06 
0.0393352024257183 -0.000455240631708875 3.91123321605846e-05 7.20052321412368e-06 
0.0376080647110939 -0.0004531464073807 4.0041224565357e-05 7.12139444658533e-06 
0.0360114388167858 -0.000449685001512989 4.00908102164976e-05 6.77329717291286e-06 
0.0344754606485367 -0.000442541699158028 3.96614850615151e-05 6.28204816166544e-06 
0.0329562686383724 -0.000438807473983616 3.86772480851505e-05 5.64514311918174e-06 
0.0313860066235065 -0.000428176659625024 3.7375542888185e-05 4.91363152832491e-06 
0.029847027733922 -0.000414010894019157 3.59365039912518e-05 4.23961364504066e-06 
0.0283244457095861 -0.000401427823817357 3.54039621015545e-05 3.33083448822435e-06 
0.026813343167305 -0.000389057444408536 3.50020236510318e-05 2.70700115834188e-06 
0.0253014415502548 -0.000374323601135984 3.48903813573997e-05 2.34556432587851e-06 
0.0238642711192369 -0.000364511099178344 3.46236301993486e-05 1.93318646779517e-06 
0.0224734805524349 -0.00035492837196216 3.43479732691776e-05 1.60744082222664e-06 
0.0211668666452169 -0.00034522099304013 3.34091273543891e-05 1.56261330630514e-06 
0.0199705995619297 -0.000336567551130429 3.20214458042756e-05 1.55432087467489e-06 
0.0189358722418547 -0.000328556867316365 3.04252316709608e-05 1.59835087742977e-06 
0.0180118884891272 -0.00031878164736554 2.8919717806275e-05 1.69487429957371e-06 
0.0172185748815536 -0.000311802665237337 2.74029662250541e-05 1.91658841686149e-06 
0.0165661722421646 -0.000306120055029169 2.61856948782224e-05 2.13324324249697e-06 
0.0160174332559109 -0.000301009247777984 2.55888153333217e-05 2.44922898673394e-06 
0.0155719593167305 -0.000296700658509508 2.55509676208021e-05 2.57881583820563e-06 
0.0152122471481562 -0.000292489596176893 2.61391160165658e-05 2.61107402366179e-06 
0.014939378015697 -0.000289546005660668 2.70292912318837e-05 2.66724578068533e-06 
0.0147417550906539 -0.000288361217826605 2.82762794086011e-05 2.6848745164898e-06 
0.0145982624962926 -0.000287477829260752 2.91672913590446e-05 2.67708583123749e-06 
0.0144601687788963 -0.000286410853732377 2.97327987937024e-05 2.71763633463706e-06 
0.0143414400517941 -0.000287046685116366 2.99373677989934e-05 2.78150400845334e-06 
0.0141786197200418 -0.000283141736872494 3.025472688023e-05 2.72960255642829e-06 
0.0139643717557192 -0.000279263535048813 3.00627507385798e-05 2.74138164968463e-06 
0.0136803761124611 -0.000273187470156699 2.99730672850274e-05 2.62603793999006e-06 
0.0133228581398726 -0.000264506961684674 2.95430509140715e-05 2.53915163739293e-06 
0.0128808682784438 -0.000253486941801384 2.90656735160155e-05 2.42221767621231e-06 
0.0123876286670566 -0.000243381204199977 2.80400854535401e-05 2.37469953390246e-06 
0.0118469595909119 -0.000232257953030057 2.70237906079274e-05 2.43327576754382e-06 
0.011285487562418 -0.000220310466829687 2.57933788816445e-05 2.34928302234039e-06 
0.0107190515846014 -0.000209192920010537 2.45572882704437e-05 2.30565387937531e-06 
0.0101819131523371 -0.000199908696231432 2.29705638048472e-05 2.33762716561614e-06 
0.00966115761548281 -0.000190643258974887 2.17011711356463e-05 2.31877311307471e-06 
0.00918934680521488 -0.000182002695510164 2.03097315534251e-05 2.14679516830074e-06 
0.00875539798289537 -0.000174188447999768 1.93067135114688e-05 2.13936004911375e-06 
0.00838790647685528 -0.000168865197338164 1.8491962691769e-05 2.13335420085059e-06 
0.00805945880711079 -0.00016307744954247 1.81502309715142e-05 2.06446566153318e-06 
0.00779775204136968 -0.000159576331498101 1.7795204257709e-05 2.00817385120899e-06 
0.00756867602467537 -0.000156432055518962 1.77698366314871e-05 1.99774194697966e-06 
0.0073903021402657 -0.000155572488438338 1.75482109625591e-05 2.16817807086045e-06 
0.00724241696298122 -0.000154228589963168 1.76172216015402e-05 2.17840238292411e-06 
0.00713172275573015 -0.000153109169332311 1.75733748619677e-05 2.1705395738536e-06 
0.00704630697146058 -0.000151997024659067 1.75940931512741e-05 2.15754039345484e-06 
0.00698157353326678 -0.000151207088492811 1.78186292032478e-05 2.12119630305097e-06 
0.00694423681125045 -0.000149677493027411 1.80844017449999e-05 2.0175625650154e-06 
0.00692891189828515 -0.000149378756759688 1.81691757461522e-05 2.02087790057703e-06 
0.00693569192662835 -0.000149903062265366 1.83455995284021e-05 2.06003414859879e-06 
0.00694434624165297 -0.000150885491166264 1.83259253390133e-05 2.16772991734615e-06 
0.00696432776749134 -0.000152074237121269 1.81770847120788e-05 2.33406922234281e-06 
0.00697568152099848 -0.000152929918840528 1.82235107786255e-05 2.33690707318601e-06 
0.00698143895715475 -0.000153205182868987 1.82938892976381e-05 2.31802096095635e-06 
0.00696793757379055 -0.000151829008245841 1.85318003786961e-05 2.24681093641266e-06 
0.00694903451949358 -0.000149316503666341 1.91950330190593e-05 2.24268364945601e-06 
0.00692079495638609 -0.000145699625136331 2.00556096388027e-05 2.100463007082e-06 
0.00686900690197945 -0.000141277414513752 2.06203421839746e-05 2.01372517949494e-06 
0.00680624367669225 -0.000136075133923441 2.12454633583548e-05 1.92320794667467e-06 
0.00674248160794377 -0.000132611094159074 2.15563304664101e-05 1.91660615200817e-06 
0.00665478408336639 -0.000128838568343781 2.18754976231139e-05 1.68735937222664e-06 
0.00655832653865218 -0.000125774458865635 2.20533165702363e-05 1.65189442213887e-06 
0.00644612312316895 -0.000124778569443151 2.24262221308891e-05 1.58127159011201e-06 
0.00628907373175025 -0.000124217636766843 2.26210959226592e-05 1.5140005871217e-06 
0.00607915734872222 -0.000123194491607137 2.29472170758527e-05 1.46116110499861e-06 
0.00582461338490248 -0.00012294968473725 2.29724173550494e-05 1.53177393258375e-06 
0.00551568018272519 -0.000122644167277031 2.28201897698455e-05 1.37799599997379e-06 
0.00515950843691826 -0.000121196222607978 2.24546765821287e-05 1.36341861889377e-06 
0.00478168064728379 -0.000119460826681461 2.18222721741768e-05 1.42995452279138e-06 
0.00438281707465649 -0.00011699230526574 2.08286164706806e-05 1.33380331135413e-06 
0.00396525394171476 -0.000112951522169169 1.94646527233999e-05 1.26551503853989e-06 
0.00352747202850878 -0.000106884617707692 1.77905712916981e-05 1.22723054118978e-06 
0.0030819745734334 -9.90576954791322e-05 1.57573776959907e-05 1.14213025881327e-06 
0.00263897865079343 -9.05273409443907e-05 1.35423506435473e-05 9.78182356448087e-07 
0.00220409827306867 -8.00698617240414e-05 1.10875798782217e-05 9.06030322767037e-07 
0.00181120913475752 -7.06362043274567e-05 8.71526572154835e-06 8.84462679096032e-07 
0.0014539014082402 -6.08245936746243e-05 6.53479946777225e-06 8.5726435372635e-07 
0.00116072990931571 -5.22330155945383e-05 4.60432920590392e-06 8.58678390613932e-07 
0.000915797951165587 -4.33571003668476e-05 2.93671246254235e-06 8.31300326353812e-07 
0.000711743196006864 -3.54523581336252e-05 1.74763613358664e-06 7.33486501758307e-07 
0.000556562328711152 -2.83043864328647e-05 9.63943989518157e-07 5.46582555216446e-07 
0.000439293798990548 -2.21618556679459e-05 3.48149882256621e-07 4.2561711666167e-07 
0.000351908354787156 -1.79081307578599e-05 3.6109588652522e-09 2.93943855922407e-07 
0.000282906170468777 -1.4416399608308e-05 2.39738170648707e-07 1.05542241612966e-07 
0.00024622114142403 -1.23818717838731e-05 8.38080723042367e-07 8.51475263630164e-08 
0.000220328060095198 -9.87306248134701e-06 1.923251147673e-06 5.34489830172902e-09 
0.000217008098843507 -9.04329408513149e-06 3.78219056074158e-06 -8.94501006598603e-09 
0.000228210454224609 -7.25697418602067e-06 6.74110606269096e-06 -1.50089420003496e-07 
0.000264997594058514 -5.45233297088998e-06 1.07774840216734e-05 -2.01512264652592e-07 
0.000334917625878006 -4.49872368335491e-06 1.6113923265948e-05 -4.58555945215267e-07 
0.000422867073211819 -4.09854510508012e-06 2.30092027777573e-05 -5.99894974584458e-07 
0.000537445186637342 -3.30264424519555e-06 3.15742363454774e-05 -8.88265617504658e-07 
0.000663836428429931 -3.20989579449815e-06 4.04979509767145e-05 -1.17210390726541e-06 
0.000823568203486502 -2.71095473181049e-06 5.20501707796939e-05 -1.39755275085918e-06 
0 0 0 0 
0 0 0 0 
0 0 0 0 
0 0 0 0 
0 0 0 0 
0 0 0 0 
0 0 0 0 
0 0 0 0 
0 0 0 0 
0 0 0 0 
0 0 0 0 
0 0 0 0 
0 0 0 0 
0 0 0 0 
99.3501663208008 0.580689907073975 0.0374536141753197 0.0129755325615406 
