0 0 0 0 
0 0 0 0 
0 0 0 0 
0 0 0 0 
0 0 0 0 
0 0 0 0 
0 0 0 0 
0 0 0 0 
0 0 0 0 
0 0 0 0 
0.0162996705621481 0.000659659504890442 0.00048555270768702 4.10725078836549e-06 
0.0204689856618643 0.000796007690951228 0.000576346181333065 6.45777754471055e-06 
0.025295227766037 0.000910432834643871 0.000615396187640727 7.11817074261489e-06 
0.0317928791046143 0.000990846892818809 0.000586793350521475 6.87061947246548e-06 
0.0417374931275845 0.001016651163809 0.000434535642853007 5.03617320646299e-06 
0.0537626855075359 0.00099617475643754 0.00020305257930886 2.6385530418338e-06 
0.0662435740232468 0.000939873862080276 -5.71543168916833e-05 -6.05304933287698e-07 
0.0785719603300095 0.00086910929530859 -0.000302966654999182 -3.01274417324748e-06 
0.0893851295113564 0.000803247385192662 -0.000475565262604505 -4.43043427367229e-06 
0.0971005707979202 0.000756447960156947 -0.000528489239513874 -4.94433061248856e-06 
0.102957762777805 0.000713250832632184 -0.000516050320584327 -5.1251317927381e-06 
0.108384922146797 0.000665858737193048 -0.000466853671241552 -4.21177901444025e-06 
0.113661617040634 0.000601577514316887 -0.000408295658417046 -4.30628460890148e-06 
0.118611440062523 0.000530881341546774 -0.000345040549291298 -4.05393893743167e-06 
0.123397454619408 0.000450069463113323 -0.00028743568691425 -4.29935789725278e-06 
0.127905860543251 0.000374464900232852 -0.000225112613406964 -4.82484665553784e-06 
0.1324722468853 0.000304432003758848 -0.000169584178365767 -5.36820789420744e-06 
0.136917680501938 0.000236671650782228 -0.000119960881420411 -5.13839813720551e-06 
0.141385719180107 0.000175838591530919 -7.90251069702208e-05 -4.08315690947347e-06 
0.145548149943352 0.000127518767840229 -4.1523962863721e-05 -3.15273473461275e-06 
0.149501025676727 8.12050784588791e-05 -1.17818472062936e-05 -1.53184157625219e-06 
0.152852445840836 4.09646563639399e-05 1.5940979210427e-05 -6.36327399661241e-07 
0.15571454167366 1.49638490256621e-05 4.30355648859404e-05 2.6982851863977e-07 
0.15809041261673 -8.89022885530721e-06 6.2129860452842e-05 -1.01125642970601e-07 
0.160156533122063 -3.78684162569698e-05 7.81801791163161e-05 3.61043930752203e-07 
0.16211661696434 -6.67409040033817e-05 9.65048529906198e-05 2.60986041666911e-07 
0.164075076580048 -9.59808676270768e-05 0.000111497240141034 -2.42409726070036e-07 
0.166130140423775 -0.000124340847833082 0.000122152996482328 -1.25525377825397e-06 
0.168184712529182 -0.000159726056153886 0.000131332490127534 -1.99391024580109e-06 
0.169929504394531 -0.000182908130227588 0.000136939168442041 -3.38207587446959e-06 
0.171142771840096 -0.000199518442968838 0.000144143705256283 -4.51494679509779e-06 
0.171647652983665 -0.000214712214074098 0.00015008203627076 -5.05416392115876e-06 
0.171545580029488 -0.00022247240121942 0.000155681846081279 -5.81873564442503e-06 
0.170735627412796 -0.000222447095438838 0.000157416798174381 -6.59148645354435e-06 
0.169402778148651 -0.000224913921556436 0.000167334132129326 -6.83627558828448e-06 
0.167650505900383 -0.000229157361900434 0.000173765394720249 -6.3479205891781e-06 
0.165679037570953 -0.000235481405979954 0.000171361956745386 -6.09033622822608e-06 
0.163140922784805 -0.000243860689806752 0.000165124001796357 -5.41079407412326e-06 
0.160432323813438 -0.000248929456574842 0.000157951668370515 -4.31929311162094e-06 
0.157543197274208 -0.00026624248130247 0.000144917124998756 -3.54132384927652e-06 
0.15415558218956 -0.000270050979452208 0.000127918101497926 -3.36543553203228e-06 
0.150352045893669 -0.000272088247584179 0.000116465722385328 -1.50468667925452e-06 
0.146332085132599 -0.000271850934950635 9.78293246589601e-05 -2.35645643442695e-07 
0.141389697790146 -0.000270647287834436 8.22061847429723e-05 9.06881155060546e-07 
0.13600666821003 -0.000251121207838878 6.4427440520376e-05 2.25901567318942e-06 
0.130371809005737 -0.000240637164097279 4.52035310445353e-05 3.02935200124921e-06 
0.12458660453558 -0.000224100062041543 2.10211401281413e-05 3.01946670333564e-06 
0.118622146546841 -0.000215734253288247 2.81712573269033e-07 4.11845167036518e-06 
0.112935364246368 -0.000210336889722385 -2.05620126507711e-05 4.76728018838912e-06 
0.107187233865261 -0.000211068225326017 -4.44383367721457e-05 5.28032387592248e-06 
0.101476192474365 -0.00021368516900111 -6.70611916575581e-05 6.56131760479184e-06 
0.0956691652536392 -0.000214466039324179 -8.42576555442065e-05 7.63929256208939e-06 
0.0897017419338226 -0.000207797347684391 -9.26997745409608e-05 7.98227210907498e-06 
0.0836855247616768 -0.000201059156097472 -0.000101917918073013 8.58793373481603e-06 
0.077530525624752 -0.000189364407560788 -0.000104875427496154 8.99278984434204e-06 
0.071358822286129 -0.000173982727574185 -0.00010403583291918 8.82766744325636e-06 
0.0653536319732666 -0.000160352326929569 -9.96759335976094e-05 8.33895046525868e-06 
0.0597183220088482 -0.000147680751979351 -9.41491889534518e-05 7.80308801040519e-06 
0.0546037182211876 -0.000132237226353027 -8.61024163896218e-05 6.9727952904941e-06 
0.050122857093811 -0.000118782329082023 -8.00965281086974e-05 6.62735055811936e-06 
0.0462250635027885 -0.000107944280898664 -7.26606813259423e-05 6.56896190776024e-06 
0.0428653657436371 -9.72691850620322e-05 -7.04057965776883e-05 6.58647695672698e-06 
0.039971224963665 -8.91973686520942e-05 -6.83531397953629e-05 6.70905865263194e-06 
0.0374267771840096 -8.16215615486726e-05 -6.51690788799897e-05 6.67875428916886e-06 
0.0352049432694912 -7.44672943255864e-05 -6.11865034443326e-05 6.51640993964975e-06 
0.0332754626870155 -6.59618672216311e-05 -5.96778227190953e-05 6.53788993076887e-06 
0.0315753743052483 -5.8044653997058e-05 -5.4701555200154e-05 6.35295100437361e-06 
0.0300647635012865 -5.16462350788061e-05 -5.24980932823382e-05 6.24099993729033e-06 
0.0286624412983656 -4.47126549261156e-05 -4.76192690257449e-05 6.35277638139087e-06 
0.0273282621055841 -3.57837598130573e-05 -4.28746243414935e-05 6.51607069812599e-06 
0.0260134544223547 -2.78618481388548e-05 -3.738159648492e-05 6.56314114166889e-06 
0.0247166771441698 -2.07349494303344e-05 -3.25056716974359e-05 6.6897500801133e-06 
0.0234431903809309 -1.29662230392569e-05 -2.61923960351851e-05 6.74763350616558e-06 
0.0222284849733114 -7.3982132562378e-06 -2.38725515373517e-05 6.64440585751436e-06 
0.0210295226424932 -4.05252058044425e-06 -2.04967491299612e-05 6.86779094394296e-06 
0.0198826175183058 -4.38954742776332e-07 -1.80538900167448e-05 6.71507768856827e-06 
0.0187777802348137 3.0294095267891e-06 -1.57121667143656e-05 6.82924655848183e-06 
0.017760407179594 7.79042693466181e-06 -1.3779643268208e-05 6.75156843499281e-06 
0.0168164931237698 1.29775507957675e-05 -9.72324505710276e-06 6.81464462104486e-06 
0.0160310864448547 1.77728670678334e-05 -6.59516808809713e-06 6.70990266371518e-06 
0.0153622319921851 2.18455388676375e-05 -3.58630086338962e-06 6.72534179102513e-06 
0.0147956497967243 2.59080115938559e-05 1.23643087590608e-06 6.61745298202732e-06 
0.0143287749961019 2.80773583654081e-05 4.78833180750371e-06 6.64580602460774e-06 
0.0139631796628237 3.08757917082403e-05 8.65152014739579e-06 6.70088729748386e-06 
0.0136607531458139 3.28228779835626e-05 1.20338736451231e-05 6.73708200338297e-06 
0.0134728448465466 3.44971231243107e-05 1.58318671310553e-05 6.8495714913297e-06 
0.013383929617703 3.60285812348593e-05 1.81016366695985e-05 6.91913191985805e-06 
0.0133906789124012 3.78044569515623e-05 2.05211072170641e-05 7.06894388713408e-06 
0.0134895872324705 3.90059612982441e-05 2.14625160879223e-05 7.10501262801699e-06 
0.0136569701135159 3.97899239032995e-05 2.25751191464951e-05 7.22225013305433e-06 
0.0138476146385074 4.21909207943827e-05 2.42033220274607e-05 7.37003756512422e-06 
0.0140494741499424 4.43669559899718e-05 2.5821336748777e-05 7.50643539504381e-06 
0.0142756383866072 4.67514182673767e-05 2.70544169325149e-05 7.52818868932081e-06 
0.01445640809834 4.74144799227361e-05 2.85796486423351e-05 7.90765079727862e-06 
0.0145711349323392 4.94633895868901e-05 3.06195397570264e-05 8.00006819190457e-06 
0.014673394151032 5.03762676089536e-05 2.97252645395929e-05 7.71163831814192e-06 
0.0147467749193311 5.25533614563756e-05 2.87097664113389e-05 7.68955032981467e-06 
0.0147367920726538 5.32147387275472e-05 2.92738259304315e-05 7.88005036156392e-06 
0.0146925961598754 5.49411051906645e-05 2.9716880817432e-05 7.64648120821221e-06 
0.0146687719970942 5.52446545043495e-05 2.98035265586805e-05 7.74903492128942e-06 
0.0145761035382748 5.64836736884899e-05 3.19970095006283e-05 8.08046115707839e-06 
0.0144957909360528 5.55546139366925e-05 3.25994224112947e-05 7.90965714259073e-06 
0.0144264027476311 5.66316630283836e-05 3.23993299389258e-05 7.92267383076251e-06 
0.0144108505919576 5.72059288970195e-05 3.01766958727967e-05 7.72709972807206e-06 
0.0143806142732501 5.80218256800435e-05 2.92816966975806e-05 7.53878339310177e-06 
0.0144149800762534 5.80642408749554e-05 2.64921054622391e-05 7.52179903429351e-06 
0.014417776837945 5.79063853365369e-05 2.39777145907283e-05 7.53238100514864e-06 
0.0144586246460676 5.70953270653263e-05 2.02084684133297e-05 7.33054002921563e-06 
0.0144626796245575 5.5943808547454e-05 1.61661155289039e-05 7.49140781408641e-06 
0.0144510166719556 5.40065630048048e-05 9.38268203753978e-06 7.37398113415111e-06 
0.0143869370222092 5.19207387696952e-05 1.84615942089295e-06 7.22700633559725e-06 
0.0142861353233457 4.93371917400509e-05 -5.66737980989274e-06 7.06371338310419e-06 
0.0141077134758234 4.71088169433642e-05 -1.13948926809826e-05 6.86479233991122e-06 
0.0139274224638939 4.38433489762247e-05 -1.92219358723378e-05 6.59383067613817e-06 
0.0136929005384445 4.03902377001941e-05 -2.54377409873996e-05 6.75409137329552e-06 
0.01343057397753 3.57469652954023e-05 -3.19441605824977e-05 6.53936103844899e-06 
0.0131695568561554 3.13265663862694e-05 -3.84965896955691e-05 6.56767315376783e-06 
0.0128790382295847 2.55968479905277e-05 -4.76614841318224e-05 6.55994790577097e-06 
0.0125604877248406 2.0525578293018e-05 -5.70103475183714e-05 6.23850382908131e-06 
0.0122261922806501 1.45802923725569e-05 -6.80330849718302e-05 5.79588413529564e-06 
0.0118792383000255 7.78582671046024e-06 -7.92710125097074e-05 5.53447625861736e-06 
0.0114949131384492 3.30510431467701e-07 -9.33517803787254e-05 5.47212584933732e-06 
0.0111286118626595 -8.1421803770354e-06 -0.000109893742774148 5.0704215937003e-06 
0.0106848822906613 -1.7271868273383e-05 -0.000125256803585216 5.23612561664777e-06 
0.0102590341120958 -2.53866401180858e-05 -0.000142493518069386 5.21517540619243e-06 
0.00980363227427006 -3.39035723300185e-05 -0.000161206116899848 4.91309856442967e-06 
0.00935456342995167 -4.22551165684126e-05 -0.000177529043867253 4.41928204963915e-06 
0.00888456124812365 -5.08232515130658e-05 -0.000193595857126638 4.07977404393023e-06 
0.00845395028591156 -6.12957301200368e-05 -0.00020922337716911 3.81714471586747e-06 
0.00797869637608528 -6.94966656737961e-05 -0.000223045572056435 3.22966070598341e-06 
0.00752449128776789 -7.63267744332552e-05 -0.000234559673117474 2.9145419375709e-06 
0.00707852654159069 -8.31140278023668e-05 -0.00024649070110172 2.37267772718042e-06 
0.00661387108266354 -8.82894382812083e-05 -0.000254522979957983 2.06247682399407e-06 
0.00613921321928501 -9.01736784726381e-05 -0.000258262065472081 1.51695905969973e-06 
0.00573505088686943 -9.28454392123967e-05 -0.000262532179476693 1.19907485895965e-06 
0.00529536232352257 -9.48653905652463e-05 -0.000261057197349146 1.16787612114422e-06 
0.00484353676438332 -9.42158949328586e-05 -0.000255291757639498 1.13215116925858e-06 
0.00434822309762239 -8.87644710019231e-05 -0.000244612747337669 1.39071323701501e-06 
0.00382161140441895 -8.25049646664411e-05 -0.000233694561757147 1.98390625882894e-06 
0.00323138246312737 -7.45121142244898e-05 -0.000214073035749607 2.50449465966085e-06 
0.00264805275946856 -6.39284771750681e-05 -0.000193995743757114 3.19891228173219e-06 
0.00200702482834458 -5.23761336808093e-05 -0.000168953760294244 3.78450022253674e-06 
0.00140745495446026 -4.34219182352535e-05 -0.000144310528412461 4.20192554884125e-06 
0.000854673620779067 -3.20943508995697e-05 -0.000117039278848097 4.01514444092754e-06 
0.000386754982173443 -2.31104259000858e-05 -9.35889765969478e-05 4.09555559599539e-06 
-2.44088769250084e-05 -1.34441033878829e-05 -7.22666227375157e-05 3.78456434191321e-06 
-0.000311045674607158 -5.95783831158769e-06 -5.61164997634478e-05 3.8400135053962e-06 
-0.000507693213876337 7.12683004167047e-07 -4.17903866036795e-05 3.61040179086558e-06 
-0.000632645096629858 4.38401684732526e-06 -3.236988777644e-05 3.58038596459664e-06 
-0.000729485065676272 1.03248476079898e-05 -2.41285051743034e-05 3.10103405354312e-06 
-0.000766999961342663 1.33661988002132e-05 -1.91578492376721e-05 3.0168032481015e-06 
-0.000765162461902946 1.48394910866045e-05 -1.48230410559336e-05 2.84116322291084e-06 
-0.00075917289359495 1.545915256429e-05 -1.34967667690944e-05 2.53051234722079e-06 
-0.000738191127311438 1.53241835505469e-05 -1.06787520053331e-05 2.53246639658755e-06 
-0.000697265728376806 1.5391535271192e-05 -9.84096368483733e-06 2.55808276961034e-06 
-0.000684067781548947 1.41916625580052e-05 -7.82814277044963e-06 2.239816240035e-06 
-0.000679950870107859 1.45397152664373e-05 -6.19641241428326e-06 1.97140502677939e-06 
-0.000659055076539516 1.46246247823001e-05 -5.62115837965393e-06 2.00657837012841e-06 
-0.000642711587715894 1.60576146299718e-05 -4.98852250530035e-06 1.70148780398449e-06 
-0.000644822604954243 1.53249966388103e-05 -4.07224979426246e-06 1.6497450587849e-06 
-0.000606877089012414 1.62940286827506e-05 -3.04634863823594e-06 1.57561862579314e-06 
0 0 0 0 
0 0 0 0 
0 0 0 0 
0 0 0 0 
0 0 0 0 
0 0 0 0 
0 0 0 0 
0 0 0 0 
0 0 0 0 
0 0 0 0 
0 0 0 0 
0 0 0 0 
0 0 0 0 
0 0 0 0 
99.4241104125977 0.341163128614426 0.214214995503426 0.00700107077136636 
