0.00056737445993349 0.00701357517391443 
0.00057905912399292 0.003754957113415 
0.000571705517359078 0.00170701742172241 
0.000576388323679566 -0.000228725373744965 
0.000617530487943441 -0.00231059873476624 
0.000704408914316446 -0.00593277020379901 
0.000804379698820412 -0.00998731516301632 
0.000973333662841469 -0.0150343412533402 
0.00118110422044992 -0.0199394319206476 
0.00143106025643647 -0.024508211761713 
0.00169604853726923 -0.0288632251322269 
0.00197786907665431 -0.0327062010765076 
0.00228419387713075 -0.0356727801263332 
0.00258096982724965 -0.0369414277374744 
0.00290773203596473 -0.0361147448420525 
0.00327751459553838 -0.0314672887325287 
0.00361968390643597 -0.0236665774136782 
0.00382228964008391 -0.0154982386156917 
0.00383177702315152 -0.0092640733346343 
0.00370113411918283 -0.00541534228250384 
0.00350843486376107 -0.0025102011859417 
0.00327338487841189 -0.000653707887977362 
0.00304759596474469 0.000892033509444445 
0.00287099694833159 0.00216834316961467 
0.00278886617161334 0.00297786993905902 
0.00279952515847981 0.0033285606186837 
0.00290130754001439 0.00332530937157571 
0.00308566750027239 0.00379267451353371 
0.00331022660247982 0.00366242509335279 
0.0035396886523813 0.00369427725672722 
0.00372352078557014 0.00317554920911789 
0.0038489568978548 0.00336632854305208 
0.00389383709989488 0.00291038770228624 
0.0038756774738431 0.00278927641920745 
0.00381140876561403 0.00309298606589437 
0.00372822280041873 0.00361063564196229 
0.0036620288155973 0.00396243575960398 
0.00369052751921117 0.00445890845730901 
0.00390530005097389 0.0048993662931025 
0.00437049521133304 0.00445867888629436 
0.00518910773098469 0.00333810271695256 
0.00651096552610397 0.00224708160385489 
0.00856619048863649 0.00245407852344215 
0.0116437543183565 0.0019174130866304 
0.0160115584731102 0.00205546501092613 
0.021936222910881 -0.00268606515601277 
0.029488442465663 -0.00819007121026516 
0.0383600182831287 -0.0188780445605516 
0.047960814088583 -0.0260467771440744 
0.057811826467514 -0.0286612305790186 
0.0672226473689079 -0.0250793062150478 
0.0760335326194763 -0.0310381501913071 
0.0837766453623772 -0.0355577915906906 
0.090609535574913 -0.0468811951577663 
0.0966819077730179 -0.0442746877670288 
0.101856619119644 -0.0468284785747528 
0.106194213032722 -0.0415050610899925 
0.109639681875706 -0.0442914701998234 
0.112661771476269 -0.0319709032773972 
0.11515711247921 -0.0343431048095226 
0.117310926318169 -0.0293978322297335 
0.119061753153801 -0.0375842712819576 
0.12086433917284 -0.0147146554663777 
0.122400224208832 -0.00903943926095963 
0.12356411665678 -0.00457775918766856 
0.124414473772049 -0.0128076653927565 
0.12496355175972 0.0015548107912764 
0.1253941655159 0.00464613270014524 
0.12560972571373 0.00279637333005667 
0.12586809694767 -0.00824992265552282 
0.126095831394196 -0.00685105519369245 
0.126432970166206 -0.00884170550853014 
0.126720458269119 -0.0140350237488747 
0.127139151096344 -0.00375009421259165 
0.127427980303764 -0.012695137411356 
0.127539485692978 -0.00710179097950459 
0.127690538764 -0.0189930330961943 
0.127474561333656 -0.0250725038349628 
0.127224072813988 -0.0281331446021795 
0.126848176121712 -0.0313592776656151 
0.126868441700935 -0.0145304584875703 
0.126585692167282 -0.0200727842748165 
0.126248478889465 -0.0145219741389155 
0.125747740268707 -0.0226706806570292 
0.125429809093475 -0.0121469413861632 
0.125001236796379 -0.0190666746348143 
0.12419368326664 -0.0107502928003669 
0.123568184673786 -0.00566579168662429 
0.122815288603306 -0.00846306793391705 
0.122390642762184 -0.00607173191383481 
0.12163957208395 -0.0216536950320005 
0.120928391814232 -0.026819609105587 
0.120035521686077 -0.0276691596955061 
0.119039438664913 -0.0325599238276482 
0.117931924760342 -0.00912494119256735 
0.116701476275921 -0.0201146733015776 
0.115745775401592 -0.0221997536718845 
0.114586994051933 -0.0442047566175461 
0.113679639995098 -0.046331312507391 
0.112897105515003 -0.0330120213329792 
0.112479470670223 -0.0350422598421574 
0.112214647233486 -0.0278364792466164 
0.111695043742657 -0.0267225801944733 
0.111209042370319 -0.0286037418991327 
0.110324293375015 -0.0223071314394474 
0.109216451644897 -0.0232356861233711 
0.107550084590912 -0.00954098161309958 
0.105982914566994 -0.00512279430404305 
0.104346893727779 -0.00706535158678889 
0.102419175207615 -0.0113589549437165 
0.100317224860191 -0.0232054274529219 
0.0981638953089714 -0.0161632020026445 
0.0962787941098213 -0.00888932961970568 
0.0945091396570206 -0.00868522375822067 
0.0927785113453865 -0.0113950846716762 
0.0913747474551201 -0.0149235436692834 
0.0898875296115875 -0.00790651328861713 
0.0882819667458534 -0.0070805624127388 
0.0867789089679718 0.00156095041893423 
0.0849765762686729 -0.000405612110625952 
0.0832830891013145 0.0171547327190638 
0.0812214314937592 0.0191003009676933 
0.0790707170963287 0.0296098496764898 
0.076915480196476 0.0226863417774439 
0.0748840272426605 0.0295421630144119 
0.0728322714567184 0.0312350112944841 
0.0705841928720474 0.038039542734623 
0.068130224943161 0.0516815967857838 
0.0657734796404839 0.0652143731713295 
0.0634542107582092 0.0802572295069695 
0.0608534812927246 0.0830873996019363 
0.0583280809223652 0.0974288731813431 
0.0556912273168564 0.103197246789932 
0.0532488375902176 0.116068825125694 
0.0506092794239521 0.125643953680992 
0.0481154173612595 0.143706366419792 
0.0456078015267849 0.156087100505829 
0.0431691035628319 0.175227493047714 
0.0405615344643593 0.186637207865715 
0.0379864200949669 0.211150228977203 
0.0354415960609913 0.216803848743439 
0.0328889973461628 0.231024384498596 
0.030092116445303 0.232720598578453 
0.0271544642746449 0.241735950112343 
0.0242962725460529 0.241196393966675 
0.0216600112617016 0.24269112944603 
0.0192091017961502 0.244189724326134 
0.0168543830513954 0.241282790899277 
0.0146064618602395 0.235499680042267 
0.012446672655642 0.221418142318726 
0.0104583166539669 0.207213386893272 
0.00865627732127905 0.186241179704666 
0.00707100937142968 0.165232330560684 
0.00569421006366611 0.142032369971275 
0.00450411112979054 0.119516968727112 
0.00348534272052348 0.0957980528473854 
0.00265237456187606 0.0745762512087822 
0.00199154135771096 0.0544663667678833 
0.0014961042907089 0.0383922904729843 
0.00112485559657216 0.0243597589433193 
0.000836992112454027 0.0154219754040241 
0.000628171546850353 0.00946343503892422 
0.000473408581456169 0.00607879599556327 
0.000373644405044615 0.0029699660371989 
0.000286183261778206 0.0011748488759622 
0.00022852914116811 -0.000126644299598411 
0.000177728186827153 -0.000252470228588209 
0.000145043304655701 -9.41367106861435e-05 
0.00011562230065465 -0.000119640957564116 
0.000100066572485957 -0.00046359992120415 
8.29443233669735e-05 -0.000691424356773496 
7.56847293814644e-05 -0.00036897516110912 
6.7641340137925e-05 -8.89679431566037e-05 
7.23513367120177e-05 -0.000298137689242139 
6.4501968154218e-05 -0.000693383917678148 
5.48202588106506e-05 -0.000665461528114974 
4.089067078894e-05 -0.000559047155547887 
2.70703621936264e-05 -0.000130388143588789 
2.27217606152408e-05 -0.000191513696336187 
2.13218318094732e-05 -0.000127307474031113 
2.29538163694087e-05 -0.000263484165770933 
1.67010166478576e-05 5.3540563385468e-05 
1.02357116702478e-05 0.000290335679892451 
1.26552522488055e-05 0.00035551268956624 
1.47752252814826e-05 2.05118576559471e-05 
