{
  "ambient_brightness_scale": 0.5,
  "ambient_saturation_scale": 0.5,
  "ambient_shadow_brightness_scale": 3,
  "ambient_shadow_saturation_scale": 2,
  "bg_color_temp": 5500,
  "bg_grayscale": false,
  "cameras": [
    {
      "ext_rot": [
        0,
        0,
        0
      ],
      "eye": [
        0,
        0,
        10000
      ],
      "fov": 45,
      "look_at": [
        0,
        0,
        0
      ],
      "name": "Primary",
      "ortho_scale": 1,
      "perspective": false,
      "up": [
        0,
        1,
        0
      ]
    },
    {
      "ext_rot": [
        0,
        0,
        0
      ],
      "eye": [
        0,
        0,
        10000
      ],
      "fov": 45,
      "look_at": [
        0,
        0,
        0
      ],
      "name": "Secondary",
      "ortho_scale": 1,
      "perspective": true,
      "up": [
        0,
        1,
        0
      ]
    }
  ],
  "eye_alpha_threshold": 0.11999999731779099,
  "eyeball_radius_scale": 2.5,
  "ignore_pupil_normal": true,
  "is_huawei_depth": false,
  "light_filenames": [
    ".\/lights\/light-stainedglass.json"
  ],
  "mtl_filenames": [
    ".\/materials\/face-type-b.dat"
  ],
  "n_max_faces": -1,
  "overwrite_bg_normal": true,
  "overwrite_eyeball_normal": true,
  "post_bg_blur_width": 0.090000003576278687,
  "post_bg_color": [
    0.76960784196853638,
    0.76960015296936035,
    0.76960015296936035
  ],
  "post_bg_color2": [
    0.72058820724487305,
    0.72058099508285522,
    0.72058099508285522
  ],
  "post_bg_inpaint": true,
  "post_bg_mode": "ORIGINAL",
  "post_bg_org_alpha": 0.65000003576278687,
  "post_bg_projshadow_blend_mode": "NORMAL",
  "post_bg_projshadow_enable_alpha_channel": false,
  "post_bg_projshadow_indep_blend": true,
  "post_bg_projshadow_intensity": 2,
  "post_bg_projshadow_onoff": true,
  "post_bg_projshadow_scale": [
    0.72000002861022949,
    0.98000001907348633
  ],
  "post_bg_projshadow_scale_by_face": false,
  "post_bg_s_tone_scale": 4.2000002861022949,
  "post_bg_tex_alpha": 1.4200000762939453,
  "post_bg_tex_blend_mode": "OVERLAY",
  "post_bg_tex_scale": 0.59000003337860107,
  "post_bg_tex_trans": [
    0,
    0.040000002831220627
  ],
  "post_bg_texname": "",
  "post_bg_z_offset": 2000,
  "post_dropshadow_blur_width": 0,
  "post_dropshadow_color": [
    0.088235318660736084,
    0.08823443204164505,
    0.08823443204164505
  ],
  "post_dropshadow_intensity": 2.0299999713897705,
  "post_exposure": 0.80000001192092896,
  "post_exposure_offset": -0.20000000298023224,
  "post_fg_tex_alpha": 0.40000000596046448,
  "post_fg_tex_blend_mode": "NORMAL",
  "post_fg_tex_scale": 0.96000003814697266,
  "post_fg_tex_trans": [
    0,
    0
  ],
  "post_fg_texname": "",
  "post_grayscale": false,
  "post_tonemap_mode": "LINEAR",
  "post_use_dropshadow": false,
  "projshadow_blend_mode": "OVERLAY",
  "projshadow_buffer_range": 0.25,
  "projshadow_color": [
    0.80000001192092896,
    0.80000001192092896,
    0.80000001192092896
  ],
  "projshadow_enable_alpha_channel": true,
  "projshadow_ext_scale": 1,
  "projshadow_ext_trans_mode": true,
  "projshadow_fit_to_image": false,
  "projshadow_ignore_ext_move": false,
  "projshadow_intensity": 1.7400001287460327,
  "projshadow_mono_inversion": false,
  "projshadow_repeat": true,
  "projshadow_repeat_flip": true,
  "projshadow_scale": [
    2.2900002002716064,
    2.8100001811981201
  ],
  "projshadow_scale_by_face": false,
  "projshadow_shadow_mode": false,
  "projshadow_texname": "projshadow\/stainedglass_bg_rgba.png",
  "projshadow_trans": [
    -3.1000001430511475,
    3.690000057220459,
    0
  ],
  "projshadow_two_sided": true,
  "projshadow_yaw_pitch_roll": [
    0,
    0,
    0
  ],
  "pupil_radius_scale": 2.5999999046325684,
  "relative_light": true,
  "rigid_eyeball_normal": true,
  "screen_width": 1024,
  "shading_grayscale": false,
  "shading_region_thld": 0.004999999888241291,
  "softshadow_blur_width": 0.11000000685453415,
  "softshadow_buffer_range": 0.5,
  "softshadow_intensity": 0.40000000596046448,
  "softshadow_ray_offset": 0.10000000149011612,
  "ssss_quality": 0,
  "ssss_width": 0.059999998658895493,
  "use_ambient": true,
  "use_bg_color_temp": false,
  "use_bg_s_tone": false,
  "use_foreground": false,
  "use_projshadow": true,
  "use_softshadow": true,
  "use_ssss": false
}
