0 0 0 0 
0 0 0 0 
0 0 0 0 
0 0 0 0 
0 0 0 0 
0 0 0 0 
0 0 0 0 
0 0 0 0 
0 0 0 0 
0 0 0 0 
0.000421547534642741 -1.15537971984853e-12 -4.59183168918798e-12 -1.91748613515008e-11 
0.000468075013486668 1.11289493176514e-08 3.19628377098979e-08 1.16609072620122e-07 
0.00060381181538105 -4.38485159293123e-08 -6.37838510897382e-08 -2.12272922794909e-07 
0.000837526575196534 1.30129066633344e-07 9.19312839187114e-08 2.20391370930884e-07 
0.00130869925487787 -3.20151002597413e-07 -6.01695049340378e-08 -3.36708225745497e-08 
0.00189849466551095 3.36629426556101e-07 -2.57193129016287e-08 -1.19001931864204e-07 
0.00251641450449824 -1.16735726862771e-07 1.35841219162103e-07 9.59592867388892e-08 
0.00307726161554456 3.71445381119884e-08 -1.6918447443004e-07 -7.02793201412533e-09 
0.00349530740641057 -1.10219291471481e-08 2.53881722755978e-07 -1.1574545055737e-07 
0.00363619695417583 4.23700230456348e-09 -2.03447100943777e-07 1.1873446936761e-07 
0.00359564530663192 -7.9092599136743e-10 6.58848193779704e-08 -4.4221852846249e-08 
0.00346595630981028 1.45727069300605e-10 -7.40276107080717e-09 5.28031041113763e-09 
0.00331359379924834 -7.59098617297838e-11 1.19323606551092e-10 -1.94420368693216e-10 
0.00320244557224214 -3.9845678839745e-11 4.24978767454842e-11 -9.33913849032741e-11 
0.00316432421095669 -2.14876783033446e-10 1.20019841287622e-10 6.87920970188216e-11 
0.00321139604784548 1.1840524394291e-10 1.73528968971937e-10 2.90070415603916e-11 
0.00339035503566265 -6.47267933695517e-11 1.30407587506376e-10 -3.32729295504652e-11 
0.00365962903015316 -3.30342767029812e-11 3.45588800632068e-11 -6.08993966366711e-11 
0.0039673512801528 1.45288399366894e-11 -9.90535639622259e-11 4.72840412657494e-11 
0.00429645972326398 -9.923003391199e-11 -1.54922227824095e-10 1.43165923560673e-10 
0.00460042199119925 2.32918850873176e-10 7.2001996379023e-12 1.19952922594813e-10 
0.00482107512652874 1.1926209152191e-11 1.90188170767769e-10 -2.04993647057172e-10 
0.00493805343285203 -5.25573230769627e-11 -1.76802836260315e-10 2.24403533949369e-11 
0.00497496919706464 2.99043706464275e-10 1.10656137031206e-10 1.05348368917291e-10 
0.0049065425992012 -3.36203204165386e-10 4.21478490997274e-10 4.7697040761463e-11 
0.00478725461289287 1.98242436355578e-10 1.95513868983532e-10 -1.2789780345912e-10 
0.00469827838242054 -4.92820680098038e-11 -9.89697490627606e-11 -5.49010802097794e-11 
0.00473269540816545 2.96652591380564e-10 1.58800039090634e-11 1.16899254165581e-10 
0.00496111204847693 -3.00213326420717e-10 -1.5219168980618e-10 1.2745650368462e-10 
0.00553425308316946 -1.68621314827755e-11 3.45576123272906e-10 -7.38055935811666e-11 
0.00656435452401638 -5.63340651904554e-10 5.54853885059714e-10 9.45288222697904e-11 
0.00823804922401905 7.77184289146859e-11 -4.90842533285019e-10 1.22421059400857e-10 
0.0107383150607347 -8.49232698052482e-11 9.61427382151214e-10 -7.5431015600369e-11 
0.0143419653177261 -1.0367319225324e-09 7.94424526162629e-10 3.64880105296894e-11 
0.0193964540958405 -8.51649195610094e-10 2.63693733515424e-09 3.74494185662044e-10 
0.0260946471244097 -4.20863760508539e-10 6.85507761666315e-10 -6.07989353307303e-11 
0.0344552546739578 1.17483578421229e-09 -2.38816055819768e-09 -2.22740836192115e-11 
0.0444310829043388 2.780217445153e-10 3.2015428086396e-09 -9.24809784308422e-10 
0.0554935187101364 2.34452324221479e-09 1.43367795413241e-09 -4.44312231451249e-09 
0.0669755265116692 -4.18513002031773e-09 3.39459349518734e-09 -3.01741986952209e-09 
0.0786617398262024 -4.382271434622e-09 8.25156476480515e-09 -4.95800067668029e-10 
0.0896492078900337 -3.16613379958142e-09 1.2317234343584e-08 -2.75972977803463e-09 
0.0995818078517914 -1.76468284429632e-09 3.5664060593632e-10 -3.80212056283469e-10 
0.10875952988863 -5.32419930365791e-09 3.62437235779112e-09 1.36788391724707e-09 
0.11706006526947 -9.37812227874701e-09 -8.93470991636391e-11 2.4534261289233e-09 
0.123839467763901 -6.7270522485785e-09 -1.18183383079895e-08 7.26637905401617e-09 
0.129943460226059 -1.95531946189931e-09 4.35382530028505e-09 -5.92697224632843e-09 
0.135055169463158 -1.95272305270056e-11 -1.94420524124439e-09 4.45406644900004e-09 
0.139417752623558 4.97749219618981e-09 6.28170138128326e-09 2.86614310063271e-09 
0.14283549785614 -1.27997923371481e-09 9.24519838463311e-09 8.15023959432892e-09 
0.145891949534416 -3.65770436161483e-09 -4.35258806774641e-09 6.68791333424679e-09 
0.1485635638237 -4.04598710090909e-09 -2.05490957583265e-09 4.151391674867e-09 
0.151271864771843 5.59676482936311e-09 6.0222982156688e-09 2.44539943849986e-09 
0.152809366583824 6.97710866859325e-09 -5.61770141516149e-09 -8.70217764514791e-09 
0.154128357768059 1.89887305879211e-09 -4.78139172699343e-09 -7.53219531191007e-09 
0.155416443943977 7.88447862554165e-10 3.69839336933353e-09 6.82703182874889e-09 
0.155612498521805 5.53108758793996e-09 7.71863106763249e-09 7.13559433762612e-09 
0.155315563082695 1.78842085585273e-09 -7.71933272858405e-09 6.3146829987204e-09 
0.154844507575035 9.63519486418818e-10 -4.10384570770361e-09 2.53093035418317e-09 
0.153975173830986 8.66960281342699e-09 1.57477600404299e-10 -2.6047806134244e-09 
0.152320206165314 5.31380361934453e-09 -5.57701573811187e-09 -3.94404775505564e-09 
0.151207566261292 7.33197669244845e-10 -8.08116595862884e-09 5.49262857418853e-09 
0.150120332837105 1.12141607111482e-09 -1.55881707541994e-09 8.30422131059549e-09 
0.149429589509964 2.16826734344977e-09 4.68936622866067e-09 7.1407151303049e-09 
0.148793563246727 -8.03558997120035e-09 -4.60369076193956e-09 6.27173646350343e-09 
0.14843775331974 6.06809436032307e-10 1.97265315193818e-09 -7.25490556519048e-09 
0.14825813472271 2.49991938261473e-09 -3.02824898490428e-09 -9.05483299451504e-10 
0.147025436162949 -4.19338697099647e-09 2.60868837642647e-09 7.98984967076422e-09 
0.146317288279533 -3.88560461583864e-10 6.59035381822548e-10 -5.13687670178342e-09 
0.145754665136337 6.92919011058279e-09 -6.90015911075648e-09 -8.46290038047925e-10 
0.144138902425766 1.60207302979387e-09 6.84052814392544e-09 -3.68604452516408e-10 
0.142213061451912 8.3176523446582e-09 -4.25446389229478e-09 5.04589836580749e-09 
0.141214549541473 4.96034280317303e-09 2.96968249990925e-09 -3.33138361341412e-09 
0.139654234051704 -8.6944135224698e-10 6.5811078808764e-10 -7.88148213359818e-09 
0.137529879808426 5.41234612683184e-09 6.43380992926268e-09 -9.55330392571341e-09 
0.136458709836006 -3.60301122270812e-09 -5.63855717672368e-09 -1.7833339249762e-09 
0.135086506605148 -5.03890751346603e-09 -4.48034720434975e-09 -3.78088760299988e-09 
0.132700473070145 -1.40380973512322e-09 -1.09372724210743e-08 1.1246972242418e-09 
0.129768952727318 2.75726419474154e-09 6.38816444187285e-10 -4.20080503715781e-09 
0.127133160829544 -1.22766650179074e-08 -8.49092884891434e-09 1.03517172611589e-09 
0.124660700559616 -6.69287070209634e-09 1.4042056406538e-09 5.79622261298596e-09 
0.12161985039711 6.58501697614611e-09 -3.6017120397247e-09 -2.00776439918116e-09 
0.118843860924244 2.7880959763138e-09 3.93390298114582e-09 -7.04109348603765e-09 
0.116225332021713 -2.26331020591886e-09 -2.47010567555606e-09 -1.34500366399948e-09 
0.112980887293816 6.07418393361314e-10 1.308792518806e-10 -2.26428475968987e-09 
0.109385542571545 -3.03426728187617e-09 1.20395906577642e-08 9.70127422839084e-10 
0.106607384979725 -2.88213497512402e-09 7.35945659968706e-09 -6.88390855430043e-09 
0.10396858304739 -4.76694239637254e-09 8.01791610882674e-09 -5.82729331455312e-09 
0.100822113454342 -5.84105874779084e-09 8.6758003559062e-11 6.4179456193969e-10 
0.0981374159455299 -7.04358527059412e-09 -8.32475244294528e-09 -5.2811066630909e-10 
0.095513328909874 4.28575530619923e-09 4.43202008426624e-09 -7.3613470874534e-09 
0.0922358632087708 1.05141806372444e-09 2.64187627330159e-09 -2.39404385204978e-09 
0.0886236727237701 -6.39725650231071e-09 -2.21319651494412e-09 3.88506915527387e-09 
0.085398443043232 6.36389474450993e-09 5.02886221553922e-09 -2.67791588903776e-09 
0.0819247514009476 -2.67712185753055e-09 3.31817529009015e-09 -4.56855620001306e-09 
0.0772949308156967 -1.28610166960641e-09 6.92790935730159e-09 -5.60321700149302e-09 
0.0724414363503456 4.45013442762487e-10 -4.11023393098731e-09 -5.91583060316481e-10 
0.0677517503499985 -2.08867878548347e-09 -5.50061551862768e-09 4.18518864009343e-09 
0.0629885941743851 1.8034237436737e-09 5.42825284721715e-10 -4.57042981238942e-09 
0.0578273385763168 5.83068437975953e-09 -1.01771013838459e-09 -2.65771382679247e-09 
0.0531248562037945 -3.88403309514729e-09 4.90480600578991e-10 -1.11871167884914e-09 
0.0487492419779301 3.00373642625473e-10 -1.56399637685212e-09 -1.00790231716275e-09 
0.0445330701768398 3.57937057771096e-09 4.60210175523557e-10 -3.27633276064887e-09 
0.0403856374323368 -2.94171931258802e-09 1.56867452361098e-09 2.51587839450451e-09 
0.0365980342030525 -5.07503428170963e-10 7.8773057521353e-11 5.7975230172147e-10 
0.0333699844777584 -1.23378607330693e-09 -7.84418474619741e-10 2.45319120573129e-09 
0.0303553473204374 8.40768288323801e-10 -1.33692279469244e-09 2.95334534605729e-10 
0.0276729315519333 2.37162334215668e-09 -3.48149353790461e-09 1.08260386766368e-10 
0.0253157690167427 -2.82763368275596e-10 1.16237471037284e-10 9.77580794092603e-10 
0.0233666840940714 1.82187498420916e-09 -1.41742373394038e-09 1.54875212654559e-09 
0.0215114876627922 8.29686042091993e-10 4.53273779621455e-10 -1.31157107396973e-09 
0.020007498562336 -1.22752941145166e-09 -5.76177716649084e-10 1.00754704579487e-09 
0.0186578128486872 -1.91041085728649e-10 6.53205878275998e-10 3.73799546871112e-10 
0.0173775386065245 3.90806470518257e-10 -1.58116697512867e-09 1.28585753156329e-10 
0.0163516402244568 -3.36885991325531e-10 -1.76071234415237e-12 -2.79468254094084e-10 
0.0154664199799299 1.32507532724091e-10 -5.66274083180218e-10 -9.07508304615057e-11 
0.0145770581439137 1.23898755838292e-11 -1.12177256372803e-09 4.23709721822374e-12 
0.0136831216514111 6.82484138647688e-11 1.39762001971633e-09 -6.72764122189307e-10 
0.0129325212910771 -4.26501958750158e-11 1.48887249751262e-10 4.49647041822487e-10 
0.0121949827298522 -2.90457657925458e-10 9.48507314357805e-11 1.20107770951172e-10 
0.0114956647157669 1.40956718519547e-10 -6.28472773822608e-10 -3.44768075200008e-10 
0.010831356048584 3.09996694980441e-10 1.73010189508105e-10 -5.2840060105197e-10 
0.0103124668821692 -3.95318083823426e-10 4.29073970797944e-10 3.0262133077219e-11 
0.00974671076983213 4.60021326587068e-10 9.96165649969072e-11 -6.83238743359738e-10 
0.0092641469091177 -8.54152859552926e-10 1.3512987395714e-09 -1.63450364354389e-10 
0.0087928231805563 -9.23492046722707e-11 8.06069655467923e-10 -1.37133637778675e-10 
0.00837141089141369 -5.0999510170513e-10 -6.25426210820734e-10 8.13267286847719e-10 
0.00799584109336138 6.09482908586756e-10 -7.77978237387345e-10 1.71618080857527e-10 
0.00777204381301999 4.13610840022116e-10 -1.3997254744158e-10 3.42794237440103e-10 
0.00755117041990161 -2.61484028873937e-10 -5.10809949894053e-10 5.02153818526807e-10 
0.00742234522476792 7.94829146943954e-10 -4.48006604036877e-10 -4.03374382507149e-11 
0.00733678787946701 -2.62781241211485e-10 2.01415759071288e-10 -1.94144256226991e-10 
0.00724628521129489 4.66949701127817e-10 -4.027209676849e-10 -9.93367818558077e-11 
0.00713832397013903 2.79284900761567e-10 1.47100887026852e-10 -1.1457368040424e-11 
0.00705722020938993 -3.08556930006532e-10 -2.63984695214603e-10 1.58083157675293e-10 
0.00697122793644667 -2.78934791930752e-10 7.41074757115712e-10 -5.97114802047827e-10 
0.00689435936510563 -3.59370616598298e-10 3.11887571324831e-10 -1.07862350995358e-10 
0.00679852860048413 -9.06400926536932e-11 1.94617183479906e-10 -4.67380134594464e-10 
0.00669770920649171 -2.83342155293909e-10 2.44090803125374e-10 -2.10812520218262e-10 
0.00648433715105057 -4.15479928239648e-10 -3.53169188338498e-10 -3.69011571299538e-10 
0.00618956983089447 -1.60310792418628e-10 -5.23419751985443e-10 7.09060796189043e-11 
0.00577667448669672 -3.25627996788924e-11 2.37936531588545e-10 -1.76447190192164e-10 
0.00527038890868425 1.03558280006855e-10 1.33984059957903e-10 -2.43335546157297e-10 
0.00463979970663786 -1.95280111525697e-10 1.03691819020035e-10 -4.1791503591071e-10 
0.00398392556235194 -7.61789242798017e-11 -4.64525050369868e-11 1.57730720845572e-11 
0.00334873865358531 5.77332869011737e-11 -2.34517516517485e-10 2.77074890808748e-10 
0.0027405652217567 1.71808192672707e-10 1.37325970039903e-10 -2.27364498756044e-11 
0.00218756590038538 1.62325170666167e-11 -2.27655290452322e-11 2.62812965834414e-11 
0.00171839434187859 7.87438031446541e-11 -1.10026439348321e-10 2.01767560992216e-11 
0.00134592782706022 -1.69582681230906e-11 -3.5187152670757e-12 -1.78257772041543e-13 
0.00102944998070598 6.17521520029918e-11 -4.29177787059087e-12 1.21618262335921e-11 
0.000783113006036729 3.7804866875879e-11 1.17845169386732e-11 -2.94951632562324e-11 
0.000584706896916032 1.70422877199261e-11 1.51975983880837e-11 -1.9708221599829e-12 
0.000443722557974979 -3.12524554846316e-11 3.5624263955425e-11 -3.42354720961335e-11 
0.000325719505781308 -6.65241169442443e-12 6.14320573577576e-12 3.83306624288093e-12 
0.0002467060694471 -7.91669160782327e-12 -2.13746052107888e-11 5.80944190323174e-12 
0.000184331438504159 -2.56764032778578e-12 1.38897738796717e-11 -1.51644148627117e-11 
0.000139604846481234 6.07417599291643e-13 5.63835957090308e-12 -1.8697836248055e-12 
8.64564499352127e-05 -3.61233531151819e-13 -6.52412639971095e-13 -1.50579256095323e-12 
4.44875222456176e-05 -2.49178737539435e-12 -1.63320561501895e-12 3.61456697905993e-12 
-4.96724896947853e-06 1.5116170305491e-14 1.29355456467833e-13 9.20443259913757e-14 
0 0 0 0 
0 0 0 0 
0 0 0 0 
0 0 0 0 
0 0 0 0 
0 0 0 0 
0 0 0 0 
0 0 0 0 
0 0 0 0 
0 0 0 0 
0 0 0 0 
0 0 0 0 
0 0 0 0 
0 0 0 0 
99.9986724853516 5.01338290632702e-05 4.20830874645617e-05 4.03492704208475e-05 
