0 0 0 0 
0 0 0 0 
0 0 0 0 
0 0 0 0 
0 0 0 0 
0 0 0 0 
0 0 0 0 
0 0 0 0 
0 0 0 0 
0 0 0 0 
0.000432068394729868 -1.25809163434298e-11 1.3741917326282e-11 1.38344552827463e-11 
0.000485658412799239 1.23375002658577e-07 -1.16240890690733e-07 -1.01185982259722e-07 
0.000623327505309135 -2.57841350048693e-07 1.70791594200637e-07 1.14783063054347e-07 
0.000859260093420744 2.77431610129497e-07 -6.084102466275e-08 2.94868875982957e-08 
0.00133156543597579 -2.202428390774e-07 -1.00583946505139e-07 -1.31548205217769e-07 
0.00191805744543672 1.3638472751154e-07 2.19309853832783e-07 1.09362119360412e-07 
0.00253251357935369 -7.22756894333543e-08 -2.18550496811076e-07 1.34585089739403e-08 
0.00308997929096222 2.9468578688352e-08 1.6523254942058e-07 -1.60251602210337e-07 
0.00350865162909031 -1.42827092375342e-08 -1.23808547414228e-07 2.12223596918193e-07 
0.00365062640048563 4.20514600918409e-09 5.1776126497316e-08 -1.37315595338805e-07 
0.00361179397441447 -1.19874576931522e-09 -2.20399467565358e-08 1.05657164795048e-07 
0.00348258065059781 6.1525351480185e-10 1.16144907025273e-08 -1.00611394771022e-07 
0.00333057437092066 1.6849636269578e-11 -6.36506136686421e-09 8.387182504066e-08 
0.00321486406028271 9.29543247929487e-11 2.81632006604582e-09 -4.96610148559284e-08 
0.00317189143970609 -7.02948810271664e-11 -8.65977234365545e-10 1.60661421944042e-08 
0.00321908504702151 1.83006207410408e-10 1.72879224824563e-10 -1.28517219089019e-09 
0.00340185104869306 5.60362693746708e-11 -2.21579976589226e-11 2.31151195406731e-10 
0.00367643218487501 -1.22422003090428e-10 -3.760995421348e-12 -4.40848468841182e-11 
0.00399317918345332 -6.91185997325761e-11 1.3498849260607e-10 2.00687157864143e-11 
0.00432997988536954 -1.3616160976504e-10 -2.0799023614515e-10 -6.34253552456165e-11 
0.00463958224281669 9.57792387068501e-11 -4.13866198256674e-11 -1.36343436540898e-10 
0.00486266473308206 -7.19988027531038e-11 -3.44029443821725e-10 -2.20768889280798e-10 
0.00497806118801236 2.29785745986533e-10 -7.25417018121455e-11 -3.04334696332731e-10 
0.00500975362956524 5.99736760253933e-10 2.97601075727183e-11 -1.39096914542058e-10 
0.00493708858266473 1.07251922620843e-10 2.47393966423815e-10 -1.31453126162029e-10 
0.00481277843937278 5.58402879491382e-10 1.44646711275342e-10 -2.17904444488326e-10 
0.00472282432019711 -2.0764465147316e-10 -1.80108549602265e-11 4.69491633070529e-11 
0.00475682271644473 4.13846096281034e-10 2.69247540929385e-10 1.86447149386204e-10 
0.00498991925269365 1.34365907289435e-10 1.11869055685609e-10 -3.45362245746106e-11 
0.00556864682585001 -1.24934979028879e-10 -2.590015424353e-10 1.69881941847194e-10 
0.0066055185161531 5.79225389873983e-10 2.5724436469865e-10 5.72645880367317e-12 
0.00828308612108231 4.16516598988892e-10 1.63117453572115e-11 8.5432511759409e-12 
0.0107878362759948 1.45359571601666e-10 7.14300008031188e-11 -4.18507339894347e-10 
0.0143934730440378 -1.75401537738651e-09 -3.44879763636285e-10 -8.10529351968903e-11 
0.0194509793072939 -1.62423130500855e-09 -1.20513066192984e-09 1.77927270139655e-10 
0.0261530727148056 3.91078780470622e-10 -1.41322942237565e-09 -1.41787553920025e-10 
0.0345140434801579 2.29215024738494e-09 -1.53529189361734e-09 -7.50120021653089e-10 
0.0444916784763336 3.44308448418928e-09 8.34058308529784e-11 -1.02618069597327e-09 
0.05555659532547 2.60928412210149e-09 -6.95913049408858e-10 -7.91478171890958e-09 
0.0670440346002579 -8.26474833015567e-10 -4.89885319809868e-11 3.10501224731752e-09 
0.078733891248703 -2.81412626534916e-09 -2.30876917584055e-09 3.30401461745566e-09 
0.0897249802947044 -6.66280319805423e-09 3.29866883808094e-10 -5.39473399285839e-09 
0.0996530577540398 4.23724078046916e-09 8.07668376623383e-10 7.44070083324999e-10 
0.108798265457153 6.7436793926845e-09 -4.87940798876707e-09 3.10232706191016e-09 
0.117038495838642 -5.06615327466875e-09 -3.14775405740875e-09 1.26396770827597e-09 
0.123749047517776 -7.83851739072361e-09 -2.49154696874143e-10 7.56179296956816e-09 
0.129774913191795 -7.10507874757127e-09 4.77146433475184e-10 -2.10252104615449e-09 
0.134797275066376 1.56870978429424e-08 4.43427516927386e-09 -1.15816796153467e-08 
0.139095395803452 -1.83902582051587e-08 -1.40541480675438e-08 -5.92584648018146e-09 
0.14248563349247 -1.10668940678238e-08 7.82273890109764e-09 8.58292370509162e-09 
0.145540609955788 5.89783333282412e-09 -1.86239401678279e-09 1.04383506283057e-08 
0.148239597678185 1.03669366424697e-08 7.07169656166684e-10 -1.54120483042419e-09 
0.151015192270279 6.06344041642615e-09 1.23723464806602e-09 -6.05822680910251e-09 
0.152650400996208 -5.50169354518459e-10 -5.714936524015e-09 -7.12453074314112e-09 
0.154080957174301 -5.14056708311728e-09 3.19869308817999e-09 -1.08343245486253e-08 
0.155487477779388 -6.54714449321858e-10 2.99093527722505e-09 -1.37396083399466e-09 
0.155820339918137 -6.30082208630256e-09 4.13796386045107e-10 1.36737305922452e-08 
0.155682265758514 7.57179563493082e-09 3.07835690271929e-09 5.54836754318444e-09 
0.155371934175491 -2.64734345556406e-09 4.17125489704517e-09 4.20558432523421e-09 
0.154632225632668 -6.80081146953171e-09 1.53084142584525e-10 6.46027453754527e-09 
0.153041273355484 -9.7313301861135e-10 1.04955910629201e-09 -8.41161895692721e-09 
0.151935741305351 -1.39962752498946e-09 1.9944877693856e-10 -8.90334306280494e-10 
0.150797873735428 -3.54751028552869e-09 -3.99309207921306e-09 -2.83799317379874e-09 
0.150016233325005 -1.00984909323643e-08 -5.87939563700957e-09 -8.02289079615548e-09 
0.149277552962303 2.69103095362766e-09 3.02443958766219e-09 2.33280239569922e-09 
0.148842737078667 -1.09177271667704e-08 4.66706007173912e-09 -3.94741217490946e-09 
0.148611411452293 2.18488871439604e-08 9.22791176805049e-09 -5.60409629812852e-09 
0.147324934601784 -2.17653894907244e-09 1.71821584737941e-10 -3.88108711835145e-10 
0.146532714366913 1.29249215774507e-08 -6.254832762842e-10 -1.55761914477637e-09 
0.145877301692963 1.71724401365481e-09 5.76402969798551e-09 5.09387065861233e-09 
0.144198760390282 5.5178341895612e-09 3.92278121097434e-09 6.79251765944855e-09 
0.142233267426491 -1.47731615829372e-09 -1.14926035355012e-09 7.90793475147211e-09 
0.141212955117226 -7.05709546355848e-10 -4.61710847332597e-09 3.01638980459984e-09 
0.139623910188675 7.82482434402709e-09 -6.53575416009744e-09 -1.66576064053459e-09 
0.137442052364349 -3.78119979771441e-09 1.13648102040287e-09 6.13122530523924e-09 
0.136285081505775 6.58477161685767e-10 -2.3547126470902e-09 2.88387735913886e-09 
0.134805887937546 4.35315694602423e-09 -6.07525851847868e-09 -4.35970259893281e-10 
0.132339492440224 -4.63009675044646e-09 2.56652543662028e-09 -5.53858514606986e-09 
0.129375323653221 1.02842898641597e-08 7.81691067430756e-09 1.73722813912036e-09 
0.126733094453812 6.47604769810073e-09 8.06891831128809e-10 -7.62157714717659e-09 
0.124258920550346 -1.0687164042622e-08 9.14347902947199e-11 5.61822854905358e-09 
0.121215000748634 3.68105324000112e-09 -2.45054421199598e-09 -4.38653957601787e-09 
0.118450947105885 -3.81775322466638e-09 6.89485135652035e-09 2.49772469373966e-09 
0.115877240896225 -2.25422014388243e-09 -6.79148826066012e-09 -6.45727560311116e-09 
0.112709060311317 -1.10513616036201e-08 -2.10063411110184e-09 -7.65835894700473e-10 
0.109173655509949 -4.20149559587912e-09 -4.28768442972682e-09 4.25244417456838e-09 
0.106424130499363 9.29356236412104e-09 -3.81482667677346e-09 -4.00901978281354e-09 
0.103781312704086 -1.00902775024281e-09 -7.79576125875536e-10 2.50079934538405e-09 
0.100628197193146 -4.61381333138888e-09 1.27410348937929e-09 4.08111855421112e-09 
0.0979712605476379 4.03738864562797e-09 6.26645901835587e-10 -3.09373970885929e-10 
0.095404215157032 1.25870904810199e-08 2.89600315950267e-10 -3.01248470613302e-09 
0.0921767055988312 -3.57088514313375e-09 1.00293225113735e-10 6.89656287633511e-09 
0.0885647609829903 9.18022935447738e-10 3.70788066916816e-09 -4.51194726025506e-09 
0.0852943658828735 -2.05785499751698e-09 -3.88980936349981e-09 9.27103116499239e-10 
0.081744946539402 -4.90287233034792e-09 -1.12100406735038e-09 -1.64872593355625e-09 
0.0770656540989876 2.4323805192239e-09 4.08053013600806e-09 5.55596013640525e-09 
0.0722277387976646 4.63454030708021e-09 2.85413984113525e-11 -6.50571641003239e-09 
0.067598856985569 -9.33757426935244e-09 -2.3251685021819e-09 5.62337909570942e-09 
0.0628934279084206 2.05924344243158e-09 -2.02655159320386e-09 -4.33875513294879e-09 
0.0577546209096909 -2.39160646842151e-09 8.16437972783746e-10 -3.56060980699624e-09 
0.0530239716172218 -1.08658770869852e-09 -2.32612734629711e-10 -2.08045758398612e-09 
0.0485913679003716 3.47159101465877e-09 1.12250386763435e-09 4.28933866203351e-09 
0.0443446040153503 1.2291001549869e-09 -5.57399404410575e-10 -3.35593464129147e-09 
0.0402193330228329 2.58086285676029e-09 4.80098349964209e-10 9.00954533200604e-10 
0.0364898890256882 -7.94265708758957e-10 -1.82050097219388e-09 -9.4394370098172e-10 
0.0333304069936275 -3.98786392796779e-10 -1.20130327907475e-09 -5.0549564534208e-10 
0.0303447712212801 4.41571668119423e-09 -9.25298379583772e-11 -2.12245998554295e-09 
0.0276342835277319 5.1849857740649e-10 3.1936303601654e-10 9.3346685936524e-10 
0.025209853425622 -8.47000747317139e-10 1.67453806376727e-09 1.48937945310124e-10 
0.0232121124863625 5.29641941415804e-10 3.68651942306286e-10 8.52949655349988e-10 
0.0213504116982222 -2.06327155360952e-09 4.00239424935833e-11 1.16545284534197e-09 
0.0198959633708 1.28134880483799e-09 3.43668371538541e-10 -5.94068821913041e-11 
0.0186114087700844 8.21796908301309e-10 1.22558319048949e-09 1.6068850694495e-09 
0.0173758585005999 -1.33497690679718e-09 -3.64287516818607e-10 -6.02525029869128e-10 
0.0163429081439972 1.43279305087063e-10 9.7299925061467e-11 -2.42426717589339e-10 
0.01540866214782 1.35899111408655e-10 -4.90018803311898e-10 -1.16982160069945e-10 
0.0144613301381469 -2.22601673205425e-10 2.03983596507029e-12 -6.44515621428532e-11 
0.0135451564565301 -2.435441848192e-10 4.93739271689719e-10 1.31390107127594e-10 
0.0128219621255994 3.97549826391952e-10 -3.17056964016516e-10 3.61389279612823e-10 
0.0121486289426684 -1.35665395584184e-10 -7.71710126357128e-11 6.68331223696583e-11 
0.0115249408408999 3.50277917782194e-10 -5.60685164963104e-10 -3.71599313819804e-11 
0.0109073491767049 -4.66692628986465e-10 9.94438975610024e-10 8.15631395756355e-10 
0.0103921098634601 1.24256743783135e-10 -1.64169816629922e-10 1.49297907370283e-10 
0.00979373138397932 4.72822114794269e-10 8.36224631206584e-11 -1.23216903347156e-09 
0.00926489662379026 -1.28534665549962e-11 1.0234790098762e-10 -1.45323657621543e-11 
0.00876140501350164 3.85926568480244e-10 5.23186216572213e-10 3.09787417940299e-10 
0.00834937952458858 1.55967641579657e-10 4.91038043559655e-11 2.41501707520797e-10 
0.00801580678671598 2.62436211651007e-10 -1.33898656051734e-10 9.35970190241164e-11 
0.00784488767385483 -2.97656788106337e-10 -2.75331701882209e-10 4.62642063547847e-10 
0.00766738737002015 -3.04601177614217e-10 -6.09261807671402e-11 4.35222385908318e-10 
0.00754847563803196 4.07731404195033e-10 3.14969467174464e-10 5.71118874415077e-10 
0.00743183121085167 -1.88051518801302e-11 -4.57621607274916e-10 -3.49970108448616e-10 
0.00728329038247466 -2.83820578150795e-10 -3.47569417691318e-10 1.31932520464062e-10 
0.00712104188278317 -7.30733945575324e-11 -2.86539875160585e-10 -4.16310666495612e-11 
0.0070063266903162 4.15462858560645e-10 -1.36388733640302e-10 -5.59289947688058e-10 
0.00692229857668281 -3.22975313160612e-10 6.91006765696223e-11 -1.75056746876123e-10 
0.00687443697825074 -3.94492216670983e-10 -1.55877255547665e-10 -1.15702586400701e-10 
0.00681908009573817 -2.94622187757554e-10 -1.61143515198248e-10 -1.02381547684161e-10 
0.00674293050542474 -2.26350937992947e-10 7.44573638855606e-11 -1.81150303091293e-10 
0.00652745040133595 1.49243548075439e-10 -3.19181236996258e-10 -2.86996676424067e-10 
0.0061967084184289 -8.66201624316609e-11 2.27163357569005e-11 5.96886207127056e-10 
0.00573591003194451 3.17426279705657e-10 3.28111184055846e-11 4.90553930809767e-10 
0.00518314726650715 6.68419278260224e-11 1.33368885379959e-10 -4.76538114524416e-11 
0.004524199757725 5.5385640518324e-10 -1.50070011972758e-10 -1.86852117112224e-10 
0.00386472558602691 -1.14300735543083e-10 2.45889038297253e-11 -2.07558484288661e-11 
0.00325104594230652 1.26434723801694e-10 -1.97658469452966e-11 7.20850878987989e-11 
0.00266925198957324 -9.18166324220815e-12 1.12773526628196e-10 -8.2399316536641e-11 
0.00214154412969947 -9.50921910658487e-11 9.28929502763687e-12 8.00527422128994e-11 
0.00169239949900657 -5.42985933993378e-11 2.65337491561768e-11 1.2912790281483e-10 
0.00133149733301252 4.45806542723193e-12 -2.99366191558459e-11 7.4568178021206e-11 
0.00101831159554422 -8.22013013213052e-11 6.97469651478322e-11 7.60838891888937e-11 
0.00077328021870926 -5.60074382705e-11 -2.85862254006952e-11 1.75424067633267e-11 
0.000575479643885046 2.29085327096978e-11 2.28524612427838e-11 -1.46035353948415e-11 
0.000435751833720133 3.56830918979423e-11 -2.00102738198704e-12 -3.42818828880098e-11 
0.000316254008794203 2.96205117725212e-12 -1.17208161579119e-11 1.94465502728614e-11 
0.000238206979702227 -1.70415192374263e-11 1.0316966898849e-11 -1.64425452420236e-11 
0.000176351575646549 3.94080601484603e-12 -7.17132169619772e-12 -1.52037722689347e-11 
0.000134226604131982 -1.45462105902161e-11 -9.77749218394885e-12 -7.68814959611896e-12 
8.21447392809205e-05 2.06332889142458e-12 -2.1697884374644e-12 -5.69654132892561e-12 
4.35598340118304e-05 1.07188964735411e-12 -2.38287037671037e-13 -1.17759765155302e-13 
-9.52913751461892e-07 -8.7914911624503e-14 2.26451090545214e-14 6.90032612212649e-14 
0 0 0 0 
0 0 0 0 
0 0 0 0 
0 0 0 0 
0 0 0 0 
0 0 0 0 
0 0 0 0 
0 0 0 0 
0 0 0 0 
0 0 0 0 
0 0 0 0 
0 0 0 0 
0 0 0 0 
0 0 0 0 
99.9985275268555 4.85202581330668e-05 4.46488556917757e-05 4.19856369262561e-05 
