[
  {
    "color": [
      1,
      1,
      1
    ],
    "ignore_ext_mv": false,
    "intensity_diff": 40,
    "intensity_spec": 0,
    "ltc_two_sided": true,
    "name": "key",
    "onnoff": true,
    "rel_rot": [
      -0.21650874614715576,
      -0.10185681283473969,
      0
    ],
    "rel_scale": [
      1,
      1
    ],
    "rel_trans": [
      -0.69514733552932739,
      1.5037481784820557,
      6.8011412620544434
    ],
    "shadow_cast": false,
    "type": "AREA"
  }
]
