0 0 0 0 
0 0 0 0 
0 0 0 0 
0 0 0 0 
0 0 0 0 
0 0 0 0 
0 0 0 0 
0 0 0 0 
0 0 0 0 
0 0 0 0 
0.00226858118548989 -1.14703220788215e-06 -4.47121617508373e-10 0 
0.0025072896387428 -8.730256695344e-07 3.12675865643541e-07 1.6386895396181e-08 
0.0026634254027158 -4.52165807018901e-07 1.52643409023767e-08 -3.60626124518149e-08 
0.00280237384140491 9.74649805307592e-10 -1.45206399793096e-07 2.51058356326439e-08 
0.00289753987453878 4.68663500896582e-07 -2.77006844129346e-08 -1.96921945416761e-08 
0.00294909649528563 8.15792475350463e-07 2.2232722329818e-09 -1.23642909244381e-08 
0.00296218879520893 1.02798526313563e-06 -1.49323386988698e-10 -1.43993892365302e-08 
0.00293690711259842 1.16304624953045e-06 4.83998084666037e-11 -6.20293292286078e-08 
0.00287680211476982 1.1280593525953e-06 -2.50138573049119e-11 1.09110871449047e-08 
0.00276224361732602 1.02197236628854e-06 -4.70303240795999e-11 1.74566405775067e-08 
0.00261075329035521 9.77211243480269e-07 -2.3176337238251e-10 2.58741614800329e-08 
0.00244106980971992 9.68184963312524e-07 4.92950992525554e-11 2.93300370657334e-08 
0.00227788649499416 9.67815594776766e-07 -8.87668133442432e-11 -2.12442916591726e-08 
0.00214728969149292 9.94950028143649e-07 -1.44385281508619e-10 2.21249649712263e-07 
0.00207298598252237 1.03943239082582e-06 -1.98808594586986e-10 -2.05101031269805e-07 
0.00206749280914664 1.06744710137718e-06 -1.94925672825086e-10 7.20321295943904e-08 
0.00212751538492739 1.07068308352609e-06 -3.05959840796177e-10 -1.54221400094912e-08 
0.00223744427785277 1.06388131371205e-06 -1.08951410393576e-10 1.38201783350667e-10 
0.00236834795214236 1.07582161490427e-06 1.38685757322676e-10 2.18490836534357e-10 
0.00251278397627175 1.04998184724536e-06 -1.21093732263766e-10 -8.4619283802212e-11 
0.00263534602709115 1.02454021089216e-06 9.33715813000724e-11 5.07058874055222e-11 
0.00271595316007733 1.02789090306032e-06 -2.53999238308822e-10 2.45639092399941e-10 
0.00274838553741574 1.0475778253749e-06 -2.9551656260951e-11 3.1701502534176e-10 
0.00273861177265644 1.08387791897258e-06 4.63989069388049e-10 -4.62277785495679e-11 
0.00267563993111253 1.17925196718716e-06 -1.29924085379152e-10 1.95143914916152e-10 
0.00260310992598534 1.25304256926029e-06 1.56422635261277e-11 5.70592913196055e-11 
0.00257385079748929 1.23137681384833e-06 -9.79861122796244e-11 1.83466228320661e-10 
0.00262589962221682 1.16540252292907e-06 -3.97839677868106e-11 2.01055519455373e-10 
0.00281743844971061 1.05197125321865e-06 -1.90199703209437e-10 2.65241634211932e-10 
0.00324560538865626 8.86636087216175e-07 3.97680416375223e-10 1.05721938148395e-10 
0.00398916332051158 7.97798350049561e-07 -3.21072723963312e-10 1.46640807136e-11 
0.00518332095816731 9.87892690318404e-07 -6.65547006395428e-10 4.77133887955006e-10 
0.00704821059480309 1.11306837879965e-06 2.99732544339903e-10 2.31434749836668e-11 
0.00979115813970566 1.52705820255505e-06 -1.80842374408741e-09 1.21821863707794e-09 
0.0136511186137795 2.18949662667001e-06 6.30282936953108e-10 8.36542224380565e-10 
0.0188161190599203 2.89332615466265e-06 1.97453653427715e-09 -1.3003028653813e-09 
0.0254434570670128 3.9298388401221e-06 1.71892000633278e-09 -1.19112797403176e-09 
0.0332309007644653 5.82432721785153e-06 2.09421924246556e-09 -8.00117472277151e-10 
0.0418261624872684 6.72309897709056e-06 -4.52835857700506e-09 4.61554394703967e-09 
0.0511430501937866 8.19632532511605e-06 7.76159492232864e-09 -5.00268537706461e-09 
0.0604438632726669 7.98695327830501e-06 4.6532320219228e-09 -8.1073897595374e-10 
0.0691370069980621 8.07160449767252e-06 1.67038982645806e-09 4.50973169918711e-09 
0.0772867947816849 7.86601594882086e-06 -1.00244870182564e-08 -9.75578368089813e-11 
0.0845605731010437 9.26237771636806e-06 -7.3474972772658e-09 5.27468024813516e-09 
0.0910325571894646 8.86155885382323e-06 1.72762482097966e-09 -6.18239726080105e-09 
0.096251592040062 9.94223773886915e-06 8.47250358759766e-09 2.81524648038101e-09 
0.10078851878643 9.86553186521633e-06 -3.69980956982374e-09 1.10980169498731e-09 
0.104508988559246 1.0094444405695e-05 -5.52869261483124e-09 7.36614946816871e-09 
0.107614494860172 9.42192946240539e-06 1.66787250677203e-09 -1.45096923365173e-09 
0.109968960285187 1.01781843113713e-05 -2.82535572715403e-09 9.68970059744834e-09 
0.112366519868374 1.1686251127685e-05 4.6586734470111e-09 -1.5991977742047e-09 
0.114407777786255 1.32788036353304e-05 -4.46153197719568e-10 -3.25472382378678e-09 
0.116093218326569 1.47759556057281e-05 1.0847700515626e-09 1.13015401481675e-08 
0.117639154195786 1.61211773956893e-05 4.0990704164301e-09 -4.306438761148e-09 
0.118974804878235 1.46987331390847e-05 8.97233576324652e-09 -1.44611416175167e-08 
0.120085619390011 1.15694538180833e-05 6.69669708575071e-10 6.67589361569298e-09 
0.121080428361893 1.09041957330192e-05 1.07585593767112e-08 3.98994837169653e-09 
0.122029222548008 6.33449508313788e-06 1.08865423342763e-08 -2.57005083881268e-08 
0.122838214039803 1.66082054420258e-06 -1.7560941145689e-08 7.1224830477945e-09 
0.123539090156555 -7.88992224443064e-07 -6.22129459060261e-09 -9.0677076958201e-10 
0.124212980270386 -2.96253620035714e-06 5.91931348381536e-09 -3.82574105728395e-09 
0.124948337674141 -6.92099501975463e-06 3.56053653227661e-09 -2.08491868214367e-09 
0.125846728682518 -6.80857556289993e-06 -1.47462850819124e-08 1.19671961229528e-08 
0.127204105257988 -4.11042901760084e-06 5.15999776240506e-09 6.13708417418479e-09 
0.127924606204033 -2.91350806946866e-06 -1.03610782176133e-08 8.76858319287521e-09 
0.128736972808838 -2.67500809059129e-06 -1.55737929219413e-08 2.33639063651481e-09 
0.129568114876747 -3.54787380274502e-06 -1.62403104853048e-10 -1.23267067664301e-08 
0.129776611924171 -5.66737753615598e-06 6.59919630052741e-09 2.25605623072056e-09 
0.129823565483093 -1.12857624117169e-05 2.32073116279707e-09 -1.88227544661856e-09 
0.130079507827759 -1.35810460051289e-05 -9.4972945063887e-09 -5.69084690482669e-09 
0.130556181073189 -1.23319259728305e-05 -2.94376123477491e-09 1.21049206214252e-08 
0.130479142069817 -8.6166965047596e-06 9.72379776698062e-09 -6.17291062710024e-09 
0.130656838417053 -7.50749040889787e-06 7.55443796407462e-09 3.50714257635332e-09 
0.130307212471962 -5.75289323023753e-06 3.7093115246023e-09 7.95220600480206e-09 
0.130613908171654 -2.11582732845272e-06 7.23548942982433e-10 3.4469038734386e-09 
0.130258649587631 -4.4886360228702e-06 -4.35859082159595e-09 5.5131454956836e-09 
0.129714891314507 -5.96416157350177e-06 5.1510324894366e-09 -6.02419092388118e-09 
0.129520326852798 -2.73606929113157e-06 -4.45902781365248e-09 4.55649157293792e-10 
0.129052340984344 -2.42722353505087e-06 -1.55766421983117e-08 4.94550533858273e-09 
0.128426402807236 -2.52783138421364e-06 -8.50585601952503e-10 8.84289796942994e-09 
0.127442732453346 -1.92595734915812e-06 -4.43979208952783e-09 1.50653145514212e-09 
0.126729145646095 -3.71789633391018e-06 -3.08191117071033e-09 -1.55861001882585e-09 
0.125608921051025 -6.64476465317421e-06 6.54012444201157e-09 -2.80300227473163e-09 
0.124733492732048 -6.2302160586114e-06 1.14591429678512e-08 6.4569891655708e-09 
0.123538747429848 -4.85419150209054e-06 -6.26838625450432e-09 4.26111546047991e-09 
0.122891776263714 -1.54287499753991e-06 1.15536524791793e-10 -2.69118394236045e-10 
0.122069008648396 -7.99670885953674e-07 -6.99662505709853e-09 -2.00596872446113e-09 
0.120912730693817 -8.0627859233573e-07 -6.08904260346321e-09 5.50419432254756e-10 
0.119969204068184 -1.36112794280052e-06 1.14459136613121e-10 -1.06661324217328e-09 
0.119330793619156 -3.36086850438733e-06 2.40925857042384e-09 -1.02615915764659e-08 
0.118585094809532 -8.93240382993099e-07 3.91828036683251e-09 -4.74320049903554e-09 
0.11773319542408 1.05975018982463e-07 -9.15682729640821e-09 -5.87355497572162e-09 
0.117305442690849 1.57479774998137e-07 1.1626334561754e-08 -1.61921267505249e-08 
0.117089673876762 1.78343339030107e-06 3.97628374670944e-09 -1.00039612149772e-08 
0.115994416177273 -1.28055444292841e-06 -1.34644659866012e-08 -3.65505803401334e-09 
0.114240601658821 -5.23223025084008e-06 1.12381970396314e-08 -8.28202217917351e-09 
0.112611345946789 -6.10012648394331e-06 2.90892887555572e-09 -3.55316470690425e-10 
0.110633656382561 -6.45493673800956e-06 1.54599055779414e-09 -6.89844448231725e-09 
0.108362555503845 -6.48626519250683e-06 -7.7872330805917e-09 1.97423810632813e-09 
0.106211915612221 -5.41837334822048e-06 2.26109442280631e-09 -4.52253035021499e-09 
0.104315392673016 -5.97754433329101e-06 -1.73233927203142e-09 2.9683637770006e-09 
0.102241814136505 -7.15065971235163e-06 8.5664355609083e-09 9.66372226685053e-09 
0.0999934375286102 -5.24240113009e-06 1.38560398710297e-08 -8.95077167939462e-09 
0.0978426784276962 -4.05295259042759e-06 -1.082950529252e-08 -3.99034627562855e-09 
0.0955401286482811 -3.43308056471869e-06 -3.6847673801077e-09 -5.38303979169541e-09 
0.0934078842401505 -1.45042258736794e-06 1.5730416080828e-08 -4.81552442366251e-09 
0.091494157910347 3.03090382658411e-06 3.84436260603138e-09 9.3036911508193e-09 
0.0895495265722275 3.22714799949608e-06 2.65541366673006e-09 5.37461142258167e-09 
0.0873670876026154 3.88325861422345e-06 -7.29319094006087e-09 1.37392985877227e-09 
0.0850686654448509 3.54536086888402e-06 2.25405427656256e-09 -3.66455932265808e-09 
0.0827478021383286 1.38267103011458e-06 4.94192731181897e-09 4.06077615977551e-09 
0.0801538899540901 -1.36415644647059e-06 -3.87976983873273e-09 2.54983500980188e-09 
0.0775956586003304 -6.42882127976918e-07 -4.02130551080404e-10 9.85049553037243e-09 
0.0744453594088554 -1.93058940567425e-06 -2.70864020102124e-09 7.09820557887042e-09 
0.0714961066842079 8.22195659111458e-07 -1.98792737826636e-09 3.11341374903407e-09 
0.0680947080254555 4.71250132250134e-06 -5.37542943490621e-09 5.45456080303097e-09 
0.0649445578455925 5.61971319257282e-06 5.55742563079775e-10 -4.64177096759499e-09 
0.0614821538329124 3.34707283400348e-06 2.06223194076927e-09 -5.70503866370586e-09 
0.0580759160220623 3.7812653772562e-06 4.75420192103115e-09 5.91881832434638e-09 
0.0546875819563866 4.01254874304868e-06 -3.06930614257794e-09 5.7501070571675e-09 
0.0513047315180302 1.70158671153331e-06 5.18356602086101e-09 -1.67367064651813e-09 
0.0474501326680183 1.98659563466208e-06 -1.38065692212308e-09 -2.95625257606957e-09 
0.0438147149980068 4.00176031689625e-06 5.76665515339414e-09 -1.08608844140434e-09 
0.040265291929245 4.17863384427619e-06 -6.04341643395401e-09 2.28173746563698e-09 
0.036538690328598 2.35408901971823e-06 -2.9211372210014e-10 1.2795414727762e-09 
0.0329418405890465 2.60662454820704e-06 -8.47058145847512e-10 1.86417978276232e-10 
0.0295209493488073 2.63258289123769e-06 -1.25820942553645e-09 2.85200252303497e-10 
0.0260775480419397 1.84541488579271e-06 -2.8568572507659e-10 1.07055708742365e-09 
0.0228151679039001 1.54528777329688e-06 -5.94619742333435e-10 3.52117862645329e-10 
0.01979242824018 1.918147518154e-06 -8.80532091684927e-10 1.68600378103179e-09 
0.0170113407075405 1.80329425347736e-06 5.16788889459718e-10 6.88796353287557e-10 
0.0143398772925138 1.28398585275136e-06 1.17367518481792e-10 5.37239697173675e-10 
0.0119240377098322 1.47301454944682e-06 -6.66649457858881e-10 1.13832965276117e-09 
0.00969480909407139 1.42199860420078e-06 -3.97863547663135e-10 5.47486944668663e-10 
0.00772436801344156 1.33474463837047e-06 -3.12464554230729e-10 3.7831151405987e-11 
0.00600265245884657 1.08445840396598e-06 3.17724846432554e-10 4.73381334131773e-10 
0.00465522613376379 1.27616306144773e-06 6.80597689317608e-10 7.55986384604057e-11 
0.00358079629950225 1.28787758058024e-06 -4.03807209892193e-10 3.59941021432775e-10 
0.00272558396682143 1.23306710975157e-06 -3.89570771475167e-11 8.16677281356704e-12 
0.00205282680690289 1.19163303224923e-06 -1.674560906606e-10 1.90613677619744e-10 
0.00153142912313342 1.26617499063286e-06 -3.48047562992448e-11 2.42820819007505e-10 
0.0011168314376846 1.28185672565451e-06 -1.21038873368562e-10 1.99781302612223e-10 
0.000814569590147585 1.40850340812904e-06 -2.10972558867262e-10 2.9693261738295e-10 
0.000582459557335824 1.50667096932011e-06 -1.19500395689975e-10 2.57032006789615e-10 
0.000402190897148103 1.59727255777398e-06 -1.70921166109395e-10 2.73286338003942e-10 
0.000264895905274898 1.63276251896605e-06 -1.63820609855314e-10 2.95194896304807e-10 
0.000165118675795384 1.67727091593406e-06 -1.6940723823744e-10 3.1182775805938e-10 
8.25502720545046e-05 1.70012003763986e-06 -1.69202041266914e-10 3.15538095652101e-10 
1.96442615560954e-05 1.71449642039079e-06 -1.71843123064619e-10 3.16148385248738e-10 
-2.87363109237049e-05 1.70491955486796e-06 -1.69370767411081e-10 3.13717246624989e-10 
-6.38726778561249e-05 1.67638984294172e-06 -1.66346103558368e-10 3.0446023480124e-10 
-8.97355857887305e-05 1.62783749146911e-06 -1.72868136472104e-10 3.00498931293802e-10 
-0.000105433275166433 1.57371391651395e-06 -1.55033791360282e-10 2.88230078693275e-10 
-0.000118365140224341 1.50806226884015e-06 -1.50237988716384e-10 2.69359284876813e-10 
-0.000123972786241211 1.43509112149331e-06 -1.48658585441552e-10 2.68158439897803e-10 
-0.000128558589494787 1.36513392590132e-06 -1.40728359521169e-10 2.45743037030621e-10 
-0.000131049775518477 1.3073272384645e-06 -1.27897720192394e-10 2.29037594445813e-10 
-0.000132368979393505 1.25314693377732e-06 -1.17289150614042e-10 2.39580799643591e-10 
-0.000133457651827484 1.2122042107876e-06 -1.1868131477577e-10 2.26180088547245e-10 
-0.000132630404550582 1.18556260986225e-06 -1.10791563423529e-10 2.1335634647901e-10 
-0.000135342328576371 1.14729084543796e-06 -1.1741912997465e-10 2.07016320752373e-10 
0 0 0 0 
0 0 0 0 
0 0 0 0 
0 0 0 0 
0 0 0 0 
0 0 0 0 
0 0 0 0 
0 0 0 0 
0 0 0 0 
0 0 0 0 
0 0 0 0 
0 0 0 0 
0 0 0 0 
0 0 0 0 
99.9925384521484 0.00632514338940382 3.5233828384662e-05 3.30902730638627e-05 
