0 0 0 0 
0 0 0 0 
0 0 0 0 
0 0 0 0 
0 0 0 0 
0 0 0 0 
0 0 0 0 
0 0 0 0 
0 0 0 0 
0 0 0 0 
0.0284000411629677 9.50855392147787e-05 -4.82505635446273e-09 4.7070227715551e-09 
0.0398380607366562 8.21691428427584e-05 8.81897079807459e-08 -6.91163748456347e-08 
0.048460379242897 8.23851587483659e-05 -4.42897949426424e-08 -1.05705169062276e-08 
0.057836901396513 7.63092684792355e-05 -2.13058569897839e-07 1.14944235463099e-07 
0.0677384659647942 6.9712899858132e-05 3.16195638561112e-07 -1.13325079098558e-07 
0.0778985470533371 5.86651804042049e-05 -2.55031949336626e-07 -3.76774487165221e-08 
0.0878731459379196 4.4930671720067e-05 1.69440809827393e-07 1.37087099005839e-07 
0.0976402387022972 2.8931946872035e-05 -7.99100874360192e-08 -2.03568589540737e-07 
0.106595173478127 1.72497038875008e-05 4.27991651008597e-08 2.67787925167795e-07 
0.113858573138714 8.26087944005849e-06 -2.45314843994038e-08 -2.09064651812696e-07 
0.119828812777996 1.24456448702404e-06 3.62021657096534e-09 1.07893136203074e-07 
0.125309407711029 -9.10505661977368e-07 1.54092871795797e-09 -3.58940219769011e-08 
0.130021616816521 -4.79536583952722e-06 5.94048421564963e-10 1.001557681235e-08 
0.134012773633003 -8.09413540991955e-06 -7.43997041752209e-09 4.78452699681498e-09 
0.137456357479095 -1.0422418199596e-05 3.0775590964538e-09 -2.36366193284709e-09 
0.1405308842659 -7.99304052634398e-06 1.75626908571758e-08 -1.455678066975e-08 
0.143479019403458 -1.26796639960958e-05 -3.02723424105977e-09 2.89694135346963e-09 
0.146363794803619 -8.35905666463077e-06 4.23858992348869e-09 1.18772787160992e-08 
0.14945687353611 -6.34292382528656e-06 -8.59903814820484e-10 3.28421645434673e-09 
0.152074813842773 -2.59647208622482e-06 -7.18462178639356e-09 6.17703221905685e-09 
0.154538989067078 -1.44880107200152e-06 2.32823293977447e-09 -2.78555489785504e-09 
0.156425550580025 4.82230552734109e-06 1.07079778377539e-09 1.38952316319774e-09 
0.157901600003242 6.56985957903089e-06 6.08667161117182e-09 -1.08529671360991e-10 
0.158963605761528 1.00066099548712e-05 -3.77914283200553e-10 -5.97716676153937e-09 
0.160050898790359 1.27322409753106e-05 1.33577708893995e-08 1.32612907322027e-08 
0.161160737276077 1.58753864525352e-05 -7.63119434310511e-09 -1.08479447646914e-08 
0.162185400724411 1.71502470038831e-05 3.01611624564657e-10 -6.20071860524263e-09 
0.163527965545654 1.91973831533687e-05 8.60695473225981e-11 1.76011614172467e-08 
0.164717450737953 2.13938874367159e-05 -1.1296386048798e-08 6.98320912206896e-09 
0.165433809161186 1.95761604118161e-05 -2.33532060356367e-09 8.58169713069401e-09 
0.165702551603317 1.59822648129193e-05 5.6115658786382e-09 3.93555099620357e-09 
0.165258884429932 1.22423998618615e-05 -1.19631105022222e-09 1.01715780242984e-09 
0.16392719745636 1.13635314846761e-05 -5.75365932675709e-09 5.70664449028868e-09 
0.162145227193832 6.15418821325875e-06 -2.9942377466341e-09 7.06188085786152e-09 
0.159893184900284 6.18523972661933e-06 4.46518777508231e-09 -9.49706269182116e-09 
0.157368019223213 1.7832710454968e-06 1.08930802156237e-08 4.60591920159459e-09 
0.154867306351662 3.71764258488838e-06 -2.98911650986611e-09 -6.66986421649085e-09 
0.152367264032364 -3.62945456799935e-06 -6.86011691897193e-09 -7.31511784479721e-09 
0.149486154317856 -5.9437866184453e-06 -9.66723412432202e-09 2.73102540582215e-10 
0.146757662296295 -1.09173033706611e-05 -2.99050895158359e-09 8.39819769282713e-09 
0.143808618187904 -8.95436642167624e-06 -4.75432493374228e-09 -2.74664624377863e-09 
0.140629082918167 -1.652095670579e-05 -2.4006769905327e-09 2.79756329213399e-09 
0.137000486254692 -1.71285955730127e-05 2.25333729453325e-09 2.03518357722032e-09 
0.132675409317017 -1.78622449311661e-05 9.94343363203143e-09 9.72971259116662e-10 
0.127771005034447 -1.94203694263706e-05 -1.36164350905688e-08 8.87362361368105e-09 
0.122375078499317 -2.01221700990573e-05 7.02403690766573e-09 2.75360623192e-09 
0.116981483995914 -1.68396218214184e-05 4.3245358405386e-09 -3.53329498992139e-09 
0.111600033938885 -1.65749661391601e-05 -4.13574330337951e-09 9.81055459092772e-10 
0.106423608958721 -1.38889972731704e-05 8.911015036972e-09 2.33875852018173e-09 
0.101244799792767 -9.32458715396933e-06 -3.85513931888681e-09 -7.57441132037684e-09 
0.0961515232920647 -8.41598557599355e-06 1.16589549126189e-09 -1.1865727955751e-08 
0.0907735079526901 -7.73750343796564e-06 1.95963867355431e-09 -6.95544954965044e-10 
0.0854110196232796 -9.19658396014711e-06 5.10886488669371e-09 -3.59976914943161e-09 
0.0801346078515053 -1.50905016198521e-05 4.55962334555693e-09 -3.8477807606796e-09 
0.0747133046388626 -1.78345180756878e-05 -4.27294874830175e-12 -3.88206711221528e-09 
0.0694676116108894 -1.9450026229606e-05 -7.08751324296486e-09 -7.57052465161223e-09 
0.0645481795072556 -2.08949586522067e-05 3.65655949963184e-09 -4.45261716386369e-10 
0.0598483271896839 -1.94954136532033e-05 -3.2098948499204e-10 -7.59870000255347e-10 
0.0556337870657444 -1.83063511940418e-05 -6.57152166017028e-10 -3.92018595363197e-09 
0.0520667694509029 -2.03631043405039e-05 1.75744793717847e-10 -6.46535003312465e-09 
0.0488377995789051 -1.99485875782557e-05 2.35019359529076e-09 -5.64808644298864e-09 
0.0459452904760838 -2.0423658497748e-05 3.34651240052608e-09 -1.26369170683205e-09 
0.0435195527970791 -2.02696610358544e-05 -6.28957511072947e-11 -2.17063056417999e-09 
0.0413191616535187 -1.81030973180896e-05 -1.66986813265879e-09 -3.18583626146562e-09 
0.0393604189157486 -1.82102630787995e-05 -2.04161287875593e-09 -4.76758010847789e-09 
0.0376403257250786 -1.95031570910942e-05 1.62433655415128e-09 -5.22252285861668e-09 
0.0361436493694782 -2.00654631044017e-05 -3.39956729433766e-09 -4.11632372632198e-09 
0.0345822349190712 -1.9584647816373e-05 2.07291517284602e-09 -1.26384547272096e-09 
0.0331651009619236 -2.15441796171945e-05 -1.7190109335985e-09 -5.82438275387176e-09 
0.0317029133439064 -2.03391027753241e-05 -2.20330975686522e-09 -4.29660973466639e-09 
0.0303174238651991 -1.96134224097477e-05 -2.17165993521284e-10 -3.35735017564787e-09 
0.0289566460996866 -1.87186833500164e-05 -2.51285059427175e-09 -3.51841511481155e-09 
0.0276847612112761 -1.85874469025293e-05 -6.85602741246072e-10 -5.73661385061541e-09 
0.0263402331620455 -1.83481879503233e-05 -6.99119317992825e-10 -2.39599473594865e-09 
0.0251229479908943 -1.74304823303828e-05 -1.42051015394884e-09 -3.67142050095026e-09 
0.0239283423870802 -1.85550688911462e-05 7.05409786139199e-10 -4.10657774452261e-09 
0.0228149481117725 -1.9532315491233e-05 -9.31363319800482e-10 -3.25951510227185e-09 
0.0217010378837585 -2.09919671760872e-05 -1.05955821894099e-09 -3.64488128568041e-09 
0.0208016522228718 -2.09598201763583e-05 -2.00147939888318e-10 -5.64546320802606e-09 
0.0199824310839176 -2.29148809012258e-05 -1.3900266493394e-09 -4.66511451691076e-09 
0.0193141642957926 -2.08943092729896e-05 -1.42367939659493e-09 -4.617019655484e-09 
0.0187100283801556 -2.00342474272475e-05 -9.73477298771286e-10 -3.55045659539144e-09 
0.0182744469493628 -1.90213013411267e-05 1.05202124789372e-09 -4.6006585208147e-09 
0.0179142020642757 -1.9361259546713e-05 4.98388608161093e-10 -2.83926482325114e-09 
0.0176065117120743 -1.91596973309061e-05 -1.98370075921162e-09 -3.29256710784875e-09 
0.0173128414899111 -1.975208397198e-05 -8.8137669385091e-10 -3.44495831861025e-09 
0.0171709582209587 -1.92631887330208e-05 -4.68744931758636e-10 -4.07069356000989e-09 
0.0169979054480791 -1.93954056157963e-05 -1.7569500299075e-09 -3.48060891219859e-09 
0.0168352276086807 -1.82793100975687e-05 7.12940761982139e-10 -3.47744388839999e-09 
0.0167412385344505 -1.71194096765248e-05 -1.9444211518671e-10 -3.04144909257786e-09 
0.0166298635303974 -1.67023736139527e-05 -6.73680278229227e-10 -4.3867527388386e-09 
0.0164721664041281 -1.76646117324708e-05 -1.41631895100858e-09 -3.66832675346984e-09 
0.0163355227559805 -1.70533712662291e-05 -2.72427169711875e-09 -4.65841631935859e-09 
0.016189593821764 -1.79203925654292e-05 1.14764434067105e-10 -1.81246673225388e-09 
0.0159394536167383 -1.88512349268422e-05 6.91236790029137e-11 -2.68554556370759e-09 
0.0156816095113754 -1.91896670003189e-05 -8.97873830840723e-10 -4.0817353941236e-09 
0.0152872838079929 -1.85964854608756e-05 -8.97174390335209e-10 -4.08899003545571e-09 
0.0149008240550756 -1.83948086487362e-05 -1.51066370523978e-09 -3.10670800196533e-09 
0.0144227230921388 -1.76363573700655e-05 -5.96817206766076e-10 -3.53776519190774e-09 
0.0139612061902881 -1.66073841683101e-05 -5.71119485037741e-10 -2.62953148144618e-09 
0.0134239308536053 -1.55592333612731e-05 -1.18589660313972e-09 -2.80388201545634e-09 
0.0129397055134177 -1.44923624247895e-05 -1.17695408974328e-10 -2.51852649846285e-09 
0.0124775469303131 -1.42269009302254e-05 -5.84530257530247e-10 -3.02905567295397e-09 
0.012096137739718 -1.33518351503881e-05 1.41494385652585e-10 -2.27634244787112e-09 
0.0118228895589709 -1.25642909551971e-05 3.4650934899183e-10 -2.45641018636888e-09 
0.0115955388173461 -1.16781384349451e-05 -6.71523225914683e-10 -2.22609686240105e-09 
0.0114123830571771 -1.07285050034989e-05 1.17984760850121e-10 -2.12644657437977e-09 
0.011232590302825 -9.86414488579612e-06 -5.15841591663957e-10 -2.03558347955379e-09 
0.0109925344586372 -9.05230263015255e-06 6.23510687525197e-10 -2.00246663695225e-09 
0.0106754032894969 -8.57985105540138e-06 3.28090665746572e-10 -1.56011570329184e-09 
0.0103700580075383 -8.68329880177043e-06 -5.81376113917287e-10 -1.65659808093466e-09 
0.0100404033437371 -9.02323608897859e-06 -1.96152677434114e-10 -1.24032240034211e-09 
0.00970774330198765 -8.91467243491206e-06 -5.70207991934524e-10 -1.47821954676886e-09 
0.00941207818686962 -8.35500759421848e-06 -7.92683627071078e-11 -1.05704811570462e-09 
0.00909347366541624 -8.10251185612287e-06 9.99607896456922e-11 -6.5094091228346e-10 
0.00880269147455692 -7.37485333957011e-06 4.04747874105382e-10 -1.76444381327912e-09 
0.00852352287620306 -6.25694019618095e-06 -3.11054126900245e-10 -7.99850186083972e-10 
0.00821862276643515 -5.95342089582118e-06 3.8193215950999e-11 -1.19559029343463e-09 
0.00789943244308233 -5.44228350918274e-06 2.21104370923264e-10 -9.85110104601006e-10 
0.00761661631986499 -4.73987120130914e-06 -2.12884584960271e-10 -7.11169956257862e-10 
0.00727834599092603 -4.35936999565456e-06 7.35282251751457e-11 -1.14445852794631e-09 
0.00693792896345258 -4.54953988082707e-06 2.27753288450927e-10 -1.13861609030153e-09 
0.00661014020442963 -4.29067767981905e-06 -5.49087719736718e-10 -8.91016427306823e-10 
0.00624410342425108 -4.06707113143057e-06 -2.73256084426521e-10 -8.87867945831289e-10 
0.00585617078468204 -3.86617375625065e-06 -3.82427228773352e-10 -9.63398583131436e-10 
0.00546585721895099 -3.23175140692911e-06 2.25106010220966e-11 -6.60431931365224e-10 
0.00504075270146132 -2.75731372312293e-06 8.01377020298588e-11 -5.8330723584632e-10 
0.00458430545404553 -1.93317259800097e-06 1.08243546070863e-10 2.72141996437991e-11 
0.00415504118427634 -1.58106684011727e-06 1.65105470961713e-10 -2.9771077270091e-10 
0.00368011393584311 -1.26374584397126e-06 3.03657377020983e-10 -2.68426419980372e-10 
0.00322970631532371 -1.00918020962126e-06 -6.1924354533005e-11 -3.76115943945265e-10 
0.00278809922747314 -4.07648542477546e-07 1.70971709012591e-10 1.21874788039378e-10 
0.00234679644927382 -5.2462473831838e-07 -1.37812553036021e-10 -1.29965579964697e-10 
0.00194908573757857 -6.37347795873211e-07 7.83566059259222e-11 -1.70962355383608e-10 
0.00160872575361282 -4.25123289460316e-07 -4.401178033131e-11 6.78942741871164e-13 
0.00131468276958913 -5.27091572166682e-07 -1.79004849137909e-11 -1.11124564411424e-11 
0.00106734584551305 -4.20207072693302e-07 8.25157789319242e-11 -8.03182520492385e-11 
0.000901579798664898 -1.87773991910944e-07 1.55407041402267e-11 -3.29275426369513e-11 
0.000748925318475813 -1.06068910099566e-07 -1.08554111880044e-11 1.77346540231049e-11 
0.000641399878077209 -5.79286677293567e-07 -2.14210298804529e-11 -5.69581465326152e-11 
0.000549604126717895 -1.29682837268774e-06 2.25088801764084e-11 -2.36130115460753e-10 
0.000485125638078898 -2.20678475670866e-06 -2.55732015425059e-11 -3.53337387126729e-10 
0.000439129769802094 -2.77352410193998e-06 -5.09803275983156e-11 -4.28738905489112e-10 
0.000433359586168081 -3.03638444165699e-06 -1.23004080879174e-11 -4.94050467203522e-10 
0.000418398762121797 -3.16642217512708e-06 1.31563379981992e-11 -5.26178101090125e-10 
0.000416359456721693 -2.75305751529231e-06 -4.50983035638064e-11 -4.39325908985211e-10 
0.000470051687443629 -2.18726177081408e-06 -4.47263892588978e-11 -4.01926963933263e-10 
0.000470599916297942 -2.48491983256827e-06 -4.87728225861961e-11 -3.94709098738844e-10 
0.000463768577901646 -2.35564357353724e-06 -6.16013420828843e-11 -3.93059196301948e-10 
0.000438091869000345 -2.28051021622377e-06 -2.3778689087206e-11 -3.90411314388217e-10 
0.000404487538617104 -2.31740796152735e-06 -5.9693056053689e-11 -3.79720171972409e-10 
0.000318538921419531 -2.85629948848509e-06 -3.21776459644152e-11 -4.59320526058349e-10 
0.000276956096058711 -2.4644680252095e-06 -6.43348525494747e-12 -4.03588273911737e-10 
0.000235183746553957 -2.59777698374819e-06 -4.01732778987363e-11 -4.38439701211379e-10 
0.000229991899686866 -2.25306121137692e-06 -2.17795000784227e-11 -3.41889766497516e-10 
0.000224088114919141 -2.31949957196775e-06 -2.46375350676509e-11 -3.90588200671615e-10 
0.000230652862228453 -1.7773702438717e-06 -1.33668414878385e-11 -2.97835867080209e-10 
0.000234439139603637 -1.6647961729177e-06 -1.58654582527173e-11 -2.87207368998565e-10 
0.000226472737267613 -1.32582022160932e-06 -5.84638945328592e-13 -2.28332422413935e-10 
0.000222648304770701 -1.20296590466751e-06 -2.51007062357367e-11 -1.88466978134905e-10 
0.000194571315660141 -8.37373704598576e-07 -1.36835803105084e-11 -1.42640121936211e-10 
0 0 0 0 
0 0 0 0 
0 0 0 0 
0 0 0 0 
0 0 0 0 
0 0 0 0 
0 0 0 0 
0 0 0 0 
0 0 0 0 
0 0 0 0 
0 0 0 0 
0 0 0 0 
0 0 0 0 
0 0 0 0 
99.9729995727539 0.0256125181913376 5.09571582369972e-05 4.73129948659334e-05 
