0 0 0 0 
0 0 0 0 
0 0 0 0 
0 0 0 0 
0 0 0 0 
0 0 0 0 
0 0 0 0 
0 0 0 0 
0 0 0 0 
0 0 0 0 
0.0158766936510801 0.000225222276640125 3.94145135942381e-05 3.37424785357143e-06 
0.0206366181373596 0.000297622784273699 3.93722330045421e-05 3.71598093806824e-06 
0.0251067541539669 0.000370008696336299 3.60638623533305e-05 3.88099533665809e-06 
0.029960859566927 0.00044715718831867 3.22746345773339e-05 3.92297579310252e-06 
0.0356451533734798 0.000539217027835548 2.4628765459056e-05 3.73148236576526e-06 
0.0418684221804142 0.000638550030998886 1.59155133587774e-05 3.15619286084257e-06 
0.0484891645610332 0.000728279235772789 6.99321617503301e-06 2.30646992349648e-06 
0.0555399991571903 0.000805187912192196 -2.85407418232353e-06 1.25561575714528e-06 
0.062929131090641 0.000860843865666538 -1.24852967928746e-05 4.55899083817712e-07 
0.0701414048671722 0.000873340468388051 -1.801889447961e-05 -2.20510216308867e-07 
0.077496699988842 0.000853058008942753 -2.18020595639246e-05 -7.14660473022377e-07 
0.0852016434073448 0.000805925985332578 -2.52410864050034e-05 -1.05880690171034e-06 
0.0932487770915031 0.000738085131160915 -2.4896944523789e-05 -6.08369475685322e-07 
0.101113647222519 0.000657204014714807 -2.37605236179661e-05 -6.34068499039131e-07 
0.108740642666817 0.000572385324630886 -2.25561798288254e-05 -5.55025280846166e-07 
0.11607214063406 0.000488449411932379 -1.90567534446018e-05 -9.30015403355355e-07 
0.123079068958759 0.000415028538554907 -1.37560964503791e-05 -1.19230105610768e-06 
0.129829287528992 0.00034494893043302 -1.1976643691014e-05 -1.36993025989796e-06 
0.136355593800545 0.000291644159005955 -6.49390949547524e-06 -1.10241273887368e-06 
0.142343193292618 0.000236354127991945 -2.2884339614393e-06 -1.65778351401968e-06 
0.147788360714912 0.000187995683518238 -1.46191962357989e-06 -1.74325953139487e-06 
0.152640119194984 0.000146107544424012 -1.37232484576089e-06 -1.64277025760384e-06 
0.156661450862885 0.000112186840851791 1.90705648606126e-07 -2.28286535275402e-06 
0.159774571657181 7.8045268310234e-05 -4.77879393656622e-06 -2.79877895081881e-06 
0.1625896692276 5.2266022976255e-05 -9.70795554167125e-06 -2.16625289795047e-06 
0.165348798036575 2.25821877393173e-05 -1.13069645522046e-05 -1.44862394790835e-06 
0.168167918920517 -8.21006415208103e-06 -8.90276714926586e-06 -8.88279714672535e-07 
0.171000629663467 -4.21646691393107e-05 -3.91135972677148e-06 -4.81390031836781e-07 
0.173978760838509 -8.44769601826556e-05 6.67390986563987e-06 -5.90457887028606e-07 
0.176539272069931 -0.000114286282041576 1.80910228664288e-05 -1.30587352487055e-06 
0.178341448307037 -0.00014413136523217 2.79000960290432e-05 -1.85984822564933e-06 
0.179223328828812 -0.000173049396835268 3.01428935927106e-05 -2.64853815679089e-06 
0.179355695843697 -0.000186506818863563 3.10940777126234e-05 -2.49551248998614e-06 
0.178657501935959 -0.000198741952772252 3.18539459840395e-05 -2.34361186812748e-06 
0.177385225892067 -0.0002184480545111 2.95568443107186e-05 -2.24878931476269e-06 
0.175676286220551 -0.000236331470659934 2.62727298832033e-05 -1.58637010372331e-06 
0.173673331737518 -0.000240807217778638 2.67112845904194e-05 -9.13583335204748e-07 
0.171038329601288 -0.000249102857196704 2.70399577857461e-05 -1.54673193719645e-06 
0.167889997363091 -0.000252940692007542 2.33063856285298e-05 -7.09240964624769e-07 
0.164785996079445 -0.000249787553912029 2.00983959075529e-05 -9.06149608681517e-08 
0.161150693893433 -0.000238044114666991 1.85021708603017e-05 1.12901477677951e-06 
0.156988278031349 -0.000240086650592275 1.73893531609792e-05 1.21535413200036e-06 
0.152464836835861 -0.000232140126172453 1.26508284665761e-05 2.75703496299684e-06 
0.147374525666237 -0.000221308640902862 1.03569154816796e-05 3.08269909510273e-06 
0.141437768936157 -0.000208626355743036 9.50931644183584e-06 3.40253927788581e-06 
0.135153144598007 -0.000208903278689831 6.08957634540275e-06 2.7891005629499e-06 
0.128590628504753 -0.000198989509954117 1.78393372607388e-06 3.41768418365973e-06 
0.12194412946701 -0.000196629160200246 -2.02480123334681e-06 3.25605719808664e-06 
0.115569420158863 -0.000199284826521762 -6.43956218482344e-06 2.87964553535858e-06 
0.109282359480858 -0.000202746305149049 -1.07527230284177e-05 3.0905741823517e-06 
0.103078223764896 -0.000195569475181401 -1.55653833644465e-05 2.70947202807292e-06 
0.0968712046742439 -0.000190780294360593 -1.958727989404e-05 2.45062597059587e-06 
0.0906205773353577 -0.000189338563359343 -2.33227965509286e-05 2.04899674827175e-06 
0.0842425525188446 -0.000183050578925759 -2.69151059910655e-05 1.9895833247574e-06 
0.077814981341362 -0.000176646106410772 -2.79556170426076e-05 1.91678077499091e-06 
0.0714595839381218 -0.000169633800396696 -2.8090911655454e-05 2.02620526579267e-06 
0.0653422921895981 -0.000162795869982801 -2.86154536297545e-05 1.88497426734102e-06 
0.0596460774540901 -0.000152542605064809 -2.73174173344159e-05 2.29606052926101e-06 
0.0545207969844341 -0.000142120246891864 -2.52011996053625e-05 2.57132296610507e-06 
0.0499542355537415 -0.000131716995383613 -2.44946550083114e-05 2.588445568108e-06 
0.0460031405091286 -0.000123717050882988 -2.41293473663973e-05 2.67265681941353e-06 
0.0425486378371716 -0.000114405396743678 -2.39088221860584e-05 3.11850976686401e-06 
0.0395748913288116 -0.000107536252471618 -2.41264988289913e-05 3.06212109535409e-06 
0.0369739718735218 -9.92491550277919e-05 -2.40553054027259e-05 2.76000923804531e-06 
0.0346698053181171 -9.520175808575e-05 -2.37119129451457e-05 2.58035925071454e-06 
0.0325909592211246 -8.83618267835118e-05 -2.29787692660466e-05 2.54072665484273e-06 
0.030785484239459 -8.35819228086621e-05 -2.22793551074574e-05 2.39087967202067e-06 
0.0291125066578388 -8.03848306532018e-05 -2.04368352569873e-05 2.30363957598456e-06 
0.0275823026895523 -7.88100223871879e-05 -2.02120154426666e-05 2.55538066085137e-06 
0.0261507462710142 -7.59675167500973e-05 -2.00125214178115e-05 2.68416283688566e-06 
0.0247535593807697 -7.23624470992945e-05 -2.02504670596682e-05 2.50096763920737e-06 
0.0233960095793009 -7.15543501428328e-05 -2.01123275473947e-05 2.21739333028381e-06 
0.0220834724605083 -6.90404194756411e-05 -2.03342442546273e-05 2.05613673642802e-06 
0.0207840036600828 -6.83133621350862e-05 -1.99986807274399e-05 1.7057955119526e-06 
0.0195441469550133 -6.51444788672961e-05 -2.05983596970327e-05 1.39923668029951e-06 
0.0183679889887571 -6.45912878098898e-05 -2.02045448531862e-05 1.32391244278551e-06 
0.017219603061676 -6.27791087026708e-05 -1.99882961169351e-05 1.25729013689124e-06 
0.0161826368421316 -6.06313478783704e-05 -2.00041104108095e-05 1.05263370642206e-06 
0.0152684384956956 -5.9133191825822e-05 -2.00147260329686e-05 9.78528760242625e-07 
0.0144812734797597 -5.82668508286588e-05 -1.94371405086713e-05 8.57831253142649e-07 
0.01382792647928 -5.82513348490465e-05 -1.91241015272681e-05 7.69839914482873e-07 
0.0133277801796794 -5.85861162107904e-05 -1.93551804841263e-05 7.3517941245882e-07 
0.0129330074414611 -6.00314815528691e-05 -1.9237961168983e-05 6.09076948876464e-07 
0.0126307494938374 -6.08260997978505e-05 -1.91874423762783e-05 3.79983276843632e-07 
0.0124087817966938 -6.19585407548584e-05 -1.92901334230555e-05 2.7653180723064e-07 
0.0122663835063577 -6.2332816014532e-05 -1.96187756955624e-05 2.52986307458514e-08 
0.0121812960132957 -6.31924631306902e-05 -2.01152088266099e-05 -1.82199812570616e-07 
0.0121478512883186 -6.50692600174807e-05 -2.06403146876255e-05 -2.67288100985752e-07 
0.012167482636869 -6.65943443891592e-05 -2.11756669159513e-05 -2.46150847260651e-07 
0.0122211128473282 -6.80468219798058e-05 -2.21333430090453e-05 -3.32475622144557e-07 
0.012306472286582 -6.9964153226465e-05 -2.3046577553032e-05 -4.44211821104545e-07 
0.0123858489096165 -7.11325410520658e-05 -2.35363550018519e-05 -5.16450882059871e-07 
0.0124846585094929 -7.15596543159336e-05 -2.42750629695365e-05 -6.24237998181343e-07 
0.0125808604061604 -7.13013359927572e-05 -2.52360150625464e-05 -8.17387217466603e-07 
0.0126586072146893 -7.21119722584262e-05 -2.50887878792128e-05 -8.41590633626765e-07 
0.0126587208360434 -7.23319171811454e-05 -2.46983890974661e-05 -8.58819475979544e-07 
0.0126422625035048 -7.18047085683793e-05 -2.40023982769344e-05 -9.68683366409095e-07 
0.0125960065051913 -7.11175671312958e-05 -2.35587340284837e-05 -9.78383354777179e-07 
0.0125132892280817 -7.00975069776177e-05 -2.29547222261317e-05 -1.02488752418139e-06 
0.0124235656112432 -6.87897554598749e-05 -2.28944918490015e-05 -1.11412953174295e-06 
0.0123763075098395 -6.71587986289524e-05 -2.22925318666967e-05 -1.11369524802285e-06 
0.0123365102335811 -6.59897777950391e-05 -2.15681375266286e-05 -1.10525070340373e-06 
0.0122784012928605 -6.47290580673143e-05 -2.09986319532618e-05 -1.20692880045681e-06 
0.0122436359524727 -6.32944938843139e-05 -1.96949222299736e-05 -1.29124236991629e-06 
0.0122084971517324 -6.23318483121693e-05 -1.85368880920578e-05 -1.35435129777761e-06 
0.0121794305741787 -6.14732489339076e-05 -1.8177090169047e-05 -1.40645408919227e-06 
0.01216134801507 -6.02146428718697e-05 -1.80045663000783e-05 -1.50652999764134e-06 
0.0121524222195148 -5.97289581492078e-05 -1.73909520526649e-05 -1.59989133408089e-06 
0.0121356174349785 -5.95709680055734e-05 -1.74924498423934e-05 -1.63800564223493e-06 
0.0120813203975558 -5.87387621635571e-05 -1.70729908859357e-05 -1.68297049185639e-06 
0.0120173515751958 -5.76296260987874e-05 -1.63190707098693e-05 -1.80254619408515e-06 
0.0119337188079953 -5.66641392651945e-05 -1.5507468560827e-05 -1.84139378234249e-06 
0.0118167866021395 -5.42273701285012e-05 -1.4926066796761e-05 -1.95114398593432e-06 
0.0116594387218356 -5.28544078406412e-05 -1.42479375426774e-05 -2.01518355424923e-06 
0.0115119935944676 -5.08832163177431e-05 -1.38887553475797e-05 -2.19079356611473e-06 
0.011335744522512 -4.82107570860535e-05 -1.39006651806994e-05 -2.2522808649228e-06 
0.0111360745504498 -4.61785784864333e-05 -1.37688484755927e-05 -2.41795373767673e-06 
0.0109006082639098 -4.48944483650848e-05 -1.33784451463725e-05 -2.48746368924913e-06 
0.0106319636106491 -4.29821011493914e-05 -1.30739281303249e-05 -2.63956144408439e-06 
0.0103431502357125 -4.11215514759533e-05 -1.27140119730029e-05 -2.83434860648413e-06 
0.0100070778280497 -4.04778802476358e-05 -1.18212901725201e-05 -3.02128660223389e-06 
0.00959521252661943 -3.88662228942849e-05 -1.11617091533844e-05 -3.20397793984739e-06 
0.00917514320462942 -3.70041052519809e-05 -1.07784971987712e-05 -3.42853354595718e-06 
0.00870432052761316 -3.4270928154001e-05 -1.01096457001404e-05 -3.61844581675541e-06 
0.00818369910120964 -3.24043285218067e-05 -9.57089378061937e-06 -3.64396396435041e-06 
0.00761914113536477 -3.01679428957868e-05 -8.99541191756725e-06 -3.82477037419449e-06 
0.00705220364034176 -2.81334050669102e-05 -8.75574642122956e-06 -3.87026329917717e-06 
0.00642926897853613 -2.58481850323733e-05 -8.26667383080348e-06 -3.82583584723761e-06 
0.00581522518768907 -2.42887599597452e-05 -7.76708475314081e-06 -3.77098581338942e-06 
0.0051888283342123 -2.20364199776668e-05 -6.9486327447521e-06 -3.70497309631901e-06 
0.00456536188721657 -1.87364239536691e-05 -5.85800853514229e-06 -3.5235225368524e-06 
0.00391981424763799 -1.48703938975814e-05 -4.24545714849955e-06 -3.28663713844435e-06 
0.00329728284850717 -1.05281333162566e-05 -2.23137431021314e-06 -3.02614898828324e-06 
0.00269975233823061 -6.11408040640526e-06 1.23889094538754e-07 -2.7479447908263e-06 
0.00212873588316143 -1.2733365792883e-06 2.62007529272523e-06 -2.4422943170066e-06 
0.00161546352319419 2.86229123958037e-06 4.84299243908026e-06 -2.09896529668185e-06 
0.00117669487372041 7.06930359228863e-06 7.04093508829828e-06 -1.80161998741823e-06 
0.000807203934527934 1.09929687823751e-05 9.21258106245659e-06 -1.51902236211754e-06 
0.000482577830553055 1.52536404129933e-05 1.12115485535469e-05 -1.19952449040284e-06 
0.000220190457184799 1.92171555681853e-05 1.30100870592287e-05 -9.18476473543706e-07 
-6.41048870875238e-07 2.30043460760498e-05 1.46744378071162e-05 -6.88684167471365e-07 
-0.000161541684065014 2.54114693234442e-05 1.59335377247771e-05 -5.11571045080927e-07 
-0.000287272181594744 2.73601053777384e-05 1.67690450325608e-05 -3.78218004470909e-07 
-0.000363283324986696 2.80651620414574e-05 1.72123345691944e-05 -2.96562717494453e-07 
-0.000409658736316487 2.79104060609825e-05 1.71713254530914e-05 -2.60870223200982e-07 
-0.000419989955844358 2.66973129328107e-05 1.68598235177342e-05 -2.41876819018216e-07 
-0.00042087709880434 2.54598817264196e-05 1.63933800649829e-05 -2.4090562078527e-07 
-0.000411966757383198 2.38917564274743e-05 1.58035418280633e-05 -2.41810909074047e-07 
-0.000395558628952131 2.22051621676655e-05 1.51525373439654e-05 -2.6137928443859e-07 
-0.000379326578695327 2.06498807528988e-05 1.45567237268551e-05 -2.69528385388185e-07 
-0.000365784857422113 1.92365987459198e-05 1.38898712975788e-05 -2.88799867576017e-07 
-0.000352056085830554 1.77272140717832e-05 1.32057157316012e-05 -2.86672161564638e-07 
-0.000336834928020835 1.64401553774951e-05 1.24385869639809e-05 -2.86198627463818e-07 
-0.000327136454870924 1.51228878166876e-05 1.16973742478876e-05 -2.82170049104025e-07 
-0.000310502480715513 1.3820127605868e-05 1.10391456473735e-05 -2.72038789717044e-07 
-0.000297331978799775 1.27003058878472e-05 1.04736818684614e-05 -2.53164785135596e-07 
-0.000285159621853381 1.19357091534766e-05 9.98803807306103e-06 -2.43969680013834e-07 
-0.000269987562205642 1.1105514204246e-05 9.55313407757785e-06 -2.39496102949488e-07 
-0.000255283230217174 1.04165210359497e-05 9.20120965020033e-06 -2.3360104250969e-07 
-0.000245833653025329 9.96363360172836e-06 8.85194458533078e-06 -2.11342779721235e-07 
-0.000241932604694739 9.65125309448922e-06 8.51998629514128e-06 -2.07953632980207e-07 
0 0 0 0 
0 0 0 0 
0 0 0 0 
0 0 0 0 
0 0 0 0 
0 0 0 0 
0 0 0 0 
0 0 0 0 
0 0 0 0 
0 0 0 0 
0 0 0 0 
0 0 0 0 
0 0 0 0 
0 0 0 0 
99.6723861694336 0.297381281852722 0.0238162726163864 0.00256662769243121 
