0 0 0 0 
0 0 0 0 
0 0 0 0 
0 0 0 0 
0 0 0 0 
0 0 0 0 
0 0 0 0 
0 0 0 0 
0 0 0 0 
0 0 0 0 
0.00278229778632522 -5.28405007571564e-06 -1.53216195286632e-09 -8.50964798626563e-10 
0.00332458619959652 -5.34826176590286e-06 3.67892795338776e-07 1.56296522391131e-07 
0.00373539980500937 -5.8353634813102e-06 4.37667431185673e-08 3.02311029543034e-08 
0.00414397101849318 -5.57383327759453e-06 -3.00257426033568e-07 -1.59945532374195e-08 
0.00452527683228254 -5.59868158234167e-06 1.51660302094569e-07 -2.27389577389658e-07 
0.00483772018924356 -5.14393741468666e-06 -8.37854656765558e-08 3.11666667585087e-07 
0.00509601086378098 -4.64691720480914e-06 3.02336538027248e-08 -1.67004529316728e-07 
0.00527390791103244 -4.02451951231342e-06 -3.2050186948851e-09 3.00090690075194e-08 
0.00537181878462434 -4.02913428843021e-06 5.74988445745106e-10 -1.99255612010063e-09 
0.0053457748144865 -3.70769362234569e-06 6.40221375913796e-10 2.86003911526e-11 
0.00524476729333401 -3.71988267033885e-06 -4.74254913118699e-10 -1.70508634989019e-10 
0.00509381666779518 -3.59268778993282e-06 -2.28707608407319e-10 5.91578244724111e-11 
0.00493928976356983 -3.49080210071406e-06 -3.65117464040665e-10 -1.65838245913541e-10 
0.0048176352865994 -3.48696244145685e-06 2.75932693361014e-10 2.9253932609663e-10 
0.00479107536375523 -3.6047536013939e-06 -2.06468349361888e-11 2.64960081652887e-10 
0.00487886974588037 -3.91301455238136e-06 4.51180703908705e-10 5.72852154601122e-10 
0.00509188789874315 -4.11141581935226e-06 -1.58070459499449e-10 -9.11716674378837e-11 
0.00540823629125953 -4.7241023821698e-06 -2.03917618901706e-10 -1.83155796085188e-10 
0.00580828217789531 -5.25700716025312e-06 1.70652408870708e-10 3.3921684905458e-11 
0.00621343497186899 -5.86248734180117e-06 -4.63435817499303e-10 1.52645104889437e-10 
0.00659594126045704 -6.24289077677531e-06 -6.1998156608567e-10 -2.7438179506234e-10 
0.00688241748139262 -6.77420666761464e-06 -4.16291473515074e-10 -1.61572630275053e-10 
0.00706334132701159 -6.88554700900568e-06 6.83887182995058e-11 6.4010442779594e-11 
0.00711332447826862 -6.87816100253258e-06 4.07784361833308e-10 1.26313215442764e-09 
0.00706667732447386 -6.68664097247529e-06 6.14584494407211e-10 7.70893182622245e-10 
0.0069819362834096 -6.80438415656681e-06 -4.36896435695999e-10 6.98237467844365e-10 
0.00697301141917706 -6.78563765177387e-06 5.68456948180085e-10 9.3273377910208e-10 
0.00717812217772007 -7.39084680390079e-06 -1.1282230705234e-09 3.40791311836952e-10 
0.007735017221421 -8.7123171397252e-06 -1.24396359879597e-09 -6.69410638032275e-10 
0.00879447720944881 -1.00948473118478e-05 -6.65773547403603e-10 7.33728133806011e-10 
0.0104578528553247 -1.12476645881543e-05 5.24231658083352e-10 1.21222198945503e-09 
0.0128324497491121 -1.2811406122637e-05 -7.49858453108487e-10 -3.65923735756724e-10 
0.0161116253584623 -1.50619880514569e-05 -3.12357406606623e-09 1.40568903739258e-10 
0.0205530412495136 -1.67629041243345e-05 3.49815121314379e-10 1.13170597892953e-10 
0.026333237066865 -1.94031981664011e-05 -1.30343817336676e-11 -2.08348072128217e-09 
0.0336695350706577 -2.05993383133318e-05 -3.83420983851579e-09 -2.319690883823e-09 
0.0425591953098774 -2.37039748753887e-05 5.26146726187449e-09 3.26694671315408e-09 
0.0527816861867905 -2.37910589930834e-05 2.49910847571755e-09 4.30440616483452e-09 
0.0638153254985809 -2.41651614487637e-05 -2.34320518543996e-09 -2.47476905634869e-09 
0.0753927454352379 -2.32005713769468e-05 -5.88390669520322e-09 -4.37807035069682e-09 
0.0868526622653008 -2.37193708017003e-05 7.34135241486911e-09 -6.74630273519994e-12 
0.0975946709513664 -1.9408178559388e-05 -5.25063104106493e-09 -5.57961676861396e-09 
0.107264637947083 -1.84641103260219e-05 1.11829834281707e-08 1.02193142836882e-08 
0.115992210805416 -1.80378810910042e-05 -2.49407055008533e-08 -1.94115337137646e-08 
0.123269014060497 -1.65917772392277e-05 -4.39848513167362e-09 -4.06303524158602e-09 
0.129097312688828 -1.60712170327315e-05 -1.56618895630345e-08 4.9026593895718e-10 
0.134136870503426 -1.87824371096212e-05 2.84958434626503e-09 6.5263161541651e-10 
0.13846218585968 -1.87368368642638e-05 6.52676490631166e-09 5.29123811432441e-09 
0.141669273376465 -2.23860770347528e-05 8.14520451086764e-10 3.47344708551134e-09 
0.144353926181793 -2.78806073765736e-05 -2.09243866677866e-09 -1.07582760477953e-08 
0.146698415279388 -2.86810081888689e-05 3.31310889833958e-09 2.51665155381886e-09 
0.148206770420074 -2.93369503197027e-05 8.08128319818024e-09 3.47716855308988e-09 
0.149458676576614 -2.60908946074778e-05 -9.34592070400697e-10 4.25192325792523e-09 
0.150538831949234 -1.68865444720723e-05 -2.14806359366548e-08 -1.20864305230839e-08 
0.151038333773613 -1.42042517836671e-05 -5.83141579468816e-09 -7.53324069791006e-09 
0.151456192135811 -1.2743383194902e-05 -4.31998703476211e-09 -1.82561199491005e-09 
0.151859641075134 -1.22036353786825e-05 -1.50111800767405e-09 -8.05426303429613e-09 
0.151822999119759 -1.63210988830542e-05 5.99644156551449e-09 1.04595798688933e-08 
0.151660472154617 -1.92117222468369e-05 1.03016013497381e-08 -1.86773396748663e-09 
0.151698172092438 -1.57750764628872e-05 1.62551536675437e-08 -2.54097609619919e-09 
0.151333183050156 -1.73576900124317e-05 1.68434191039069e-08 2.9178413019082e-09 
0.150672182440758 -1.58923285198398e-05 4.23769508373084e-09 1.22179235617637e-08 
0.150485426187515 -1.55888228619006e-05 -7.50026707407869e-09 -4.43948655615145e-09 
0.150178715586662 -2.12228151212912e-05 5.66793778578045e-10 7.82401504695329e-11 
0.149778261780739 -1.84759264811873e-05 -1.75949406155951e-08 -7.49169792868543e-09 
0.149428337812424 -1.22679939522641e-05 1.94342497650268e-09 4.15573603307351e-10 
0.149205610156059 -8.05561285233125e-06 -8.81747297398761e-09 -5.372390088354e-09 
0.148145571351051 -7.56366625864757e-06 9.67073754409853e-10 6.45498099416386e-09 
0.147203698754311 2.58069803749095e-06 1.31435662353852e-09 -1.07377466918024e-08 
0.145880818367004 1.57501131070603e-06 4.05685440796333e-09 -7.91136114952629e-11 
0.144707307219505 3.60471108251659e-06 -6.44901776425399e-09 -5.27278842810119e-09 
0.14341513812542 4.20923515775939e-06 1.02137923119194e-10 1.13103828525141e-08 
0.142282590270042 6.28088400844717e-06 4.66097715978719e-10 1.05124549065749e-08 
0.140498921275139 8.8677543317317e-06 -4.95381202725298e-09 1.16079723611051e-08 
0.139084160327911 5.72954104427481e-06 -7.30229321455056e-10 3.82624287809108e-09 
0.137256905436516 1.31714432427543e-05 -3.09370751239157e-09 8.14251155389911e-09 
0.135284066200256 1.87602217920357e-05 1.79005643641261e-09 -5.0100563697697e-09 
0.132568329572678 2.78141396847786e-05 1.78514216742087e-08 3.64098928784529e-09 
0.130166053771973 2.99453458865173e-05 8.06639377515239e-09 8.51074499763627e-09 
0.127187997102737 4.26371261710301e-05 2.6057096480514e-09 7.03506231047868e-09 
0.124305583536625 3.41163395205513e-05 -5.05094677194506e-09 -6.01521676912853e-09 
0.120998427271843 3.2384352380177e-05 2.16507363148821e-08 9.69108970849675e-09 
0.117901928722858 2.88313185592415e-05 -5.13993780870692e-09 -2.67930100328329e-09 
0.114530585706234 3.08922899421304e-05 -6.01742766725977e-10 1.83782822293921e-09 
0.110989585518837 2.97164515359327e-05 -5.53487122800789e-09 -1.73643854850525e-09 
0.107092507183552 3.34940123138949e-05 2.53658449800298e-09 2.6492301685721e-09 
0.103825397789478 3.25652945321053e-05 -9.26308096893536e-09 -5.0629092029908e-09 
0.100239045917988 3.38625686708838e-05 -3.07156433621003e-09 -6.76029143775736e-09 
0.0967715531587601 2.86338836303912e-05 1.09262532355103e-09 -1.73200398467799e-09 
0.0935979038476944 2.37377626035595e-05 -3.55074081248574e-09 -6.29710328325928e-09 
0.090319387614727 2.18892801058246e-05 -8.07472400055076e-09 -8.28542745523464e-09 
0.0867114365100861 2.48687192652142e-05 4.94384977400841e-09 5.13842524085817e-10 
0.0833201557397842 2.21015397983138e-05 8.49683257087008e-09 6.81540290869975e-09 
0.0798055529594421 2.52527806878788e-05 9.8804397996588e-10 -3.25027404990408e-09 
0.0758690983057022 2.85733567579882e-05 -5.83208370485977e-10 1.47287138041463e-09 
0.0719713270664215 2.94665314868325e-05 5.07024155993463e-09 -9.10977349111164e-10 
0.0675967931747437 2.69904230663087e-05 -2.37662955981932e-09 -2.00528305072112e-09 
0.0633670464158058 2.64871741819661e-05 9.12472764014183e-10 -3.46368023151911e-09 
0.0589041151106358 2.38197098951787e-05 -5.2567159514183e-09 -5.96880633807473e-09 
0.0547078661620617 2.07906687137438e-05 -2.68540689685182e-10 -1.29246502389435e-09 
0.0503459870815277 1.78567133843899e-05 -8.81352413273362e-09 -3.23320015205297e-09 
0.0462912619113922 1.51754275066196e-05 -1.12204578961439e-09 2.78333378567197e-09 
0.0423913635313511 1.52968841575785e-05 4.98238827972841e-09 5.17522469323239e-09 
0.0388738811016083 1.2879974747193e-05 -6.08547934266568e-10 -8.42685643487329e-10 
0.0356895737349987 1.19410415209131e-05 2.16692525034645e-10 1.45746792412638e-09 
0.0328373834490776 1.14468721221783e-05 4.86899587315293e-09 1.49315459996302e-09 
0.0303547475486994 1.02173507912084e-05 5.59841328851007e-09 1.36182187748801e-09 
0.0281820762902498 9.05612887436291e-06 7.07285618961606e-10 1.1226862772773e-09 
0.0261503662914038 7.8422845035675e-06 7.32526973107328e-12 -4.07184730377708e-10 
0.0242428127676249 6.76168656355003e-06 1.27302246522021e-09 5.15246678656212e-10 
0.022646851837635 6.49795038043521e-06 1.71694991557558e-10 7.67880981022984e-10 
0.021154772490263 6.87594956616522e-06 2.86881030042707e-09 6.44117537085265e-10 
0.0197184290736914 6.46793614578201e-06 1.79999148919308e-09 -2.98420510524977e-10 
0.0184730980545282 5.56461509404471e-06 1.54129786711366e-09 7.33920313411573e-10 
0.0172044802457094 5.07181084685726e-06 8.40815750358104e-10 4.26925300667236e-10 
0.0160516630858183 3.80545952793909e-06 -9.83503500862071e-10 -4.27190560703394e-10 
0.0149602629244328 1.97341273633356e-06 1.94302629541454e-10 3.63540924794292e-12 
0.0138887939974666 1.46396655509307e-06 -1.70593150716769e-10 -1.17728515824922e-09 
0.0128142517060041 1.06020365819859e-06 2.12662465415292e-09 1.86642945543269e-09 
0.0118847601115704 1.66496107567582e-07 7.55898732496263e-10 1.84141743519994e-10 
0.010922709479928 -9.71645306435676e-08 4.91146068259951e-10 2.3137644578064e-10 
0.0100415693596005 3.34004226942852e-07 8.68804972409265e-10 -3.85093817945048e-10 
0.00923601258546114 2.79197127639463e-08 -5.503379973959e-10 -1.91829607754102e-10 
0.00844643451273441 -2.72814531854237e-07 -4.32438362896193e-10 -6.98051894065799e-10 
0.00767262140288949 -4.27505142397422e-07 -2.04009781290537e-10 1.79001105604648e-10 
0.00695738242939115 -1.00788099643978e-06 -3.05996006311204e-10 2.63761346097624e-10 
0.00623776111751795 -1.46633385611494e-06 -7.00588920210521e-10 -5.81454606685128e-10 
0.00553712295368314 -2.04772072720516e-06 3.17980142217067e-10 3.75730169199784e-10 
0.00491504231467843 -2.10390203392308e-06 -9.62527141323832e-11 1.46578207904646e-10 
0.00428491225466132 -2.15617842513893e-06 -1.97528646217471e-10 3.1744556983071e-10 
0.00369843957014382 -2.00240947378916e-06 -4.10803308037444e-10 -1.15212499263162e-10 
0.00314007326960564 -2.19935463974252e-06 6.25996129932638e-11 1.4127209124748e-10 
0.00259373593144119 -1.82271651283372e-06 -1.47232420699694e-10 -7.04560671957455e-12 
0.00209114793688059 -1.5588030919389e-06 1.81407999733096e-10 1.48881768025078e-10 
0.00165196822490543 -1.37971949243365e-06 3.05957516266719e-11 1.56646973170638e-10 
0.00127439084462821 -1.11262511381938e-06 -1.53013365866705e-11 4.85021051099821e-11 
0.000956725154537708 -8.71041436312225e-07 5.88585430394417e-11 1.146545983155e-10 
0.000713623012416065 -7.2712936116659e-07 -8.43660905025523e-11 -6.98213925912072e-12 
0.000519133289344609 -6.08585992267763e-07 1.11267609709254e-11 2.80053827350635e-11 
0.000376724754460156 -2.48767292987395e-07 2.15084113713848e-11 4.42188161087209e-11 
0.000255405815551057 3.08575266672051e-07 6.61066730869853e-12 -1.5024596150548e-11 
0.000181508570676669 8.9980591155836e-07 2.75619110867709e-11 -9.14005416491337e-12 
0.000139890355058014 1.3533370974983e-06 4.60835085369649e-11 -2.86532637894243e-11 
0.000123809702927247 1.65822473263688e-06 2.73998046473878e-11 -5.14896458803094e-11 
0.000114755930553656 1.7414579360775e-06 2.62173355941586e-11 -5.24261814516258e-11 
0.0001257368712686 1.53303892602707e-06 2.4976231152718e-11 -3.74800364355554e-11 
0.000171862673596479 1.30129456010764e-06 1.72609166543269e-11 -5.00146070392393e-11 
0.000178336922544986 1.40903262035863e-06 2.67927815350566e-11 -3.42125806851445e-11 
0.000184944670763798 1.30780688323284e-06 2.68026729283166e-11 -2.90749559844761e-11 
0.000176758956513368 1.28364706597495e-06 2.68225788802035e-11 -2.87354272321405e-11 
0.000157344300532714 1.30926059682679e-06 3.74734028529833e-11 -2.53529003346742e-11 
0.000100791090517305 1.627895017009e-06 4.62299469539129e-11 -4.33799558774428e-11 
7.77926907176152e-05 1.40596466735587e-06 3.0854985233475e-11 -4.09528626288402e-11 
5.23024536960293e-05 1.54432871113386e-06 4.24054263925555e-11 -4.00500015096394e-11 
4.71030616608914e-05 1.38089546908304e-06 3.3090467865815e-11 -3.81405462768214e-11 
5.21698202646803e-05 1.37422216539562e-06 3.63826503646525e-11 -3.62415618349043e-11 
6.22451188974082e-05 1.02559033621219e-06 2.92906046639452e-11 -2.91443640054734e-11 
7.05562342773192e-05 9.18237560654234e-07 1.63498867222778e-11 -2.77024531786241e-11 
6.94759073667228e-05 6.91702780386549e-07 2.10862091676312e-11 -1.43287152976068e-11 
7.13675690349191e-05 6.20741104739864e-07 1.30868727313271e-11 -1.34591331135692e-11 
5.40277978871018e-05 5.83202279358375e-07 2.35550277200014e-11 -1.13990926073337e-11 
0 0 0 0 
0 0 0 0 
0 0 0 0 
0 0 0 0 
0 0 0 0 
0 0 0 0 
0 0 0 0 
0 0 0 0 
0 0 0 0 
0 0 0 0 
0 0 0 0 
0 0 0 0 
0 0 0 0 
0 0 0 0 
99.9795532226563 0.0191798899322748 5.1276154408697e-05 4.53856227977667e-05 
