0 0 0 0 
0 0 0 0 
0 0 0 0 
0 0 0 0 
0 0 0 0 
0 0 0 0 
0 0 0 0 
0 0 0 0 
0 0 0 0 
0 0 0 0 
0.000493104860652238 -6.76500565635618e-12 -6.95853791254919e-12 1.61505487802915e-12 
0.000650286441668868 5.81732955140524e-08 5.64526239088536e-08 -1.04638839815152e-08 
0.00102515507023782 -1.78343569245953e-07 -1.5606454439876e-07 2.03412717780793e-08 
0.00164976099040359 2.33395525128799e-07 1.74271789887825e-07 -1.16111458225987e-08 
0.00285010621882975 -1.31650068624367e-07 -2.18373568117158e-08 -2.14138644594186e-08 
0.00433848518878222 1.5631327698884e-07 -1.61306260793026e-07 6.32501340191993e-08 
0.00589119456708431 -1.62139684789508e-07 2.24234668166901e-07 -3.69528656563034e-08 
0.00730076339095831 8.0994631446174e-08 -1.30643627471727e-07 -4.86241908959073e-08 
0.0083672720938921 -3.18619761685568e-08 6.05487500138224e-08 1.36381316906409e-07 
0.00878309831023216 1.34266660012372e-08 -2.84449033216561e-08 -1.99066960249183e-07 
0.0087781734764576 -5.12196507429508e-09 1.46596903505269e-08 2.0559929225783e-07 
0.00854415167123079 2.06580175188265e-09 -5.61443869173672e-09 -1.26865444372015e-07 
0.00822057481855154 -9.20283738103933e-10 1.63261315577756e-09 4.29973496807179e-08 
0.00785741023719311 1.58457663657074e-10 -3.63780505718836e-10 -2.46437519280107e-08 
0.00748757272958755 -2.39825742598399e-10 4.23363205603877e-10 1.14573142084851e-08 
0.00711670843884349 1.63601368563526e-10 2.37114550216688e-10 -9.91069981637338e-09 
0.00682932510972023 1.12572763610874e-10 1.06189730619821e-10 3.88285981145486e-09 
0.00655606435611844 -1.14039860887871e-10 5.90201942873847e-10 -3.3856853431935e-10 
0.00626905681565404 2.01045860515059e-10 2.90395381352671e-11 -3.01169006400315e-10 
0.00599065702408552 -8.04863120595911e-11 -7.77693742737284e-11 9.8714023066826e-11 
0.00572155183181167 -2.31442295883788e-10 4.12979372921285e-11 1.32308233813383e-10 
0.00543104531243443 -2.01886812822849e-10 1.04412650400731e-11 -3.11981517009396e-11 
0.0051310220733285 -2.97109059577139e-10 -1.13788041489205e-10 -1.39563603729354e-11 
0.00487987836822867 -1.64467883756458e-11 -1.55544008229036e-10 1.57093157926447e-10 
0.00462396861985326 3.62294014233377e-11 2.35714885110649e-11 -1.97442909244394e-10 
0.00437254970893264 -2.55061277654178e-10 2.09002079532006e-10 -2.1128852834007e-10 
0.00414754264056683 2.09834066788872e-10 5.34317902423087e-11 -6.19222867426217e-11 
0.00397475576028228 -2.54303356150842e-10 2.27424121201913e-10 -2.10693934521444e-10 
0.00384871941059828 4.95766344643656e-11 1.7600609858448e-10 -1.67689889751799e-11 
0.00380647648125887 -1.14560798347707e-10 1.026186011166e-10 -2.78052286056818e-11 
0.00382936582900584 -2.09190498257072e-10 7.54474052677701e-11 -3.08306102869693e-10 
0.00391928851604462 -1.05532770022787e-10 1.39133366286459e-11 -3.04176378529419e-10 
0.00405210582539439 -4.45831357942517e-11 1.50719450808801e-10 -1.20586873819661e-10 
0.00421827100217342 -2.5274417975174e-11 -3.92679916361161e-11 2.41463342376402e-11 
0.00443741679191589 2.11022921359216e-10 -2.57064629999304e-11 -7.47239978227121e-11 
0.00471946643665433 6.14893691519569e-11 9.45509087690866e-11 4.5322690045424e-11 
0.00503033585846424 -5.10412045962028e-10 1.1117724796339e-10 1.34574754118155e-10 
0.00536426855251193 -1.70261915677372e-10 1.54393040019407e-10 2.54693367091052e-11 
0.00571033218875527 -2.0236577691346e-10 4.10146673568423e-11 -1.57096020220182e-11 
0.00601123226806521 2.14991385805163e-10 -2.39701009041582e-10 -8.04944930155038e-11 
0.00630128802731633 9.22880313836139e-11 -2.23813800825923e-10 6.36422192723529e-10 
0.00654209312051535 -1.5120601992713e-10 1.66615485297505e-10 2.29006522078912e-10 
0.00674913683906198 -1.31526664559622e-10 2.06035067479293e-11 8.96366175728858e-11 
0.00693508703261614 -1.64049898665475e-10 2.73636738268301e-11 -4.56558506278792e-11 
0.00715790176764131 5.3534005006739e-10 3.57101015424632e-11 2.55122117875928e-10 
0.00736220367252827 1.84782647516535e-10 -4.16794238011775e-10 -2.79489070775796e-10 
0.00760835502296686 -1.24828702929847e-10 2.00477676126631e-10 -3.82440829005404e-10 
0.00786499492824078 3.3926236819859e-11 -4.93658759703752e-11 -3.93793164743528e-10 
0.00816608127206564 6.96091448371128e-11 -2.03214903238269e-10 -3.30723781694076e-10 
0.00846903212368488 -1.29047579913721e-11 -4.21949419848744e-10 3.3191985271408e-10 
0.00882531888782978 1.14238056514449e-10 1.14704620801653e-10 1.21701412836295e-10 
0.00923937000334263 -1.39668915322133e-10 2.96903529539705e-10 -1.50909784668585e-10 
0.00978293549269438 3.23434924676125e-11 3.04688947683207e-11 -5.77261363710058e-11 
0.0103764142841101 3.67242319887495e-10 -1.1634318508591e-10 2.31056229704762e-10 
0.0111038722097874 1.31113149851037e-11 3.3327959836349e-10 -5.48110057341233e-10 
0.0119963642209768 -4.79454809187985e-10 4.80073425457306e-10 -5.57779794574387e-11 
0.0129745732992887 1.26221449958663e-10 1.19425302980147e-10 -6.23727069992697e-10 
0.014043640345335 -1.68216732210347e-10 -3.92933380277682e-10 -8.97136642752372e-10 
0.0151735031977296 3.77264608442118e-10 3.44930833895418e-10 -6.4363771257181e-11 
0.016296686604619 2.54887166928341e-10 3.98182320449081e-10 1.71902742041041e-10 
0.0173002388328314 9.84779924273482e-10 5.24529808476615e-10 -4.35594893488656e-10 
0.0182248689234257 7.2501632475408e-10 8.14948830640816e-10 5.37902555830527e-10 
0.0189306139945984 -2.30280725044274e-10 1.24978349891336e-09 -1.50276541210914e-10 
0.0193475987762213 2.27263999286187e-10 -5.9436655597267e-10 -4.29385998979015e-10 
0.0193686950951815 1.61457236469431e-10 6.40528019513198e-10 1.76666917206525e-10 
0.0190016012638807 4.98908248047769e-10 7.2320122113112e-10 -3.52784856882948e-10 
0.0182764511555433 1.27140864503161e-09 5.66955926650792e-11 -7.40614253952332e-12 
0.0171585604548454 5.64450153284213e-10 6.43871456151857e-10 2.81267231727611e-10 
0.0159371979534626 -9.01112962026218e-10 4.61003096807744e-10 -2.86489276746238e-10 
0.0147126540541649 -2.17233994681543e-10 5.31856114704965e-10 -3.8005884550607e-10 
0.0134915774688125 1.93517188384895e-10 -4.51047060812115e-10 -1.04513819820795e-09 
0.01239472348243 2.39336411800295e-10 9.29268745286649e-11 3.94729075814393e-11 
0.0115805929526687 2.17567033833355e-10 2.03229058581833e-10 -3.58956003809752e-10 
0.0109353344887495 4.04016237132154e-10 -6.5986549557806e-11 -2.53735088495688e-10 
0.0104497615247965 -3.18117365782911e-10 6.37651320634092e-11 -1.35830374725643e-10 
0.0102220745757222 -5.72770997298022e-10 -1.83661127972634e-10 -4.65347871347888e-10 
0.0101135838776827 1.07858076636713e-10 -6.45236142293726e-10 -3.94660470970365e-10 
0.0100452331826091 -3.37337852096553e-10 -7.42932868003088e-11 1.865534671186e-10 
0.0100263673812151 -2.95305141451152e-10 1.66916688804086e-10 -1.69984484821306e-10 
0.0101103167980909 8.61978655120055e-10 -2.03919339747394e-10 1.26619312257326e-10 
0.0103012323379517 4.91636231725323e-10 2.89262586106176e-10 3.13525733153242e-10 
0.0105705121532083 2.38736586055666e-10 -4.07104877586661e-10 8.27474824771635e-11 
0.0111020365729928 6.91160809140889e-11 5.08266650989242e-10 5.74203636027892e-11 
0.01218465808779 -2.84970297359521e-10 -6.09829894915315e-11 -5.59460311411186e-10 
0.0143103823065758 1.10738827829859e-10 -9.5890196824544e-12 -1.64650459932858e-10 
0.0185534041374922 1.03101424966945e-13 -1.48606071892488e-10 -9.06220098961796e-11 
0.0264479704201221 1.80878784172833e-12 2.68291638905183e-10 -3.30111438184844e-10 
0.039017591625452 4.06859523849334e-11 7.03241076482897e-10 -5.46234689424718e-11 
0.056484829634428 1.10042275291988e-11 -9.24971044202749e-10 1.20968490779916e-09 
0.0790781453251839 -3.51927798014628e-11 2.06732186924796e-09 -5.25068433177012e-10 
0.105403326451778 -1.83365778116951e-11 8.56894333267633e-10 2.65972688318072e-09 
0.131703644990921 1.07262430049104e-10 -1.86968840409918e-09 5.41255396058204e-09 
0.15497487783432 -1.92302770929409e-12 2.49135267971212e-09 -9.78791891981245e-09 
0.174707517027855 2.72593925210174e-11 2.26156857130455e-10 2.3474584498473e-09 
0.189509525895119 -8.70757332904759e-11 6.70284050485748e-09 -8.9856799778687e-10 
0.19743213057518 -3.09317593760738e-11 -5.74908742834168e-09 7.64879448666989e-09 
0.201460182666779 6.90063872710311e-11 -1.68259550736849e-09 1.10811058107174e-08 
0.203595548868179 2.80609269154297e-11 -3.54261975310521e-09 9.2578439359059e-10 
0.204076200723648 -5.60927126969091e-11 1.02243302713134e-09 -2.72434541592759e-09 
0.201669842004776 4.35830616041244e-11 -1.5525621899215e-09 6.38187414025992e-09 
0.199073895812035 1.25878107937183e-10 6.84871270806298e-09 -4.94918162008418e-10 
0.196413829922676 -5.72581315694265e-11 -1.07758388878665e-08 3.35260597061904e-09 
0.193404614925385 -6.84588652433149e-11 5.76422864995152e-09 -1.06186339721148e-08 
0.189529970288277 -1.47679628526021e-10 8.4864817395669e-09 -8.09574796090118e-10 
0.18527777493 7.87340770358469e-11 1.00805741531929e-09 1.86748110309054e-08 
0.181856215000153 3.62688346022821e-11 -2.20535611994421e-09 4.49663550838864e-09 
0.177428781986237 5.82591663800258e-11 3.53819928911037e-09 -2.14104692308759e-10 
0.172927975654602 4.79279060883187e-12 -4.51110349075634e-09 -3.82671505594345e-10 
0.168603003025055 -3.37179451026515e-12 -1.37929534460568e-09 -2.61575849869189e-09 
0.164894297719002 -4.77241690610697e-12 -2.856796355033e-09 -2.20141838092047e-09 
0.160080179572105 -1.33704591842587e-11 -2.64857291654153e-09 -8.36218205790829e-10 
0.156200766563416 -4.92756946357531e-11 2.23863594328577e-09 -3.95583610313111e-09 
0.151727586984634 -2.64388244630709e-11 -4.03539024418365e-09 -7.08078351507879e-09 
0.146164879202843 -7.77056308187696e-12 -6.82430201237594e-09 -4.54260629112468e-09 
0.14127716422081 2.81873496765783e-12 -4.72873795676065e-10 -4.23313428754568e-09 
0.136881068348885 -3.01772185018479e-11 1.86188842121737e-09 -9.76046532485952e-09 
0.13199071586132 -6.08464123530439e-11 8.10856004562766e-09 -7.02593716539468e-09 
0.126606926321983 9.81274297928714e-13 -9.20484410915634e-10 -7.23577331385172e-09 
0.121867932379246 -2.44817055516933e-11 -3.3361751139438e-09 1.14717380039764e-09 
0.116931654512882 -1.95134308711431e-11 2.2387275366853e-10 3.24339688440034e-09 
0.111802227795124 -3.07865777315897e-11 5.29919219616204e-09 -7.59630047753035e-09 
0.106581091880798 4.0489949171274e-11 6.19480733377031e-09 3.29702792845055e-10 
0.102597892284393 5.96665827856668e-11 9.31115184954479e-10 5.99022342839817e-09 
0.09807088971138 4.30236690718289e-11 -1.08768460904685e-09 9.72081526384727e-09 
0.0941000580787659 2.8219502290483e-11 -3.22214388503994e-09 -1.7681310859885e-09 
0.0898595377802849 -4.29050371619777e-13 2.90295121274653e-10 -1.40687983485321e-09 
0.0858080312609673 -5.02178254535579e-11 -4.08516065419917e-09 1.86293513948499e-09 
0.0817135870456696 7.41724504038643e-11 1.35435229697833e-09 -1.78190329158667e-09 
0.0786646232008934 1.70871039539833e-11 -6.87945603261575e-11 -5.92261040210929e-09 
0.075286976993084 -3.21384620305398e-13 -1.10769249328513e-09 9.7633046092227e-10 
0.0725508034229279 4.68190819447045e-11 -1.90965376845043e-09 2.29219615510701e-10 
0.0698653683066368 -2.95635826930152e-11 -6.18245177275156e-10 -1.67352587343572e-09 
0.0668048560619354 -5.06501673935844e-12 1.15376097564734e-09 -9.55756918052941e-10 
0.0633086338639259 -1.54711377042815e-11 -1.00206292916183e-11 -1.30366417661065e-09 
0.059829656034708 1.1049319237344e-11 -7.17650522341629e-11 9.53739656694985e-11 
0.056373730301857 -1.43149292419764e-11 -1.16718035236829e-09 -2.39467490281697e-09 
0.0528223291039467 -2.47253800766956e-12 1.16769538482941e-09 4.67997918196517e-10 
0.0492981597781181 2.66905519907823e-11 -1.56537860451778e-09 -1.59053437087664e-09 
0.0458756200969219 -2.55145748973007e-11 -1.50160961442936e-09 2.25216889582214e-09 
0.0420845560729504 1.76474779234326e-11 -3.98705513049435e-10 7.0536065877036e-10 
0.0379213243722916 -6.10042016901957e-12 6.28418705961309e-10 -1.54865065216114e-09 
0.0335870571434498 -1.33129929302811e-11 1.96544336361626e-10 3.80556086643224e-10 
0.0290569141507149 -1.14211118340535e-11 6.24247986635851e-10 -1.73259892544131e-10 
0.0243627484887838 1.3180169178284e-11 3.72739200615868e-10 -1.19606727300159e-10 
0.0199314225465059 6.65790200748972e-12 -2.47209919201907e-10 6.21804441269802e-10 
0.0160140935331583 6.27549179288423e-12 4.35447705671166e-10 6.88030576956322e-10 
0.0125575251877308 9.8228404576961e-13 -6.03885441652352e-10 8.65180149745015e-10 
0.00964168552309275 2.89361340444216e-12 3.06510594683118e-10 -1.20693413596662e-10 
0.00730312522500753 4.48316418710792e-13 -7.07582050677585e-13 1.40087469402417e-10 
0.00551597028970718 3.95124960528292e-12 1.22068535834963e-10 6.00533650585433e-11 
0.00410531181842089 6.5696588794073e-14 1.02268221668922e-10 7.93507343166411e-11 
0.00303920358419418 -5.65077533376535e-13 -6.3521263986635e-13 -1.90253507392768e-11 
0.00222114357165992 1.59661988491377e-13 9.50507311747728e-11 -9.05135168205451e-12 
0.0016362153692171 6.17610615427644e-13 -2.81710453575723e-11 -1.11546445691335e-10 
0.00117537984624505 -2.26143583026417e-13 -1.91297047646977e-11 -4.56688983505038e-12 
0.000863769673742354 -7.06439490238964e-13 5.10903055972456e-11 -6.18906800808894e-11 
0.000628269568551332 6.50227224494038e-14 2.08156096526135e-11 4.56826156763901e-12 
0.000460709881735966 4.58549756325588e-15 -1.17346575165267e-11 4.46848591115212e-12 
0.000310938194161281 4.27837496333461e-14 -5.65643452216102e-12 -1.41114273044529e-11 
0.000182191710337065 -9.28618510212531e-15 6.77311418756377e-12 -1.19275650554279e-12 
8.11478312243707e-05 3.89014937884208e-15 4.62898328609102e-13 -2.70915559950902e-12 
0 0 0 0 
0 0 0 0 
0 0 0 0 
0 0 0 0 
0 0 0 0 
0 0 0 0 
0 0 0 0 
0 0 0 0 
0 0 0 0 
0 0 0 0 
0 0 0 0 
0 0 0 0 
0 0 0 0 
0 0 0 0 
99.9987030029297 4.08343075832818e-05 3.96469367842656e-05 3.5999262763653e-05 
