0.000825697730761021 0.000473989843158051 
0.000770807266235352 -0.000852982688229531 
0.000791803176980466 -0.00213485956192017 
0.000971213099546731 -0.00225430727005005 
0.00119613797869533 -0.00177496718242764 
0.00151550339069217 -0.00138903351034969 
0.00181215303018689 -0.00233700615353882 
0.00216339924372733 -0.00359610747545958 
0.00250254338607192 -0.00470581045374274 
0.00283713662065566 -0.00560270575806499 
0.00311900884844363 -0.00699488213285804 
0.00336846895515919 -0.00790431071072817 
0.00362006900832057 -0.00811463128775358 
0.0038312328979373 -0.00746235158294439 
0.00402789516374469 -0.00656337756663561 
0.00414210883900523 -0.00516788195818663 
0.00414421129971743 -0.00473581906408072 
0.00401566317304969 -0.00425973022356629 
0.00383813842199743 -0.00441180402413011 
0.0036294988822192 -0.00382428127340972 
0.00340416748076677 -0.00337119470350444 
0.00314122950658202 -0.00307023175992072 
0.00291772023774683 -0.00237463647499681 
0.00274493987672031 -0.00193986960221082 
0.00266218767501414 -0.00147925817873329 
0.00267402804456651 -0.00155628426000476 
0.00277789356186986 -0.00188120419625193 
0.00295207719318569 -0.0019608570728451 
0.00316177378408611 -0.00203867582604289 
0.00338282785378397 -0.00200524274259806 
0.00356051581911743 -0.00221416144631803 
0.00368409208022058 -0.00240088487043977 
0.00372612476348877 -0.00241335295140743 
0.00370924174785614 -0.00244123907759786 
0.00363799999468029 -0.00264644552953541 
0.00355997937731445 -0.00274209142662585 
0.00349627248942852 -0.00285497889854014 
0.00352669507265091 -0.00297243380919099 
0.00372057827189565 -0.00319248461164534 
0.00416923640295863 -0.00340777030214667 
0.00497245835140347 -0.00388737116008997 
0.00628368556499481 -0.00482311006635427 
0.00830188486725092 -0.00616118730977178 
0.0113019254058599 -0.00750881992280483 
0.0156037053093314 -0.00889002811163664 
0.02146234549582 -0.00931092724204063 
0.0290048494935036 -0.00858205370604992 
0.0378632321953773 -0.00848471559584141 
0.0475768148899078 -0.00838037673383951 
0.0576428584754467 -0.0068853348493576 
0.067395031452179 -0.00264952820725739 
0.0766475573182106 -0.00439088186249137 
0.0847953855991364 -0.00409611314535141 
0.0919932648539543 -0.00645469455048442 
0.098298542201519 -0.0054243397898972 
0.103680200874805 -0.0036536636762321 
0.108028687536716 -0.00144778634421527 
0.111369155347347 0.0019742485601455 
0.114121317863464 0.00219191005453467 
0.116333790123463 -0.002012241166085 
0.118154875934124 -0.00111087085679173 
0.119576722383499 -0.00415310868993402 
0.121095784008503 0.00286436639726162 
0.122416198253632 0.000870093528646976 
0.123436518013477 0.00670416094362736 
0.124122060835361 0.00566490041092038 
0.124501511454582 0.0148612633347511 
0.12481701374054 0.0172222275286913 
0.125004693865776 0.0131415156647563 
0.125273212790489 0.0125965643674135 
0.125596553087234 0.0128094935789704 
0.126063868403435 0.0111926291137934 
0.126596510410309 0.00460897013545036 
0.127283155918121 0.00443780096247792 
0.127937614917755 0.0137627478688955 
0.128457725048065 0.0141204139217734 
0.128956526517868 0.0133880712091923 
0.129133075475693 -0.00271192658692598 
0.129240959882736 -0.00579127995297313 
0.129268780350685 -0.0114467050880194 
0.129577174782753 -0.000722127559129149 
0.129571676254272 -0.00114435737486929 
0.129366800189018 0.000860796717461199 
0.129071310162544 -0.00524909701198339 
0.128858104348183 -0.00580931501463056 
0.128584995865822 -0.0163576751947403 
0.127829477190971 -0.0141161447390914 
0.12715545296669 -0.0088310968130827 
0.126252695918083 0.00235147075727582 
0.125641018152237 0.00628411816433072 
0.12487717717886 0.00140755402389914 
0.124079443514347 -0.0103952838107944 
0.123145639896393 -0.0116329304873943 
0.121975675225258 -0.0123386839404702 
0.120835170149803 -0.0057029165327549 
0.11948798596859 -0.00575893744826317 
0.11844914406538 -0.00839872565120459 
0.11723916977644 -0.0114853670820594 
0.116312280297279 -0.0161155369132757 
0.11553780734539 -0.0144314654171467 
0.115102961659431 -0.00862492341548204 
0.114809729158878 -0.00591291813179851 
0.114275604486465 -0.0054466724395752 
0.113753579556942 -0.0106572797521949 
0.112860985100269 -0.010649518109858 
0.111715689301491 -0.0127872107550502 
0.109923094511032 -0.00881685595959425 
0.108197279274464 -0.0120715703815222 
0.1063427105546 -0.0130316754803061 
0.104244120419025 -0.0146136386319995 
0.101907588541508 -0.0126306507736444 
0.0995619669556618 -0.00931446626782417 
0.0973246321082115 -0.01125184353441 
0.0952793210744858 -0.00912620779126883 
0.0931077152490616 -0.0133194075897336 
0.0913273468613625 -0.0137334913015366 
0.089336022734642 -0.00720181316137314 
0.0872194394469261 0.00471294485032558 
0.0851555243134499 0.0130511960014701 
0.0827392861247063 0.0107820369303226 
0.0803430452942848 0.0111384354531765 
0.0776009559631348 0.00772634567692876 
0.0747860074043274 0.0102586895227432 
0.071912482380867 0.0110018998384476 
0.0691052004694939 0.0143994800746441 
0.0662278458476067 0.0175158344209194 
0.063261367380619 0.0190656818449497 
0.060089323669672 0.0236602853983641 
0.0569443143904209 0.0257072634994984 
0.0538143254816532 0.0312995575368404 
0.0504130013287067 0.0359194204211235 
0.0470811277627945 0.043193556368351 
0.0436958335340023 0.0476426891982555 
0.0405026935040951 0.0519476719200611 
0.0371703021228313 0.0500157102942467 
0.0339421890676022 0.0522895567119122 
0.0307410806417465 0.0521925464272499 
0.0276971161365509 0.05630187317729 
0.0246575344353914 0.0556477420032024 
0.0218151565641165 0.0574095584452152 
0.0191690344363451 0.0544257685542107 
0.016710514202714 0.0520622730255127 
0.0142681701108813 0.04780562967062 
0.0119050918146968 0.0434096232056618 
0.00975112989544868 0.0383551716804504 
0.00789497420191765 0.0328672118484974 
0.00634646927937865 0.0283473115414381 
0.00507363770157099 0.0234727375209332 
0.00402945885434747 0.0197639092803001 
0.00312948576174676 0.0153569132089615 
0.00238312291912735 0.01149289496243 
0.0017864543478936 0.00762612093240023 
0.00137230136897415 0.00536005338653922 
0.00104800285771489 0.003540413454175 
0.000841130036860704 0.00268499553203583 
0.000652979069855064 0.0014813719317317 
0.000516077852807939 0.00102847337257117 
0.00038883276283741 0.000238959517446347 
0.00032274701516144 -3.4040891478071e-05 
0.000271272903773934 -0.00013682477583643 
0.00020421358931344 -0.000361944024916738 
0.000144605292007327 -0.000643615203443915 
0.000110175089503173 -0.000686471001245081 
0.000114512033178471 -0.00023850955767557 
9.42739934544079e-05 0.000107041159935761 
9.29796224227175e-05 0.000418837618781254 
7.65325021347962e-05 0.000521601992659271 
8.98746366146952e-05 0.00057322543580085 
8.02744179964066e-05 0.000227562966756523 
6.21237559244037e-05 -0.000120923497888725 
4.46313315478619e-05 -9.83196368906647e-05 
3.60102494596504e-05 -0.000244990835199133 
2.15180207305821e-05 -0.000453868677141145 
2.12210306926863e-05 -0.000394678267184645 
1.88609737961087e-05 -0.000270526245003566 
3.67467764590401e-05 0.00010307247430319 
3.54719304596074e-05 9.5294693892356e-05 
3.09646129608154e-05 0.000128147934447043 
1.98946054297267e-05 0.0003183190128766 
1.98220022866735e-05 0.000414250738685951 
1.86424949788488e-05 0.000418626063037664 
2.3114402210922e-05 0.000133636902319267 
2.23236584133701e-05 0.000111889923573472 
1.82334606506629e-05 -1.94880340131931e-05 
2.11619244510075e-05 0.000110399196273647 
