#,version,,,,,,,,,,,,,,,,,,,,,,,,,,,,,,,,,,,,,,,,,,,,,,,,,,,,,,,,,
2021,5,26,1,,,,,,,,,,,,,,,,,,,,,,,,,,,,,,,,,,,,,,,,,,,,,,,,,,,,,,,
#,row_col_num,,,,,,,,,,,,,,,,,,,,,,,,,,,,,,,,,,,,,,,,,,,,,,,,,,,,,,,,,
40,19,,,,,,,,,,,,,,,,,,,,,,,,,,,,,,,,,,,,,,,,,,,,,,,,,,,,,,,,,
#,noise,,,,,,,,,,,,,,,,,,,,,,,,,,,,,,,,,,,,,,,,,,,,,,,,,,,,,,,,,
-500,500,,,,,,,,,,,,,,,,,,,,,,,,,,,,,,,,,,,,,,,,,,,,,,,,,,,,,,,,,
#,raw_max,,,,,,,,,,,,,,,,,,,,,,,,,,,,,,,,,,,,,,,,,,,,,,,,,,,,,,,,,
4241,4090,4100,4100,4100,4100,4032,4012,4001,3995,3969,3961,3935,3913,3905,3874,3858,3783,3763,,,,,,,,,,,,,,,,,,,,,,,,,,,,,,,,,,,,,,,,
3869,4014,4100,4100,4100,4100,3934,4016,4012,4011,4007,4002,3995,3982,3972,3955,3953,3927,3702,,,,,,,,,,,,,,,,,,,,,,,,,,,,,,,,,,,,,,,,
3886,3849,3808,3827,3848,3788,3852,3833,3831,3827,3823,3818,3809,3797,3785,3767,3764,3731,3727,,,,,,,,,,,,,,,,,,,,,,,,,,,,,,,,,,,,,,,,
3866,3821,3805,3803,3821,3822,3822,3827,3825,3821,3815,3808,3801,3791,3781,3760,3755,3720,3720,,,,,,,,,,,,,,,,,,,,,,,,,,,,,,,,,,,,,,,,
3899,3828,3815,3803,3821,3813,3834,3831,3827,3856,3821,3823,3811,3798,3791,3769,3764,3727,3761,,,,,,,,,,,,,,,,,,,,,,,,,,,,,,,,,,,,,,,,
3879,3836,3842,3820,3840,3831,3839,3843,3844,3841,3837,3829,3821,3808,3799,3778,3772,3735,3737,,,,,,,,,,,,,,,,,,,,,,,,,,,,,,,,,,,,,,,,
3877,3839,3825,3820,3839,3849,3839,3844,3847,3844,3838,3833,3823,3810,3798,3777,3772,3737,3736,,,,,,,,,,,,,,,,,,,,,,,,,,,,,,,,,,,,,,,,
3882,3844,3829,3818,3837,3828,3847,3844,3854,3852,3866,3839,3829,3817,3805,3786,3778,3743,3745,,,,,,,,,,,,,,,,,,,,,,,,,,,,,,,,,,,,,,,,
3872,3837,3822,3810,3830,3821,3841,3836,3835,3854,3830,3832,3819,3807,3796,3774,3768,3733,3734,,,,,,,,,,,,,,,,,,,,,,,,,,,,,,,,,,,,,,,,
3685,3655,3639,3628,3645,3636,3653,3650,3650,3649,3641,3636,3629,3632,3610,3592,3587,3553,3553,,,,,,,,,,,,,,,,,,,,,,,,,,,,,,,,,,,,,,,,
3714,3682,3669,3657,3672,3662,3682,3679,3678,3679,3673,3693,3655,3650,3641,3620,3615,3581,3584,,,,,,,,,,,,,,,,,,,,,,,,,,,,,,,,,,,,,,,,
3865,3835,3816,3804,3820,3813,3842,3829,3827,3828,3820,3814,3804,3790,3791,3770,3767,3729,3730,,,,,,,,,,,,,,,,,,,,,,,,,,,,,,,,,,,,,,,,
3863,3831,3820,3818,3847,3816,3835,3842,3842,3842,3835,3831,3818,3807,3800,3777,3773,3738,3740,,,,,,,,,,,,,,,,,,,,,,,,,,,,,,,,,,,,,,,,
3850,3826,3819,3834,3820,3812,3835,3840,3840,3839,3831,3826,3818,3804,3795,3774,3771,3735,3740,,,,,,,,,,,,,,,,,,,,,,,,,,,,,,,,,,,,,,,,
3864,3836,3821,3810,3827,3818,3847,3864,3845,3843,3838,3834,3823,3822,3812,3790,3789,3752,3754,,,,,,,,,,,,,,,,,,,,,,,,,,,,,,,,,,,,,,,,
3836,3811,3799,3788,3805,3798,3816,3833,3823,3824,3820,3814,3805,3793,3783,3763,3758,3721,3724,,,,,,,,,,,,,,,,,,,,,,,,,,,,,,,,,,,,,,,,
3804,3777,3766,3755,3770,3765,3784,3783,3801,3794,3778,3783,3772,3761,3752,3730,3727,3691,3695,,,,,,,,,,,,,,,,,,,,,,,,,,,,,,,,,,,,,,,,
3523,3498,3489,3477,3492,3485,3504,3502,3502,3503,3498,3497,3486,3484,3476,3457,3455,3419,3425,,,,,,,,,,,,,,,,,,,,,,,,,,,,,,,,,,,,,,,,
3792,3766,3755,3741,3756,3752,3760,3767,3770,3770,3764,3759,3751,3739,3750,3723,3717,3681,3686,,,,,,,,,,,,,,,,,,,,,,,,,,,,,,,,,,,,,,,,
3811,3786,3776,3765,3780,3775,3792,3789,3789,3792,3786,3791,3792,3769,3762,3744,3742,3705,3713,,,,,,,,,,,,,,,,,,,,,,,,,,,,,,,,,,,,,,,,
3798,3773,3764,3754,3768,3763,3780,3778,3779,3781,3777,3781,3791,3761,3752,3733,3732,3697,3704,,,,,,,,,,,,,,,,,,,,,,,,,,,,,,,,,,,,,,,,
3791,3765,3755,3745,3758,3752,3759,3766,3767,3766,3761,3757,3750,3736,3730,3710,3718,3675,3688,,,,,,,,,,,,,,,,,,,,,,,,,,,,,,,,,,,,,,,,
3609,3587,3580,3570,3584,3576,3590,3589,3589,3589,3584,3600,3573,3573,3565,3545,3542,3510,3515,,,,,,,,,,,,,,,,,,,,,,,,,,,,,,,,,,,,,,,,
3764,3744,3738,3726,3738,3729,3734,3739,3740,3740,3733,3732,3722,3713,3706,3685,3692,3668,3667,,,,,,,,,,,,,,,,,,,,,,,,,,,,,,,,,,,,,,,,
3734,3711,3704,3692,3706,3697,3729,3706,3708,3707,3701,3700,3693,3683,3684,3664,3660,3625,3632,,,,,,,,,,,,,,,,,,,,,,,,,,,,,,,,,,,,,,,,
3750,3729,3717,3704,3718,3711,3712,3720,3719,3719,3714,3711,3707,3697,3689,3668,3672,3658,3648,,,,,,,,,,,,,,,,,,,,,,,,,,,,,,,,,,,,,,,,
3753,3729,3722,3709,3722,3712,3716,3723,3721,3721,3717,3714,3707,3698,3719,3681,3680,3645,3655,,,,,,,,,,,,,,,,,,,,,,,,,,,,,,,,,,,,,,,,
3770,3747,3736,3724,3735,3726,3731,3739,3736,3735,3727,3726,3719,3708,3700,3701,3689,3654,3668,,,,,,,,,,,,,,,,,,,,,,,,,,,,,,,,,,,,,,,,
3745,3721,3710,3698,3709,3701,3706,3708,3704,3706,3702,3698,3690,3684,3676,3683,3663,3634,3650,,,,,,,,,,,,,,,,,,,,,,,,,,,,,,,,,,,,,,,,
3765,3717,3707,3698,3707,3698,3702,3707,3705,3702,3698,3696,3690,3683,3676,3659,3666,3627,3649,,,,,,,,,,,,,,,,,,,,,,,,,,,,,,,,,,,,,,,,
3732,3729,3700,3689,3701,3689,3691,3697,3695,3694,3691,3691,3681,3674,3667,3647,3655,3619,3642,,,,,,,,,,,,,,,,,,,,,,,,,,,,,,,,,,,,,,,,
3733,3723,3702,3691,3704,3694,3693,3699,3703,3700,3691,3692,3687,3677,3669,3649,3659,3619,3644,,,,,,,,,,,,,,,,,,,,,,,,,,,,,,,,,,,,,,,,
3730,3704,3701,3690,3701,3694,3696,3700,3702,3700,3695,3696,3690,3679,3670,3652,3654,3624,3648,,,,,,,,,,,,,,,,,,,,,,,,,,,,,,,,,,,,,,,,
3705,3675,3677,3669,3680,3675,3678,3681,3682,3682,3677,3676,3669,3659,3650,3632,3661,3603,3628,,,,,,,,,,,,,,,,,,,,,,,,,,,,,,,,,,,,,,,,
3721,3686,3688,3681,3693,3685,3689,3695,3693,3694,3689,3688,3682,3672,3664,3645,3665,3615,3641,,,,,,,,,,,,,,,,,,,,,,,,,,,,,,,,,,,,,,,,
3571,3536,3534,3527,3540,3533,3537,3544,3539,3538,3532,3534,3524,3516,3508,3488,3492,3465,3508,,,,,,,,,,,,,,,,,,,,,,,,,,,,,,,,,,,,,,,,
3580,3543,3542,3534,3546,3541,3545,3551,3547,3549,3539,3542,3533,3525,3516,3496,3499,3470,3513,,,,,,,,,,,,,,,,,,,,,,,,,,,,,,,,,,,,,,,,
3748,3702,3691,3685,3695,3688,3693,3699,3698,3696,3690,3691,3683,3672,3663,3642,3654,3615,3638,,,,,,,,,,,,,,,,,,,,,,,,,,,,,,,,,,,,,,,,
3632,3759,3740,3735,3746,3742,3746,3752,3751,3749,3743,3742,3735,3726,3716,3693,3703,3669,3541,,,,,,,,,,,,,,,,,,,,,,,,,,,,,,,,,,,,,,,,
4382,3458,3432,3448,3448,3444,3450,3441,3453,3453,3437,3434,3414,3387,3385,3364,3351,3335,4173,,,,,,,,,,,,,,,,,,,,,,,,,,,,,,,,,,,,,,,,
#,raw_min,,,,,,,,,,,,,,,,,,,,,,,,,,,,,,,,,,,,,,,,,,,,,,,,,,,,,,,,,
58,1273,897,799,944,820,1268,1267,1268,1262,1242,1240,1227,1219,1214,1199,1184,1132,50,,,,,,,,,,,,,,,,,,,,,,,,,,,,,,,,,,,,,,,,
1372,1448,350,350,350,350,1421,1498,1504,1498,1497,1499,1496,1499,1500,1500,1496,1488,1315,,,,,,,,,,,,,,,,,,,,,,,,,,,,,,,,,,,,,,,,
1485,1459,1439,1458,1473,1432,1477,1464,1475,1471,1460,1471,1469,1466,1465,1475,1469,1452,1444,,,,,,,,,,,,,,,,,,,,,,,,,,,,,,,,,,,,,,,,
1463,1438,1432,1441,1453,1454,1455,1457,1459,1453,1455,1458,1452,1454,1448,1449,1444,1433,1428,,,,,,,,,,,,,,,,,,,,,,,,,,,,,,,,,,,,,,,,
1493,1457,1453,1452,1470,1467,1476,1467,1465,1487,1464,1471,1468,1469,1474,1468,1458,1453,1468,,,,,,,,,,,,,,,,,,,,,,,,,,,,,,,,,,,,,,,,
1483,1464,1477,1467,1480,1478,1482,1480,1481,1479,1473,1474,1472,1475,1472,1471,1465,1452,1455,,,,,,,,,,,,,,,,,,,,,,,,,,,,,,,,,,,,,,,,
1446,1429,1427,1432,1440,1451,1443,1439,1441,1443,1434,1437,1433,1434,1433,1431,1435,1426,1413,,,,,,,,,,,,,,,,,,,,,,,,,,,,,,,,,,,,,,,,
1464,1446,1435,1445,1453,1442,1459,1448,1461,1464,1467,1455,1456,1459,1454,1454,1454,1441,1441,,,,,,,,,,,,,,,,,,,,,,,,,,,,,,,,,,,,,,,,
1473,1451,1447,1444,1456,1447,1460,1457,1463,1476,1451,1461,1469,1464,1466,1463,1455,1450,1441,,,,,,,,,,,,,,,,,,,,,,,,,,,,,,,,,,,,,,,,
1411,1388,1383,1384,1385,1382,1399,1397,1394,1397,1391,1396,1382,1403,1398,1394,1396,1380,1379,,,,,,,,,,,,,,,,,,,,,,,,,,,,,,,,,,,,,,,,
1420,1399,1396,1389,1402,1397,1412,1410,1408,1405,1402,1430,1406,1408,1413,1410,1407,1397,1395,,,,,,,,,,,,,,,,,,,,,,,,,,,,,,,,,,,,,,,,
1431,1413,1409,1407,1411,1409,1432,1420,1418,1415,1415,1417,1413,1412,1425,1421,1413,1412,1406,,,,,,,,,,,,,,,,,,,,,,,,,,,,,,,,,,,,,,,,
1430,1415,1404,1408,1428,1407,1428,1426,1429,1423,1413,1421,1425,1424,1421,1417,1416,1402,1406,,,,,,,,,,,,,,,,,,,,,,,,,,,,,,,,,,,,,,,,
1454,1437,1424,1453,1438,1433,1444,1448,1448,1443,1439,1445,1443,1442,1446,1441,1434,1420,1425,,,,,,,,,,,,,,,,,,,,,,,,,,,,,,,,,,,,,,,,
1423,1412,1396,1392,1399,1393,1421,1428,1411,1409,1405,1410,1406,1414,1415,1416,1410,1400,1397,,,,,,,,,,,,,,,,,,,,,,,,,,,,,,,,,,,,,,,,
1435,1423,1414,1411,1423,1420,1435,1441,1435,1428,1427,1432,1428,1428,1431,1428,1430,1421,1416,,,,,,,,,,,,,,,,,,,,,,,,,,,,,,,,,,,,,,,,
1432,1421,1411,1411,1423,1414,1427,1422,1440,1426,1421,1434,1426,1424,1428,1426,1421,1413,1412,,,,,,,,,,,,,,,,,,,,,,,,,,,,,,,,,,,,,,,,
1377,1371,1364,1363,1364,1364,1377,1375,1371,1377,1374,1371,1370,1382,1380,1379,1377,1366,1368,,,,,,,,,,,,,,,,,,,,,,,,,,,,,,,,,,,,,,,,
1403,1388,1385,1383,1388,1390,1392,1396,1402,1395,1395,1397,1390,1396,1411,1401,1397,1389,1388,,,,,,,,,,,,,,,,,,,,,,,,,,,,,,,,,,,,,,,,
1438,1428,1429,1426,1437,1432,1442,1438,1440,1438,1439,1447,1451,1442,1448,1443,1436,1435,1435,,,,,,,,,,,,,,,,,,,,,,,,,,,,,,,,,,,,,,,,
1436,1432,1424,1416,1437,1429,1442,1441,1444,1430,1433,1447,1461,1446,1445,1439,1436,1428,1431,,,,,,,,,,,,,,,,,,,,,,,,,,,,,,,,,,,,,,,,
1406,1397,1387,1380,1402,1396,1400,1398,1401,1402,1396,1405,1402,1403,1398,1398,1409,1393,1399,,,,,,,,,,,,,,,,,,,,,,,,,,,,,,,,,,,,,,,,
1384,1381,1375,1376,1383,1382,1391,1388,1385,1386,1388,1399,1388,1395,1391,1392,1390,1378,1379,,,,,,,,,,,,,,,,,,,,,,,,,,,,,,,,,,,,,,,,
1385,1382,1374,1377,1377,1377,1383,1383,1380,1380,1380,1386,1389,1387,1390,1389,1384,1390,1381,,,,,,,,,,,,,,,,,,,,,,,,,,,,,,,,,,,,,,,,
1390,1391,1380,1382,1390,1387,1415,1386,1383,1396,1390,1393,1389,1391,1404,1401,1395,1393,1397,,,,,,,,,,,,,,,,,,,,,,,,,,,,,,,,,,,,,,,,
1397,1383,1380,1377,1389,1380,1384,1387,1388,1389,1384,1397,1393,1393,1395,1389,1395,1406,1397,,,,,,,,,,,,,,,,,,,,,,,,,,,,,,,,,,,,,,,,
1389,1383,1374,1371,1379,1380,1378,1379,1380,1377,1383,1386,1389,1391,1408,1394,1387,1380,1389,,,,,,,,,,,,,,,,,,,,,,,,,,,,,,,,,,,,,,,,
1425,1420,1414,1412,1421,1418,1419,1416,1415,1423,1418,1423,1425,1425,1421,1435,1426,1425,1432,,,,,,,,,,,,,,,,,,,,,,,,,,,,,,,,,,,,,,,,
1385,1381,1380,1373,1380,1379,1384,1378,1375,1381,1376,1375,1380,1381,1384,1406,1387,1382,1386,,,,,,,,,,,,,,,,,,,,,,,,,,,,,,,,,,,,,,,,
1389,1365,1359,1355,1355,1357,1359,1357,1355,1355,1351,1354,1362,1352,1356,1363,1367,1355,1362,,,,,,,,,,,,,,,,,,,,,,,,,,,,,,,,,,,,,,,,
1328,1336,1317,1317,1332,1326,1317,1323,1321,1321,1318,1324,1324,1321,1329,1324,1325,1311,1326,,,,,,,,,,,,,,,,,,,,,,,,,,,,,,,,,,,,,,,,
1384,1385,1372,1373,1383,1377,1376,1379,1374,1374,1374,1374,1379,1374,1382,1379,1388,1374,1387,,,,,,,,,,,,,,,,,,,,,,,,,,,,,,,,,,,,,,,,
1397,1380,1386,1390,1395,1390,1392,1393,1388,1390,1392,1396,1387,1385,1390,1392,1384,1383,1399,,,,,,,,,,,,,,,,,,,,,,,,,,,,,,,,,,,,,,,,
1382,1374,1363,1369,1378,1373,1370,1366,1373,1368,1369,1370,1370,1371,1369,1371,1395,1371,1382,,,,,,,,,,,,,,,,,,,,,,,,,,,,,,,,,,,,,,,,
1378,1370,1367,1371,1372,1370,1367,1365,1364,1367,1370,1373,1370,1371,1372,1367,1380,1365,1382,,,,,,,,,,,,,,,,,,,,,,,,,,,,,,,,,,,,,,,,
1336,1326,1328,1324,1323,1324,1327,1320,1323,1330,1324,1324,1329,1331,1324,1322,1326,1328,1345,,,,,,,,,,,,,,,,,,,,,,,,,,,,,,,,,,,,,,,,
1350,1337,1331,1333,1337,1332,1335,1333,1327,1334,1337,1330,1334,1332,1339,1331,1332,1333,1362,,,,,,,,,,,,,,,,,,,,,,,,,,,,,,,,,,,,,,,,
1374,1350,1342,1342,1350,1347,1345,1346,1344,1347,1347,1346,1338,1340,1342,1343,1350,1338,1351,,,,,,,,,,,,,,,,,,,,,,,,,,,,,,,,,,,,,,,,
1255,1378,1365,1357,1368,1364,1357,1365,1365,1365,1361,1360,1364,1356,1358,1359,1368,1361,1236,,,,,,,,,,,,,,,,,,,,,,,,,,,,,,,,,,,,,,,,
75,1049,1041,1049,1035,1043,1043,1032,1045,1040,1036,1032,1022,1015,1017,1019,1005,988,77,,,,,,,,,,,,,,,,,,,,,,,,,,,,,,,,,,,,,,,,
#,raw_row_delta_max,,,,,,,,,,,,,,,,,,,,,,,,,,,,,,,,,,,,,,,,,,,,,,,,,,,,,,,,,
2500,3000,3000,3000,3000,3000,686,741,742,737,748,752,754,756,764,762,787,835,2500,,,,,,,,,,,,,,,,,,,,,,,,,,,,,,,,,,,,,,,,
616,3000,3000,3000,3000,3000,551,503,513,506,502,510,509,513,508,511,514,492,624,,,,,,,,,,,,,,,,,,,,,,,,,,,,,,,,,,,,,,,,
573,568,558,548,547,567,557,574,576,577,574,574,575,570,571,580,577,571,583,,,,,,,,,,,,,,,,,,,,,,,,,,,,,,,,,,,,,,,,
562,558,563,559,561,562,559,561,562,565,566,556,576,567,562,562,563,569,560,,,,,,,,,,,,,,,,,,,,,,,,,,,,,,,,,,,,,,,,
556,557,559,556,553,555,559,555,555,561,563,567,553,569,568,565,566,582,567,,,,,,,,,,,,,,,,,,,,,,,,,,,,,,,,,,,,,,,,
582,581,583,582,583,580,582,585,578,579,585,583,586,584,580,582,581,574,591,,,,,,,,,,,,,,,,,,,,,,,,,,,,,,,,,,,,,,,,
571,577,579,580,579,578,575,582,570,571,579,589,578,575,580,571,571,574,560,,,,,,,,,,,,,,,,,,,,,,,,,,,,,,,,,,,,,,,,
569,567,564,565,569,563,564,568,565,568,567,550,570,570,566,568,570,568,570,,,,,,,,,,,,,,,,,,,,,,,,,,,,,,,,,,,,,,,,
617,612,610,610,610,611,609,609,611,604,609,614,602,613,615,611,609,612,614,,,,,,,,,,,,,,,,,,,,,,,,,,,,,,,,,,,,,,,,
640,632,638,636,631,635,636,636,630,638,654,641,636,632,639,638,635,638,642,,,,,,,,,,,,,,,,,,,,,,,,,,,,,,,,,,,,,,,,
742,730,731,734,733,734,739,735,730,737,718,733,726,726,729,728,727,730,734,,,,,,,,,,,,,,,,,,,,,,,,,,,,,,,,,,,,,,,,
666,656,656,660,664,664,655,660,667,666,663,662,662,666,665,670,665,662,662,,,,,,,,,,,,,,,,,,,,,,,,,,,,,,,,,,,,,,,,
569,568,568,567,574,574,572,568,567,576,566,566,571,580,566,559,566,564,567,,,,,,,,,,,,,,,,,,,,,,,,,,,,,,,,,,,,,,,,
556,550,554,555,552,549,554,558,557,551,552,558,554,534,549,546,560,549,549,,,,,,,,,,,,,,,,,,,,,,,,,,,,,,,,,,,,,,,,
544,552,551,549,548,551,550,549,548,554,555,559,558,553,549,547,545,548,554,,,,,,,,,,,,,,,,,,,,,,,,,,,,,,,,,,,,,,,,
556,548,555,556,555,555,556,556,558,559,557,551,551,552,558,558,543,552,556,,,,,,,,,,,,,,,,,,,,,,,,,,,,,,,,,,,,,,,,
568,566,564,567,569,570,568,571,570,567,565,570,563,570,560,568,570,569,650,,,,,,,,,,,,,,,,,,,,,,,,,,,,,,,,,,,,,,,,
737,735,733,734,738,739,737,749,732,740,740,735,733,728,736,727,730,732,736,,,,,,,,,,,,,,,,,,,,,,,,,,,,,,,,,,,,,,,,
651,647,640,640,646,650,652,645,651,653,645,646,647,638,645,643,641,640,647,,,,,,,,,,,,,,,,,,,,,,,,,,,,,,,,,,,,,,,,
556,551,553,555,558,556,552,556,558,555,552,555,560,554,554,558,554,552,552,,,,,,,,,,,,,,,,,,,,,,,,,,,,,,,,,,,,,,,,
673,671,666,662,670,662,672,669,671,659,668,675,666,673,671,671,665,669,672,,,,,,,,,,,,,,,,,,,,,,,,,,,,,,,,,,,,,,,,
563,563,561,570,562,570,572,572,575,567,580,568,564,574,569,567,562,563,559,,,,,,,,,,,,,,,,,,,,,,,,,,,,,,,,,,,,,,,,
724,718,725,728,720,715,716,717,717,718,710,722,720,721,721,721,722,716,724,,,,,,,,,,,,,,,,,,,,,,,,,,,,,,,,,,,,,,,,
566,552,558,550,551,563,569,557,552,556,553,554,553,547,545,551,552,549,552,,,,,,,,,,,,,,,,,,,,,,,,,,,,,,,,,,,,,,,,
588,583,581,586,581,573,559,571,576,575,574,574,570,571,574,573,572,574,571,,,,,,,,,,,,,,,,,,,,,,,,,,,,,,,,,,,,,,,,
577,578,564,554,566,565,556,579,559,552,562,568,561,559,563,562,561,567,566,,,,,,,,,,,,,,,,,,,,,,,,,,,,,,,,,,,,,,,,
608,559,553,550,550,561,553,535,553,552,543,549,554,557,555,554,559,557,552,,,,,,,,,,,,,,,,,,,,,,,,,,,,,,,,,,,,,,,,
622,579,563,567,559,563,558,564,560,557,549,554,553,557,556,558,556,561,566,,,,,,,,,,,,,,,,,,,,,,,,,,,,,,,,,,,,,,,,
598,577,572,570,573,549,562,569,566,566,565,568,570,567,567,572,574,567,565,,,,,,,,,,,,,,,,,,,,,,,,,,,,,,,,,,,,,,,,
560,548,573,557,554,551,557,555,546,547,551,550,545,542,538,541,546,546,544,,,,,,,,,,,,,,,,,,,,,,,,,,,,,,,,,,,,,,,,
582,575,563,565,568,571,569,578,578,567,566,569,565,566,564,566,561,568,566,,,,,,,,,,,,,,,,,,,,,,,,,,,,,,,,,,,,,,,,
573,559,546,558,549,560,557,584,580,558,551,550,551,553,554,551,557,560,555,,,,,,,,,,,,,,,,,,,,,,,,,,,,,,,,,,,,,,,,
572,559,559,558,572,563,559,554,556,554,552,555,557,560,558,556,555,564,564,,,,,,,,,,,,,,,,,,,,,,,,,,,,,,,,,,,,,,,,
580,585,582,587,587,581,587,584,587,585,582,581,580,581,587,592,582,584,587,,,,,,,,,,,,,,,,,,,,,,,,,,,,,,,,,,,,,,,,
549,549,534,536,534,530,529,537,532,532,536,539,538,535,525,539,538,529,543,,,,,,,,,,,,,,,,,,,,,,,,,,,,,,,,,,,,,,,,
556,558,557,559,563,560,554,564,566,561,560,559,559,558,563,559,560,561,558,,,,,,,,,,,,,,,,,,,,,,,,,,,,,,,,,,,,,,,,
640,611,624,617,624,619,616,618,618,621,616,618,616,616,620,614,618,616,618,,,,,,,,,,,,,,,,,,,,,,,,,,,,,,,,,,,,,,,,
482,574,572,578,580,570,573,581,572,572,573,579,576,570,573,574,571,579,502,,,,,,,,,,,,,,,,,,,,,,,,,,,,,,,,,,,,,,,,
2500,669,656,669,655,666,656,658,669,668,662,657,649,641,634,650,649,643,2500,,,,,,,,,,,,,,,,,,,,,,,,,,,,,,,,,,,,,,,,
#,raw_row_delta_min,,,,,,,,,,,,,,,,,,,,,,,,,,,,,,,,,,,,,,,,,,,,,,,,,,,,,,,,,
-2500,-3000,-3000,-3000,-3000,-3000,-837,-893,-891,-891,-880,-875,-972,-865,-859,-868,-950,-998,-2500,,,,,,,,,,,,,,,,,,,,,,,,,,,,,,,,,,,,,,,,
-492,-3000,-3000,-3000,-3000,-3000,-543,-580,-584,-581,-582,-581,-585,-581,-584,-593,-588,-610,-487,,,,,,,,,,,,,,,,,,,,,,,,,,,,,,,,,,,,,,,,
-538,-548,-541,-547,-563,-532,-546,-531,-537,-532,-531,-531,-532,-536,-532,-529,-535,-534,-525,,,,,,,,,,,,,,,,,,,,,,,,,,,,,,,,,,,,,,,,
-530,-532,-533,-530,-534,-529,-532,-528,-530,-526,-532,-538,-519,-535,-541,-543,-537,-533,-537,,,,,,,,,,,,,,,,,,,,,,,,,,,,,,,,,,,,,,,,
-514,-518,-513,-514,-515,-514,-515,-514,-512,-516,-515,-512,-526,-512,-508,-510,-509,-505,-511,,,,,,,,,,,,,,,,,,,,,,,,,,,,,,,,,,,,,,,,
-533,-529,-530,-530,-528,-531,-525,-528,-527,-527,-527,-530,-528,-529,-526,-528,-530,-535,-514,,,,,,,,,,,,,,,,,,,,,,,,,,,,,,,,,,,,,,,,
-523,-523,-525,-521,-523,-518,-522,-524,-525,-524,-523,-514,-526,-531,-524,-530,-529,-526,-541,,,,,,,,,,,,,,,,,,,,,,,,,,,,,,,,,,,,,,,,
-545,-543,-539,-542,-541,-546,-541,-541,-541,-541,-539,-555,-533,-543,-551,-543,-543,-543,-543,,,,,,,,,,,,,,,,,,,,,,,,,,,,,,,,,,,,,,,,
-605,-600,-601,-602,-600,-599,-597,-594,-590,-600,-599,-595,-608,-599,-599,-595,-596,-595,-599,,,,,,,,,,,,,,,,,,,,,,,,,,,,,,,,,,,,,,,,
-595,-589,-593,-591,-591,-591,-593,-590,-593,-590,-579,-590,-588,-589,-586,-589,-591,-591,-592,,,,,,,,,,,,,,,,,,,,,,,,,,,,,,,,,,,,,,,,
-507,-502,-501,-505,-504,-504,-498,-508,-514,-509,-520,-505,-502,-501,-505,-502,-501,-504,-505,,,,,,,,,,,,,,,,,,,,,,,,,,,,,,,,,,,,,,,,
-557,-554,-555,-555,-557,-557,-562,-556,-550,-548,-550,-546,-551,-548,-549,-543,-550,-552,-552,,,,,,,,,,,,,,,,,,,,,,,,,,,,,,,,,,,,,,,,
-543,-543,-540,-537,-539,-543,-541,-541,-541,-544,-540,-542,-542,-529,-543,-549,-541,-542,-543,,,,,,,,,,,,,,,,,,,,,,,,,,,,,,,,,,,,,,,,
-525,-525,-530,-529,-526,-521,-530,-528,-525,-531,-537,-531,-532,-552,-531,-527,-524,-530,-529,,,,,,,,,,,,,,,,,,,,,,,,,,,,,,,,,,,,,,,,
-522,-522,-523,-526,-522,-521,-522,-522,-524,-520,-518,-518,-523,-520,-520,-518,-528,-523,-517,,,,,,,,,,,,,,,,,,,,,,,,,,,,,,,,,,,,,,,,
-547,-545,-546,-549,-549,-551,-551,-551,-546,-551,-549,-548,-545,-540,-539,-549,-556,-545,-542,,,,,,,,,,,,,,,,,,,,,,,,,,,,,,,,,,,,,,,,
-617,-613,-616,-617,-616,-619,-621,-619,-618,-621,-620,-618,-621,-617,-625,-614,-614,-612,-617,,,,,,,,,,,,,,,,,,,,,,,,,,,,,,,,,,,,,,,,
-557,-561,-561,-557,-560,-560,-566,-556,-566,-559,-561,-560,-558,-557,-559,-562,-559,-559,-557,,,,,,,,,,,,,,,,,,,,,,,,,,,,,,,,,,,,,,,,
-561,-560,-557,-562,-561,-564,-555,-567,-559,-555,-561,-561,-559,-562,-561,-554,-556,-560,-560,,,,,,,,,,,,,,,,,,,,,,,,,,,,,,,,,,,,,,,,
-529,-532,-529,-535,-534,-534,-533,-534,-535,-526,-534,-535,-535,-530,-532,-535,-529,-528,-533,,,,,,,,,,,,,,,,,,,,,,,,,,,,,,,,,,,,,,,,
-560,-560,-561,-562,-559,-567,-573,-570,-570,-576,-568,-567,-558,-561,-561,-559,-557,-567,-565,,,,,,,,,,,,,,,,,,,,,,,,,,,,,,,,,,,,,,,,
-630,-630,-631,-629,-633,-623,-624,-622,-626,-632,-622,-629,-622,-631,-627,-627,-625,-625,-621,,,,,,,,,,,,,,,,,,,,,,,,,,,,,,,,,,,,,,,,
-497,-501,-500,-497,-497,-502,-502,-503,-509,-496,-508,-502,-502,-499,-503,-505,-507,-501,-506,,,,,,,,,,,,,,,,,,,,,,,,,,,,,,,,,,,,,,,,
-546,-540,-544,-550,-542,-537,-527,-534,-539,-543,-541,-542,-540,-539,-536,-542,-548,-541,-537,,,,,,,,,,,,,,,,,,,,,,,,,,,,,,,,,,,,,,,,
-540,-530,-518,-508,-522,-523,-535,-521,-520,-516,-516,-519,-515,-518,-516,-518,-514,-517,-515,,,,,,,,,,,,,,,,,,,,,,,,,,,,,,,,,,,,,,,,
-542,-548,-537,-544,-534,-528,-533,-521,-533,-532,-535,-534,-532,-531,-536,-534,-536,-535,-531,,,,,,,,,,,,,,,,,,,,,,,,,,,,,,,,,,,,,,,,
-563,-534,-532,-535,-534,-530,-537,-549,-536,-532,-534,-536,-532,-535,-534,-533,-533,-532,-533,,,,,,,,,,,,,,,,,,,,,,,,,,,,,,,,,,,,,,,,
-578,-546,-529,-531,-526,-523,-530,-536,-532,-529,-527,-527,-525,-525,-529,-528,-531,-530,-531,,,,,,,,,,,,,,,,,,,,,,,,,,,,,,,,,,,,,,,,
-529,-532,-537,-539,-538,-547,-534,-535,-533,-533,-539,-538,-534,-532,-535,-537,-536,-533,-531,,,,,,,,,,,,,,,,,,,,,,,,,,,,,,,,,,,,,,,,
-565,-525,-528,-527,-521,-522,-530,-527,-519,-519,-522,-524,-520,-520,-518,-520,-520,-521,-519,,,,,,,,,,,,,,,,,,,,,,,,,,,,,,,,,,,,,,,,
-525,-526,-531,-526,-529,-529,-528,-550,-544,-530,-527,-525,-525,-529,-529,-524,-523,-525,-527,,,,,,,,,,,,,,,,,,,,,,,,,,,,,,,,,,,,,,,,
-536,-531,-539,-530,-533,-530,-531,-527,-529,-530,-528,-528,-527,-529,-524,-527,-526,-532,-530,,,,,,,,,,,,,,,,,,,,,,,,,,,,,,,,,,,,,,,,
-535,-531,-531,-534,-516,-536,-532,-536,-534,-537,-536,-530,-534,-538,-536,-533,-537,-532,-530,,,,,,,,,,,,,,,,,,,,,,,,,,,,,,,,,,,,,,,,
-522,-529,-540,-537,-539,-532,-535,-536,-539,-537,-532,-536,-536,-535,-535,-544,-536,-533,-538,,,,,,,,,,,,,,,,,,,,,,,,,,,,,,,,,,,,,,,,
-591,-581,-587,-592,-601,-590,-586,-588,-587,-586,-593,-591,-590,-588,-588,-591,-589,-588,-591,,,,,,,,,,,,,,,,,,,,,,,,,,,,,,,,,,,,,,,,
-525,-528,-526,-530,-531,-527,-526,-531,-532,-530,-528,-530,-530,-529,-529,-528,-527,-531,-531,,,,,,,,,,,,,,,,,,,,,,,,,,,,,,,,,,,,,,,,
-459,-482,-468,-473,-470,-471,-472,-471,-468,-472,-468,-467,-470,-469,-467,-469,-476,-468,-467,,,,,,,,,,,,,,,,,,,,,,,,,,,,,,,,,,,,,,,,
-599,-497,-502,-505,-500,-501,-506,-505,-503,-502,-500,-507,-508,-499,-500,-502,-502,-499,-584,,,,,,,,,,,,,,,,,,,,,,,,,,,,,,,,,,,,,,,,
-2500,-790,-797,-777,-790,-777,-784,-797,-781,-783,-791,-799,-805,-802,-807,-813,-818,-817,-2500,,,,,,,,,,,,,,,,,,,,,,,,,,,,,,,,,,,,,,,,
#,raw_col_delta_max,,,,,,,,,,,,,,,,,,,,,,,,,,,,,,,,,,,,,,,,,,,,,,,,,,,,,,,,,
2500,3000,3000,3000,3000,3000,551,584,555,549,593,557,550,540,566,550,520,2500,,,,,,,,,,,,,,,,,,,,,,,,,,,,,,,,,,,,,,,,,
639,3000,3000,3000,3000,3000,599,582,558,568,598,559,551,554,567,572,556,487,,,,,,,,,,,,,,,,,,,,,,,,,,,,,,,,,,,,,,,,,
553,575,578,588,559,570,545,589,554,567,600,560,567,546,562,577,542,609,,,,,,,,,,,,,,,,,,,,,,,,,,,,,,,,,,,,,,,,,
547,574,587,575,581,563,560,591,554,574,601,565,559,555,567,568,542,625,,,,,,,,,,,,,,,,,,,,,,,,,,,,,,,,,,,,,,,,,
540,572,577,581,580,561,566,593,559,571,595,579,544,551,563,569,545,612,,,,,,,,,,,,,,,,,,,,,,,,,,,,,,,,,,,,,,,,,
539,571,573,581,580,560,562,591,555,570,594,561,558,549,563,576,557,614,,,,,,,,,,,,,,,,,,,,,,,,,,,,,,,,,,,,,,,,,
542,569,584,578,583,558,557,589,557,564,596,563,562,551,565,567,543,625,,,,,,,,,,,,,,,,,,,,,,,,,,,,,,,,,,,,,,,,,
542,572,576,571,579,557,556,591,558,564,601,550,557,557,556,565,550,614,,,,,,,,,,,,,,,,,,,,,,,,,,,,,,,,,,,,,,,,,
543,565,577,579,577,559,565,588,556,565,588,569,543,547,561,564,548,611,,,,,,,,,,,,,,,,,,,,,,,,,,,,,,,,,,,,,,,,,
541,570,575,572,570,559,561,594,544,562,591,559,559,546,562,564,548,603,,,,,,,,,,,,,,,,,,,,,,,,,,,,,,,,,,,,,,,,,
539,568,571,570,572,556,557,589,553,576,579,556,557,548,560,563,542,603,,,,,,,,,,,,,,,,,,,,,,,,,,,,,,,,,,,,,,,,,
542,564,567,571,571,565,553,583,555,563,586,556,554,553,551,562,546,600,,,,,,,,,,,,,,,,,,,,,,,,,,,,,,,,,,,,,,,,,
542,566,564,566,570,557,556,584,556,563,589,553,555,549,561,559,545,603,,,,,,,,,,,,,,,,,,,,,,,,,,,,,,,,,,,,,,,,,
543,561,562,570,567,553,553,581,555,555,588,555,570,535,554,570,546,604,,,,,,,,,,,,,,,,,,,,,,,,,,,,,,,,,,,,,,,,,
535,560,566,571,567,550,557,575,549,552,590,558,548,550,556,583,534,608,,,,,,,,,,,,,,,,,,,,,,,,,,,,,,,,,,,,,,,,,
537,557,564,568,574,549,560,575,549,556,584,549,544,554,549,575,533,602,,,,,,,,,,,,,,,,,,,,,,,,,,,,,,,,,,,,,,,,,
537,557,570,561,564,552,554,574,544,557,574,554,545,554,540,558,551,601,,,,,,,,,,,,,,,,,,,,,,,,,,,,,,,,,,,,,,,,,
538,554,570,559,559,558,547,577,540,559,582,546,550,545,549,561,543,596,,,,,,,,,,,,,,,,,,,,,,,,,,,,,,,,,,,,,,,,,
533,555,560,562,557,543,561,559,553,557,581,549,549,549,547,566,543,596,,,,,,,,,,,,,,,,,,,,,,,,,,,,,,,,,,,,,,,,,
536,551,560,563,555,551,550,567,547,547,576,550,549,548,546,558,545,598,,,,,,,,,,,,,,,,,,,,,,,,,,,,,,,,,,,,,,,,,
540,552,554,558,560,551,552,568,560,543,572,546,547,541,543,551,546,595,,,,,,,,,,,,,,,,,,,,,,,,,,,,,,,,,,,,,,,,,
537,562,551,559,550,547,553,570,553,550,578,547,547,545,540,556,546,595,,,,,,,,,,,,,,,,,,,,,,,,,,,,,,,,,,,,,,,,,
538,556,557,555,561,551,550,565,538,560,559,549,551,540,550,560,538,590,,,,,,,,,,,,,,,,,,,,,,,,,,,,,,,,,,,,,,,,,
539,556,560,553,553,545,549,565,545,551,573,546,546,537,543,557,537,592,,,,,,,,,,,,,,,,,,,,,,,,,,,,,,,,,,,,,,,,,
537,549,559,556,561,558,539,559,544,555,575,542,549,539,549,548,540,599,,,,,,,,,,,,,,,,,,,,,,,,,,,,,,,,,,,,,,,,,
537,559,568,548,544,549,548,566,542,546,565,546,546,547,545,559,561,591,,,,,,,,,,,,,,,,,,,,,,,,,,,,,,,,,,,,,,,,,
541,572,560,554,554,541,562,552,547,554,574,547,541,539,546,558,558,600,,,,,,,,,,,,,,,,,,,,,,,,,,,,,,,,,,,,,,,,,
561,572,559,548,566,540,552,565,541,552,565,545,542,540,543,559,542,591,,,,,,,,,,,,,,,,,,,,,,,,,,,,,,,,,,,,,,,,,
553,563,559,547,567,530,547,570,544,549,569,543,545,541,548,557,536,601,,,,,,,,,,,,,,,,,,,,,,,,,,,,,,,,,,,,,,,,,
546,560,555,558,549,542,543,555,551,550,568,544,547,541,541,556,539,594,,,,,,,,,,,,,,,,,,,,,,,,,,,,,,,,,,,,,,,,,
551,565,549,562,554,541,546,562,544,546,568,546,539,541,545,550,534,596,,,,,,,,,,,,,,,,,,,,,,,,,,,,,,,,,,,,,,,,,
544,552,549,550,540,541,544,565,561,547,569,550,543,535,541,556,533,595,,,,,,,,,,,,,,,,,,,,,,,,,,,,,,,,,,,,,,,,,
556,540,558,551,549,538,549,560,544,544,565,545,542,539,542,551,534,591,,,,,,,,,,,,,,,,,,,,,,,,,,,,,,,,,,,,,,,,,
536,544,555,567,539,538,543,561,548,547,563,547,543,530,547,555,531,592,,,,,,,,,,,,,,,,,,,,,,,,,,,,,,,,,,,,,,,,,
535,543,557,562,537,539,543,554,541,541,568,536,537,536,540,552,531,594,,,,,,,,,,,,,,,,,,,,,,,,,,,,,,,,,,,,,,,,,
542,532,551,551,549,539,536,550,536,541,566,543,546,533,542,548,529,589,,,,,,,,,,,,,,,,,,,,,,,,,,,,,,,,,,,,,,,,,
532,527,553,545,550,538,536,549,541,541,565,541,541,540,535,542,532,586,,,,,,,,,,,,,,,,,,,,,,,,,,,,,,,,,,,,,,,,,
512,546,549,547,545,539,537,557,533,543,566,543,537,532,534,547,530,587,,,,,,,,,,,,,,,,,,,,,,,,,,,,,,,,,,,,,,,,,
605,541,542,553,543,541,537,555,538,540,559,543,543,533,535,540,529,500,,,,,,,,,,,,,,,,,,,,,,,,,,,,,,,,,,,,,,,,,
2500,527,557,538,554,535,526,567,534,535,556,532,530,526,542,541,533,2500,,,,,,,,,,,,,,,,,,,,,,,,,,,,,,,,,,,,,,,,,
#,raw_col_delta_min,,,,,,,,,,,,,,,,,,,,,,,,,,,,,,,,,,,,,,,,,,,,,,,,,,,,,,,,,
-2500,-3000,-3000,-3000,-3000,-3000,-583,-564,-564,-582,-575,-579,-575,-564,-558,-582,-608,-2500,,,,,,,,,,,,,,,,,,,,,,,,,,,,,,,,,,,,,,,,,
-511,-3000,-3000,-3000,-3000,-3000,-545,-559,-561,-566,-568,-576,-573,-564,-562,-572,-556,-665,,,,,,,,,,,,,,,,,,,,,,,,,,,,,,,,,,,,,,,,,
-594,-583,-563,-559,-607,-539,-585,-555,-564,-566,-566,-578,-564,-573,-572,-568,-582,-540,,,,,,,,,,,,,,,,,,,,,,,,,,,,,,,,,,,,,,,,,
-599,-577,-578,-579,-595,-562,-575,-558,-562,-567,-575,-581,-580,-564,-572,-576,-587,-534,,,,,,,,,,,,,,,,,,,,,,,,,,,,,,,,,,,,,,,,,
-605,-577,-577,-571,-591,-561,-571,-565,-559,-568,-573,-566,-591,-563,-565,-576,-579,-538,,,,,,,,,,,,,,,,,,,,,,,,,,,,,,,,,,,,,,,,,
-610,-573,-581,-565,-593,-565,-570,-556,-563,-573,-572,-575,-576,-566,-567,-573,-575,-548,,,,,,,,,,,,,,,,,,,,,,,,,,,,,,,,,,,,,,,,,
-603,-574,-582,-568,-583,-559,-565,-550,-558,-568,-571,-576,-577,-566,-568,-573,-581,-527,,,,,,,,,,,,,,,,,,,,,,,,,,,,,,,,,,,,,,,,,
-596,-576,-578,-572,-575,-562,-566,-552,-563,-569,-566,-585,-582,-559,-576,-573,-580,-541,,,,,,,,,,,,,,,,,,,,,,,,,,,,,,,,,,,,,,,,,
-597,-576,-576,-571,-587,-554,-566,-550,-569,-573,-575,-564,-582,-557,-567,-571,-577,-539,,,,,,,,,,,,,,,,,,,,,,,,,,,,,,,,,,,,,,,,,
-602,-571,-577,-568,-584,-556,-560,-546,-570,-563,-568,-576,-572,-564,-567,-569,-577,-538,,,,,,,,,,,,,,,,,,,,,,,,,,,,,,,,,,,,,,,,,
-598,-570,-573,-566,-580,-554,-564,-551,-565,-551,-581,-572,-571,-560,-566,-568,-570,-537,,,,,,,,,,,,,,,,,,,,,,,,,,,,,,,,,,,,,,,,,
-595,-571,-570,-564,-578,-543,-567,-553,-565,-570,-568,-569,-572,-560,-568,-561,-571,-540,,,,,,,,,,,,,,,,,,,,,,,,,,,,,,,,,,,,,,,,,
-596,-564,-569,-566,-582,-549,-559,-549,-560,-560,-565,-570,-569,-560,-560,-570,-575,-541,,,,,,,,,,,,,,,,,,,,,,,,,,,,,,,,,,,,,,,,,
-595,-561,-569,-565,-581,-548,-566,-555,-557,-560,-556,-572,-557,-572,-578,-560,-580,-540,,,,,,,,,,,,,,,,,,,,,,,,,,,,,,,,,,,,,,,,,
-591,-565,-568,-559,-575,-548,-558,-555,-556,-564,-562,-573,-568,-551,-565,-549,-592,-537,,,,,,,,,,,,,,,,,,,,,,,,,,,,,,,,,,,,,,,,,
-592,-558,-564,-560,-573,-547,-560,-554,-556,-568,-559,-564,-573,-556,-571,-552,-578,-538,,,,,,,,,,,,,,,,,,,,,,,,,,,,,,,,,,,,,,,,,
-585,-562,-567,-561,-570,-544,-554,-548,-555,-563,-563,-556,-570,-550,-571,-558,-567,-539,,,,,,,,,,,,,,,,,,,,,,,,,,,,,,,,,,,,,,,,,
-589,-560,-559,-556,-575,-549,-558,-542,-556,-558,-563,-563,-563,-554,-553,-556,-569,-529,,,,,,,,,,,,,,,,,,,,,,,,,,,,,,,,,,,,,,,,,
-581,-557,-563,-555,-568,-545,-549,-557,-549,-561,-561,-564,-567,-552,-561,-551,-572,-536,,,,,,,,,,,,,,,,,,,,,,,,,,,,,,,,,,,,,,,,,
-580,-559,-561,-560,-564,-549,-552,-548,-542,-563,-559,-566,-564,-550,-554,-557,-570,-530,,,,,,,,,,,,,,,,,,,,,,,,,,,,,,,,,,,,,,,,,
-578,-559,-558,-554,-563,-547,-553,-549,-542,-568,-563,-563,-561,-558,-562,-551,-562,-531,,,,,,,,,,,,,,,,,,,,,,,,,,,,,,,,,,,,,,,,,
-580,-556,-567,-548,-566,-541,-548,-545,-547,-557,-557,-563,-556,-555,-570,-553,-564,-527,,,,,,,,,,,,,,,,,,,,,,,,,,,,,,,,,,,,,,,,,
-577,-557,-561,-555,-565,-545,-547,-543,-549,-544,-561,-556,-558,-551,-556,-550,-564,-528,,,,,,,,,,,,,,,,,,,,,,,,,,,,,,,,,,,,,,,,,
-575,-561,-548,-553,-574,-545,-550,-548,-541,-556,-552,-565,-562,-553,-563,-552,-564,-536,,,,,,,,,,,,,,,,,,,,,,,,,,,,,,,,,,,,,,,,,
-573,-562,-555,-553,-568,-529,-562,-546,-543,-557,-559,-557,-560,-551,-552,-559,-561,-525,,,,,,,,,,,,,,,,,,,,,,,,,,,,,,,,,,,,,,,,,
-573,-556,-548,-557,-570,-545,-551,-543,-552,-558,-555,-555,-555,-551,-561,-555,-560,-526,,,,,,,,,,,,,,,,,,,,,,,,,,,,,,,,,,,,,,,,,
-581,-553,-553,-550,-574,-547,-535,-554,-546,-554,-556,-562,-555,-552,-552,-560,-564,-521,,,,,,,,,,,,,,,,,,,,,,,,,,,,,,,,,,,,,,,,,
-570,-546,-557,-551,-556,-549,-549,-541,-543,-552,-557,-547,-559,-545,-551,-547,-566,-523,,,,,,,,,,,,,,,,,,,,,,,,,,,,,,,,,,,,,,,,,
-569,-551,-552,-555,-544,-558,-544,-539,-550,-551,-549,-548,-551,-547,-555,-556,-567,-527,,,,,,,,,,,,,,,,,,,,,,,,,,,,,,,,,,,,,,,,,
-576,-545,-554,-557,-568,-541,-547,-542,-540,-549,-551,-557,-554,-554,-552,-549,-559,-523,,,,,,,,,,,,,,,,,,,,,,,,,,,,,,,,,,,,,,,,,
-562,-535,-574,-541,-570,-542,-548,-540,-544,-547,-550,-556,-549,-548,-556,-552,-560,-524,,,,,,,,,,,,,,,,,,,,,,,,,,,,,,,,,,,,,,,,,
-561,-541,-559,-539,-566,-535,-577,-539,-544,-551,-550,-555,-550,-544,-554,-551,-557,-523,,,,,,,,,,,,,,,,,,,,,,,,,,,,,,,,,,,,,,,,,
-567,-559,-552,-547,-560,-544,-549,-538,-546,-544,-552,-552,-555,-545,-548,-552,-562,-528,,,,,,,,,,,,,,,,,,,,,,,,,,,,,,,,,,,,,,,,,
-564,-555,-548,-540,-570,-535,-545,-538,-538,-544,-543,-552,-554,-547,-547,-547,-554,-518,,,,,,,,,,,,,,,,,,,,,,,,,,,,,,,,,,,,,,,,,
-574,-554,-553,-538,-554,-535,-547,-538,-537,-544,-549,-554,-558,-549,-551,-546,-556,-517,,,,,,,,,,,,,,,,,,,,,,,,,,,,,,,,,,,,,,,,,
-556,-561,-551,-543,-562,-534,-540,-537,-542,-546,-542,-555,-554,-546,-543,-546,-554,-516,,,,,,,,,,,,,,,,,,,,,,,,,,,,,,,,,,,,,,,,,
-564,-564,-551,-543,-554,-538,-545,-538,-539,-546,-544,-549,-550,-546,-551,-547,-544,-516,,,,,,,,,,,,,,,,,,,,,,,,,,,,,,,,,,,,,,,,,
-588,-544,-560,-545,-558,-535,-546,-537,-545,-547,-542,-550,-546,-541,-549,-543,-550,-515,,,,,,,,,,,,,,,,,,,,,,,,,,,,,,,,,,,,,,,,,
-487,-552,-554,-534,-567,-534,-549,-536,-544,-543,-548,-550,-553,-546,-546,-545,-544,-600,,,,,,,,,,,,,,,,,,,,,,,,,,,,,,,,,,,,,,,,,
-2500,-561,-536,-551,-560,-538,-552,-525,-538,-549,-551,-553,-559,-539,-539,-545,-543,-2500,,,,,,,,,,,,,,,,,,,,,,,,,,,,,,,,,,,,,,,,,
#,line_max,,,,,,,,,,,,,,,,,,,,,,,,,,,,,,,,,,,,,,,,,,,,,,,,,,,,,,,,,
4000,4000,4000,4000,4000,4000,4000,4000,4000,4000,4000,4000,4000,4000,4000,4000,4000,4000,4000,4000,4000,4000,4000,4000,4000,4000,4000,4000,4000,4000,4000,4000,4000,4000,4000,4000,4000,4000,4000,4000,4000,4000,4000,4000,4000,4000,4000,4000,4000,4000,4000,4000,4000,4000,4000,4000,4000,4000,4000
#,line_min,,,,,,,,,,,,,,,,,,,,,,,,,,,,,,,,,,,,,,,,,,,,,,,,,,,,,,,,,
1000,1000,1000,1000,1000,1000,1000,1000,1000,1000,1000,1000,1000,1000,1000,1000,1000,1000,1000,1000,1000,1000,1000,1000,1000,1000,1000,1000,1000,1000,1000,1000,1000,1000,1000,1000,1000,1000,1000,1000,1000,1000,1000,1000,1000,1000,1000,1000,1000,1000,1000,1000,1000,1000,1000,1000,1000,1000,1000
#,full_max,,,,,,,,,,,,,,,,,,,,,,,,,,,,,,,,,,,,,,,,,,,,,,,,,,,,,,,,,
4241,4090,4100,4100,4100,4100,4032,4012,4001,3995,3969,3961,3935,3913,3905,3874,3858,3783,3763,,,,,,,,,,,,,,,,,,,,,,,,,,,,,,,,,,,,,,,,
3869,4014,4100,4100,4100,4100,3934,4016,4012,4011,4007,4002,3995,3982,3972,3955,3953,3927,3702,,,,,,,,,,,,,,,,,,,,,,,,,,,,,,,,,,,,,,,,
3886,3849,3808,3827,3848,3788,3852,3833,3831,3827,3823,3818,3809,3797,3785,3767,3764,3731,3727,,,,,,,,,,,,,,,,,,,,,,,,,,,,,,,,,,,,,,,,
3866,3821,3805,3803,3821,3822,3822,3827,3825,3821,3815,3808,3801,3791,3781,3760,3755,3720,3720,,,,,,,,,,,,,,,,,,,,,,,,,,,,,,,,,,,,,,,,
3899,3828,3815,3803,3821,3813,3834,3831,3827,3856,3821,3823,3811,3798,3791,3769,3764,3727,3761,,,,,,,,,,,,,,,,,,,,,,,,,,,,,,,,,,,,,,,,
3879,3836,3842,3820,3840,3831,3839,3843,3844,3841,3837,3829,3821,3808,3799,3778,3772,3735,3737,,,,,,,,,,,,,,,,,,,,,,,,,,,,,,,,,,,,,,,,
3877,3839,3825,3820,3839,3849,3839,3844,3847,3844,3838,3833,3823,3810,3798,3777,3772,3737,3736,,,,,,,,,,,,,,,,,,,,,,,,,,,,,,,,,,,,,,,,
3882,3844,3829,3818,3837,3828,3847,3844,3854,3852,3866,3839,3829,3817,3805,3786,3778,3743,3745,,,,,,,,,,,,,,,,,,,,,,,,,,,,,,,,,,,,,,,,
3872,3837,3822,3810,3830,3821,3841,3836,3835,3854,3830,3832,3819,3807,3796,3774,3768,3733,3734,,,,,,,,,,,,,,,,,,,,,,,,,,,,,,,,,,,,,,,,
3685,3655,3639,3628,3645,3636,3653,3650,3650,3649,3641,3636,3629,3632,3610,3592,3587,3553,3553,,,,,,,,,,,,,,,,,,,,,,,,,,,,,,,,,,,,,,,,
3714,3682,3669,3657,3672,3662,3682,3679,3678,3679,3673,3693,3655,3650,3641,3620,3615,3581,3584,,,,,,,,,,,,,,,,,,,,,,,,,,,,,,,,,,,,,,,,
3865,3835,3816,3804,3820,3813,3842,3829,3827,3828,3820,3814,3804,3790,3791,3770,3767,3729,3730,,,,,,,,,,,,,,,,,,,,,,,,,,,,,,,,,,,,,,,,
3863,3831,3820,3818,3847,3816,3835,3842,3842,3842,3835,3831,3818,3807,3800,3777,3773,3738,3740,,,,,,,,,,,,,,,,,,,,,,,,,,,,,,,,,,,,,,,,
3850,3826,3819,3834,3820,3812,3835,3840,3840,3839,3831,3826,3818,3804,3795,3774,3771,3735,3740,,,,,,,,,,,,,,,,,,,,,,,,,,,,,,,,,,,,,,,,
3864,3836,3821,3810,3827,3818,3847,3864,3845,3843,3838,3834,3823,3822,3812,3790,3789,3752,3754,,,,,,,,,,,,,,,,,,,,,,,,,,,,,,,,,,,,,,,,
3836,3811,3799,3788,3805,3798,3816,3833,3823,3824,3820,3814,3805,3793,3783,3763,3758,3721,3724,,,,,,,,,,,,,,,,,,,,,,,,,,,,,,,,,,,,,,,,
3804,3777,3766,3755,3770,3765,3784,3783,3801,3794,3778,3783,3772,3761,3752,3730,3727,3691,3695,,,,,,,,,,,,,,,,,,,,,,,,,,,,,,,,,,,,,,,,
3523,3498,3489,3477,3492,3485,3504,3502,3502,3503,3498,3497,3486,3484,3476,3457,3455,3419,3425,,,,,,,,,,,,,,,,,,,,,,,,,,,,,,,,,,,,,,,,
3792,3766,3755,3741,3756,3752,3760,3767,3770,3770,3764,3759,3751,3739,3750,3723,3717,3681,3686,,,,,,,,,,,,,,,,,,,,,,,,,,,,,,,,,,,,,,,,
3811,3786,3776,3765,3780,3775,3792,3789,3789,3792,3786,3791,3792,3769,3762,3744,3742,3705,3713,,,,,,,,,,,,,,,,,,,,,,,,,,,,,,,,,,,,,,,,
3798,3773,3764,3754,3768,3763,3780,3778,3779,3781,3777,3781,3791,3761,3752,3733,3732,3697,3704,,,,,,,,,,,,,,,,,,,,,,,,,,,,,,,,,,,,,,,,
3791,3765,3755,3745,3758,3752,3759,3766,3767,3766,3761,3757,3750,3736,3730,3710,3718,3675,3688,,,,,,,,,,,,,,,,,,,,,,,,,,,,,,,,,,,,,,,,
3609,3587,3580,3570,3584,3576,3590,3589,3589,3589,3584,3600,3573,3573,3565,3545,3542,3510,3515,,,,,,,,,,,,,,,,,,,,,,,,,,,,,,,,,,,,,,,,
3764,3744,3738,3726,3738,3729,3734,3739,3740,3740,3733,3732,3722,3713,3706,3685,3692,3668,3667,,,,,,,,,,,,,,,,,,,,,,,,,,,,,,,,,,,,,,,,
3734,3711,3704,3692,3706,3697,3729,3706,3708,3707,3701,3700,3693,3683,3684,3664,3660,3625,3632,,,,,,,,,,,,,,,,,,,,,,,,,,,,,,,,,,,,,,,,
3750,3729,3717,3704,3718,3711,3712,3720,3719,3719,3714,3711,3707,3697,3689,3668,3672,3658,3648,,,,,,,,,,,,,,,,,,,,,,,,,,,,,,,,,,,,,,,,
3753,3729,3722,3709,3722,3712,3716,3723,3721,3721,3717,3714,3707,3698,3719,3681,3680,3645,3655,,,,,,,,,,,,,,,,,,,,,,,,,,,,,,,,,,,,,,,,
3770,3747,3736,3724,3735,3726,3731,3739,3736,3735,3727,3726,3719,3708,3700,3701,3689,3654,3668,,,,,,,,,,,,,,,,,,,,,,,,,,,,,,,,,,,,,,,,
3745,3721,3710,3698,3709,3701,3706,3708,3704,3706,3702,3698,3690,3684,3676,3683,3663,3634,3650,,,,,,,,,,,,,,,,,,,,,,,,,,,,,,,,,,,,,,,,
3765,3717,3707,3698,3707,3698,3702,3707,3705,3702,3698,3696,3690,3683,3676,3659,3666,3627,3649,,,,,,,,,,,,,,,,,,,,,,,,,,,,,,,,,,,,,,,,
3732,3729,3700,3689,3701,3689,3691,3697,3695,3694,3691,3691,3681,3674,3667,3647,3655,3619,3642,,,,,,,,,,,,,,,,,,,,,,,,,,,,,,,,,,,,,,,,
3733,3723,3702,3691,3704,3694,3693,3699,3703,3700,3691,3692,3687,3677,3669,3649,3659,3619,3644,,,,,,,,,,,,,,,,,,,,,,,,,,,,,,,,,,,,,,,,
3730,3704,3701,3690,3701,3694,3696,3700,3702,3700,3695,3696,3690,3679,3670,3652,3654,3624,3648,,,,,,,,,,,,,,,,,,,,,,,,,,,,,,,,,,,,,,,,
3705,3675,3677,3669,3680,3675,3678,3681,3682,3682,3677,3676,3669,3659,3650,3632,3661,3603,3628,,,,,,,,,,,,,,,,,,,,,,,,,,,,,,,,,,,,,,,,
3721,3686,3688,3681,3693,3685,3689,3695,3693,3694,3689,3688,3682,3672,3664,3645,3665,3615,3641,,,,,,,,,,,,,,,,,,,,,,,,,,,,,,,,,,,,,,,,
3571,3536,3534,3527,3540,3533,3537,3544,3539,3538,3532,3534,3524,3516,3508,3488,3492,3465,3508,,,,,,,,,,,,,,,,,,,,,,,,,,,,,,,,,,,,,,,,
3580,3543,3542,3534,3546,3541,3545,3551,3547,3549,3539,3542,3533,3525,3516,3496,3499,3470,3513,,,,,,,,,,,,,,,,,,,,,,,,,,,,,,,,,,,,,,,,
3748,3702,3691,3685,3695,3688,3693,3699,3698,3696,3690,3691,3683,3672,3663,3642,3654,3615,3638,,,,,,,,,,,,,,,,,,,,,,,,,,,,,,,,,,,,,,,,
3632,3759,3740,3735,3746,3742,3746,3752,3751,3749,3743,3742,3735,3726,3716,3693,3703,3669,3541,,,,,,,,,,,,,,,,,,,,,,,,,,,,,,,,,,,,,,,,
4382,3458,3432,3448,3448,3444,3450,3441,3453,3453,3437,3434,3414,3387,3385,3364,3351,3335,4173,,,,,,,,,,,,,,,,,,,,,,,,,,,,,,,,,,,,,,,,
#,full_min,,,,,,,,,,,,,,,,,,,,,,,,,,,,,,,,,,,,,,,,,,,,,,,,,,,,,,,,,
58,1273,897,799,944,820,1268,1267,1268,1262,1242,1240,1227,1219,1214,1199,1184,1132,50,,,,,,,,,,,,,,,,,,,,,,,,,,,,,,,,,,,,,,,,
1372,1448,350,350,350,350,1421,1498,1504,1498,1497,1499,1496,1499,1500,1500,1496,1488,1315,,,,,,,,,,,,,,,,,,,,,,,,,,,,,,,,,,,,,,,,
1485,1459,1439,1458,1473,1432,1477,1464,1475,1471,1460,1471,1469,1466,1465,1475,1469,1452,1444,,,,,,,,,,,,,,,,,,,,,,,,,,,,,,,,,,,,,,,,
1463,1438,1432,1441,1453,1454,1455,1457,1459,1453,1455,1458,1452,1454,1448,1449,1444,1433,1428,,,,,,,,,,,,,,,,,,,,,,,,,,,,,,,,,,,,,,,,
1493,1457,1453,1452,1470,1467,1476,1467,1465,1487,1464,1471,1468,1469,1474,1468,1458,1453,1468,,,,,,,,,,,,,,,,,,,,,,,,,,,,,,,,,,,,,,,,
1483,1464,1477,1467,1480,1478,1482,1480,1481,1479,1473,1474,1472,1475,1472,1471,1465,1452,1455,,,,,,,,,,,,,,,,,,,,,,,,,,,,,,,,,,,,,,,,
1446,1429,1427,1432,1440,1451,1443,1439,1441,1443,1434,1437,1433,1434,1433,1431,1435,1426,1413,,,,,,,,,,,,,,,,,,,,,,,,,,,,,,,,,,,,,,,,
1464,1446,1435,1445,1453,1442,1459,1448,1461,1464,1467,1455,1456,1459,1454,1454,1454,1441,1441,,,,,,,,,,,,,,,,,,,,,,,,,,,,,,,,,,,,,,,,
1473,1451,1447,1444,1456,1447,1460,1457,1463,1476,1451,1461,1469,1464,1466,1463,1455,1450,1441,,,,,,,,,,,,,,,,,,,,,,,,,,,,,,,,,,,,,,,,
1411,1388,1383,1384,1385,1382,1399,1397,1394,1397,1391,1396,1382,1403,1398,1394,1396,1380,1379,,,,,,,,,,,,,,,,,,,,,,,,,,,,,,,,,,,,,,,,
1420,1399,1396,1389,1402,1397,1412,1410,1408,1405,1402,1430,1406,1408,1413,1410,1407,1397,1395,,,,,,,,,,,,,,,,,,,,,,,,,,,,,,,,,,,,,,,,
1431,1413,1409,1407,1411,1409,1432,1420,1418,1415,1415,1417,1413,1412,1425,1421,1413,1412,1406,,,,,,,,,,,,,,,,,,,,,,,,,,,,,,,,,,,,,,,,
1430,1415,1404,1408,1428,1407,1428,1426,1429,1423,1413,1421,1425,1424,1421,1417,1416,1402,1406,,,,,,,,,,,,,,,,,,,,,,,,,,,,,,,,,,,,,,,,
1454,1437,1424,1453,1438,1433,1444,1448,1448,1443,1439,1445,1443,1442,1446,1441,1434,1420,1425,,,,,,,,,,,,,,,,,,,,,,,,,,,,,,,,,,,,,,,,
1423,1412,1396,1392,1399,1393,1421,1428,1411,1409,1405,1410,1406,1414,1415,1416,1410,1400,1397,,,,,,,,,,,,,,,,,,,,,,,,,,,,,,,,,,,,,,,,
1435,1423,1414,1411,1423,1420,1435,1441,1435,1428,1427,1432,1428,1428,1431,1428,1430,1421,1416,,,,,,,,,,,,,,,,,,,,,,,,,,,,,,,,,,,,,,,,
1432,1421,1411,1411,1423,1414,1427,1422,1440,1426,1421,1434,1426,1424,1428,1426,1421,1413,1412,,,,,,,,,,,,,,,,,,,,,,,,,,,,,,,,,,,,,,,,
1377,1371,1364,1363,1364,1364,1377,1375,1371,1377,1374,1371,1370,1382,1380,1379,1377,1366,1368,,,,,,,,,,,,,,,,,,,,,,,,,,,,,,,,,,,,,,,,
1403,1388,1385,1383,1388,1390,1392,1396,1402,1395,1395,1397,1390,1396,1411,1401,1397,1389,1388,,,,,,,,,,,,,,,,,,,,,,,,,,,,,,,,,,,,,,,,
1438,1428,1429,1426,1437,1432,1442,1438,1440,1438,1439,1447,1451,1442,1448,1443,1436,1435,1435,,,,,,,,,,,,,,,,,,,,,,,,,,,,,,,,,,,,,,,,
1436,1432,1424,1416,1437,1429,1442,1441,1444,1430,1433,1447,1461,1446,1445,1439,1436,1428,1431,,,,,,,,,,,,,,,,,,,,,,,,,,,,,,,,,,,,,,,,
1406,1397,1387,1380,1402,1396,1400,1398,1401,1402,1396,1405,1402,1403,1398,1398,1409,1393,1399,,,,,,,,,,,,,,,,,,,,,,,,,,,,,,,,,,,,,,,,
1384,1381,1375,1376,1383,1382,1391,1388,1385,1386,1388,1399,1388,1395,1391,1392,1390,1378,1379,,,,,,,,,,,,,,,,,,,,,,,,,,,,,,,,,,,,,,,,
1385,1382,1374,1377,1377,1377,1383,1383,1380,1380,1380,1386,1389,1387,1390,1389,1384,1390,1381,,,,,,,,,,,,,,,,,,,,,,,,,,,,,,,,,,,,,,,,
1390,1391,1380,1382,1390,1387,1415,1386,1383,1396,1390,1393,1389,1391,1404,1401,1395,1393,1397,,,,,,,,,,,,,,,,,,,,,,,,,,,,,,,,,,,,,,,,
1397,1383,1380,1377,1389,1380,1384,1387,1388,1389,1384,1397,1393,1393,1395,1389,1395,1406,1397,,,,,,,,,,,,,,,,,,,,,,,,,,,,,,,,,,,,,,,,
1389,1383,1374,1371,1379,1380,1378,1379,1380,1377,1383,1386,1389,1391,1408,1394,1387,1380,1389,,,,,,,,,,,,,,,,,,,,,,,,,,,,,,,,,,,,,,,,
1425,1420,1414,1412,1421,1418,1419,1416,1415,1423,1418,1423,1425,1425,1421,1435,1426,1425,1432,,,,,,,,,,,,,,,,,,,,,,,,,,,,,,,,,,,,,,,,
1385,1381,1380,1373,1380,1379,1384,1378,1375,1381,1376,1375,1380,1381,1384,1406,1387,1382,1386,,,,,,,,,,,,,,,,,,,,,,,,,,,,,,,,,,,,,,,,
1389,1365,1359,1355,1355,1357,1359,1357,1355,1355,1351,1354,1362,1352,1356,1363,1367,1355,1362,,,,,,,,,,,,,,,,,,,,,,,,,,,,,,,,,,,,,,,,
1328,1336,1317,1317,1332,1326,1317,1323,1321,1321,1318,1324,1324,1321,1329,1324,1325,1311,1326,,,,,,,,,,,,,,,,,,,,,,,,,,,,,,,,,,,,,,,,
1384,1385,1372,1373,1383,1377,1376,1379,1374,1374,1374,1374,1379,1374,1382,1379,1388,1374,1387,,,,,,,,,,,,,,,,,,,,,,,,,,,,,,,,,,,,,,,,
1397,1380,1386,1390,1395,1390,1392,1393,1388,1390,1392,1396,1387,1385,1390,1392,1384,1383,1399,,,,,,,,,,,,,,,,,,,,,,,,,,,,,,,,,,,,,,,,
1382,1374,1363,1369,1378,1373,1370,1366,1373,1368,1369,1370,1370,1371,1369,1371,1395,1371,1382,,,,,,,,,,,,,,,,,,,,,,,,,,,,,,,,,,,,,,,,
1378,1370,1367,1371,1372,1370,1367,1365,1364,1367,1370,1373,1370,1371,1372,1367,1380,1365,1382,,,,,,,,,,,,,,,,,,,,,,,,,,,,,,,,,,,,,,,,
1336,1326,1328,1324,1323,1324,1327,1320,1323,1330,1324,1324,1329,1331,1324,1322,1326,1328,1345,,,,,,,,,,,,,,,,,,,,,,,,,,,,,,,,,,,,,,,,
1350,1337,1331,1333,1337,1332,1335,1333,1327,1334,1337,1330,1334,1332,1339,1331,1332,1333,1362,,,,,,,,,,,,,,,,,,,,,,,,,,,,,,,,,,,,,,,,
1374,1350,1342,1342,1350,1347,1345,1346,1344,1347,1347,1346,1338,1340,1342,1343,1350,1338,1351,,,,,,,,,,,,,,,,,,,,,,,,,,,,,,,,,,,,,,,,
1255,1378,1365,1357,1368,1364,1357,1365,1365,1365,1361,1360,1364,1356,1358,1359,1368,1361,1236,,,,,,,,,,,,,,,,,,,,,,,,,,,,,,,,,,,,,,,,
75,1049,1041,1049,1035,1043,1043,1032,1045,1040,1036,1032,1022,1015,1017,1019,1005,988,77,,,,,,,,,,,,,,,,,,,,,,,,,,,,,,,,,,,,,,,,
#,full_row_delta_max,,,,,,,,,,,,,,,,,,,,,,,,,,,,,,,,,,,,,,,,,,,,,,,,,,,,,,,,,
8000,9000,4000,4000,4000,4000,4000,4000,6000,6000,12000,6500,4000,4000,4000,4000,4000,15000,7000,4000,8000,5000,13000,4000,4000,4000,4000,4000,4000,4000,4000,4000,4000,4000,4000,4000,8000,4500,9000,,,,,,,,,,,,,,,,,,,,
#,full_row_delta_min,,,,,,,,,,,,,,,,,,,,,,,,,,,,,,,,,,,,,,,,,,,,,,,,,,,,,,,,,
-7000,-7000,-4000,-4000,-4000,-4000,-4000,-4000,-9500,-8500,-8500,-8000,-4000,-4000,-4000,-4500,-12000,-4500,-9000,-4000,-6000,-13000,-5000,-4500,-4000,-4000,-4000,-4000,-4000,-4000,-4000,-4000,-4000,-4000,-8000,-4000,-4000,-4000,-25000,,,,,,,,,,,,,,,,,,,,
#,full_col_delta_max,,,,,,,,,,,,,,,,,,,,,,,,,,,,,,,,,,,,,,,,,,,,,,,,,,,,,,,,,
6000,5000,5000,5000,5000,6000,3000,3000,3000,3000,3000,3000,3000,3000,3000,3000,3000,5000,,,,,,,,,,,,,,,,,,,,,,,,,,,,,,,,,,,,,,,,,
#,full_col_delta_min,,,,,,,,,,,,,,,,,,,,,,,,,,,,,,,,,,,,,,,,,,,,,,,,,,,,,,,,,
-5000,-6000,-5000,-5000,-5000,-5000,-3000,-3000,-3000,-3000,-3000,-3000,-3000,-3000,-3000,-3000,-4000,-7000,,,,,,,,,,,,,,,,,,,,,,,,,,,,,,,,,,,,,,,,,
