0 0 0 0 
0 0 0 0 
0 0 0 0 
0 0 0 0 
0 0 0 0 
0 0 0 0 
0 0 0 0 
0 0 0 0 
0 0 0 0 
0 0 0 0 
0.000339893158525229 1.17939034680603e-05 -1.08126560007804e-05 -1.17561069146177e-06 
0.000658867880702019 1.25690739878337e-05 -1.36276767079835e-05 -1.7263655536226e-06 
0.00115622719749808 1.67802973010112e-05 -1.86580273293657e-05 -2.88960382022196e-06 
0.00200460711494088 2.55750001088018e-05 -2.65678045252571e-05 -3.61502588930307e-06 
0.00352940475568175 4.6001954615349e-05 -3.66133499483112e-05 -4.58577096651425e-06 
0.00554063031449914 7.48412421671674e-05 -4.59811162727419e-05 -5.23493235959904e-06 
0.00773974368348718 0.000105576837086119 -5.46652736375108e-05 -4.97364862894756e-06 
0.0099041610956192 0.000135868627694435 -6.12935909884982e-05 -4.44500255980529e-06 
0.0117118107154965 0.000160901952767745 -6.43997918814421e-05 -4.02710838898201e-06 
0.0128054637461901 0.000171547319041565 -6.59026845823973e-05 -3.16238242703548e-06 
0.0133014963939786 0.000170808401890099 -6.76600757287815e-05 -2.58319755630509e-06 
0.0134631516411901 0.000163078308105469 -6.97672294336371e-05 -2.63338301920157e-06 
0.0134330708533525 0.000149810643051751 -7.28338636690751e-05 -2.82900577985856e-06 
0.0132108805701137 0.000133567693410441 -7.51785773900338e-05 -3.08631615553168e-06 
0.0128647806122899 0.000116803828859702 -7.62315467000008e-05 -3.42151224685949e-06 
0.0124352844431996 0.000100724428193644 -7.6119860750623e-05 -3.63696153726778e-06 
0.0119535503908992 8.68094357429072e-05 -7.48352831578813e-05 -3.66928179573733e-06 
0.0114187942817807 7.45092038414441e-05 -7.20722455298528e-05 -3.79115613213798e-06 
0.0108669782057405 6.35171309113503e-05 -6.90898523316719e-05 -3.58678153133951e-06 
0.0103057902306318 5.41854205948766e-05 -6.5785221522674e-05 -3.40133351528493e-06 
0.00974435172975063 4.63261567347217e-05 -6.22142979409546e-05 -3.29046974911762e-06 
0.00920384656637907 3.96732975787017e-05 -5.89803166803904e-05 -3.20510753226699e-06 
0.00870006438344717 3.48347202816512e-05 -5.62245877517853e-05 -2.77641379398119e-06 
0.00821458548307419 3.12412557832431e-05 -5.37415871804114e-05 -2.61519107880304e-06 
0.00770736625418067 2.81009924947284e-05 -5.16914842592087e-05 -2.34895378525835e-06 
0.00717090209946036 2.44115635723574e-05 -4.91418686578982e-05 -2.08426672543283e-06 
0.00666136480867863 2.04156967811286e-05 -4.58270769740921e-05 -1.80819267825427e-06 
0.00618702452629805 1.5996038200683e-05 -4.18387280660681e-05 -1.69236307101528e-06 
0.0057770642451942 1.09690572571708e-05 -3.74912269762717e-05 -1.49892753142922e-06 
0.00547201931476593 6.41109090793179e-06 -3.28242240357213e-05 -1.29262446080247e-06 
0.00527475820854306 2.12115674003144e-06 -2.88425799226388e-05 -1.10570772449137e-06 
0.00512317009270191 -1.72395937170222e-06 -2.53709786193212e-05 -1.00135616776242e-06 
0.0050091571174562 -5.33673392055789e-06 -2.22895341721596e-05 -9.05561591935111e-07 
0.00493353186175227 -8.82977928995388e-06 -1.94490112335188e-05 -8.07703088412381e-07 
0.00491235079243779 -1.25982405734248e-05 -1.65712226589676e-05 -7.55201426727581e-07 
0.00495604611933231 -1.6335774489562e-05 -1.37887773234979e-05 -7.47930641864514e-07 
0.00505733489990234 -1.98730122065172e-05 -1.11889803520171e-05 -7.27037672731967e-07 
0.0051936861127615 -2.33818209380843e-05 -8.87619899003766e-06 -7.23005314284819e-07 
0.00535116484388709 -2.69367465079995e-05 -6.56806059851078e-06 -7.89733803685522e-07 
0.00552866561338305 -3.02180724247592e-05 -4.55917961517116e-06 -8.36926233205304e-07 
0.00568490661680698 -3.2740892493166e-05 -3.04713807963708e-06 -9.30523867737065e-07 
0.00580877065658569 -3.52303104591556e-05 -1.80883341727167e-06 -8.85921224380581e-07 
0.00589898834004998 -3.70660345652141e-05 -5.46616263363831e-07 -9.77273543867341e-07 
0.00596376601606607 -3.89581728086341e-05 1.04218088381458e-06 -1.00842328265571e-06 
0.00599671760573983 -4.06080907850992e-05 2.79371283795626e-06 -1.08584379177046e-06 
0.00601597409695387 -4.32282067777123e-05 5.12893166160211e-06 -1.11803478830552e-06 
0.00603303918614984 -4.59863476862665e-05 8.02654631115729e-06 -1.26083841678337e-06 
0.00605901796370745 -4.97354340041056e-05 1.16117244033376e-05 -1.31405511183402e-06 
0.00609873095527291 -5.39941938768607e-05 1.53552773554111e-05 -1.32730883706245e-06 
0.00615678820759058 -5.91303105466068e-05 1.95094198716106e-05 -1.33879927943781e-06 
0.00624317582696676 -6.43843886791728e-05 2.41862726397812e-05 -1.31335809783195e-06 
0.00636250758543611 -7.01229510013945e-05 2.88376522803446e-05 -1.27677435557416e-06 
0.0065231560729444 -7.62455674703233e-05 3.35531258315314e-05 -1.23307518151705e-06 
0.00674011232331395 -8.26898394734599e-05 3.85943712899461e-05 -1.28880742522597e-06 
0.00703435251489282 -8.98305806913413e-05 4.37297239841428e-05 -1.206372417073e-06 
0.0074183251708746 -9.79372052825056e-05 4.93252955493517e-05 -1.20179186069436e-06 
0.00789286568760872 -0.000107143612694927 5.5621570936637e-05 -1.17792171749898e-06 
0.0084508778527379 -0.000117017632874195 6.2153281760402e-05 -1.16007618089498e-06 
0.00906428787857294 -0.000126940110931173 6.81354213156737e-05 -1.08656217889802e-06 
0.0096980007365346 -0.000136578324600123 7.40043469704688e-05 -1.05983679077326e-06 
0.0103336125612259 -0.000146565143950284 7.97187312855385e-05 -8.84071027940081e-07 
0.0109051372855902 -0.000154414388816804 8.40348220663145e-05 -9.48273736867122e-07 
0.0113705731928349 -0.000160928859259002 8.7807682575658e-05 -9.82856136033661e-07 
0.0116603039205074 -0.000164007375133224 9.01443709153682e-05 -8.62591036820959e-07 
0.0117177115753293 -0.000165098812431097 9.06509376363829e-05 -7.43682562642789e-07 
0.0115195913240314 -0.00016155865159817 8.92694224603474e-05 -8.25534812065598e-07 
0.0111182006075978 -0.000155791349243373 8.69028954184614e-05 -6.93628237513622e-07 
0.0105378245934844 -0.000147437516716309 8.2345461123623e-05 -5.11569169248105e-07 
0.00988732930272818 -0.000138664632686414 7.79117908678018e-05 -6.35858782516152e-07 
0.00924200750887394 -0.000128803541883826 7.3171868280042e-05 -7.51499385387433e-07 
0.00865536835044622 -0.000118895113701001 6.87238934915513e-05 -8.41499627313169e-07 
0.00816632434725761 -0.000110536573629361 6.43528328510001e-05 -9.13689177650667e-07 
0.00779880816116929 -0.000103010490420274 6.0789203416789e-05 -1.0328739108445e-06 
0.00754079362377524 -9.7323652880732e-05 5.76447091589216e-05 -9.87818680187047e-07 
0.00739903282374144 -9.25374624785036e-05 5.59964100830257e-05 -1.15781028853235e-06 
0.00734394229948521 -8.96398851182312e-05 5.43283604201861e-05 -1.2122991392971e-06 
0.0073397234082222 -8.74295874382369e-05 5.32774756720755e-05 -1.29955844840879e-06 
0.00739614758640528 -8.59315478010103e-05 5.29836397618055e-05 -1.48090668972145e-06 
0.00749533949419856 -8.56544211274013e-05 5.31901023350656e-05 -1.67357234204246e-06 
0.00763197941705585 -8.59552310430445e-05 5.34582904947456e-05 -1.7129787011072e-06 
0.007814378477633 -8.78100036061369e-05 5.45145012438297e-05 -1.93459322872513e-06 
0.00808768160641193 -9.17363504413515e-05 5.7362765801372e-05 -2.15363979805261e-06 
0.00850324332714081 -9.88313913694583e-05 6.19019992882386e-05 -2.14098054129863e-06 
0.009226955473423 -0.000111077701149043 7.05592974554747e-05 -2.09081167668046e-06 
0.0106214014813304 -0.000133000605273992 8.56119659147225e-05 -2.64724349108292e-06 
0.0133878691121936 -0.000169287333847024 0.00011150890350109 -3.38658742293774e-06 
0.0185296442359686 -0.000224151473958045 0.000148958511999808 -4.61102763438248e-06 
0.0272845644503832 -0.000295362318865955 0.000189545229659416 -6.14332429904607e-06 
0.0407108180224895 -0.000368051114492118 0.000224782852455974 -8.20429249870358e-06 
0.0592989698052406 -0.000429543317295611 0.000252127181738615 -8.44491569296224e-06 
0.0822275951504707 -0.000473345629870892 0.000254050450166687 -6.58870021652547e-06 
0.107150822877884 -0.000491223705466837 0.000224832125240937 -3.85168777938816e-06 
0.131928578019142 -0.00048069516196847 0.000174126500496641 2.42548526330211e-06 
0.154213085770607 -0.00043973108404316 0.00012481291196309 1.02389021776617e-05 
0.172179073095322 -0.000400514021748677 5.61856759304646e-05 1.77889032784151e-05 
0.184572026133537 -0.000354820833308622 -5.58047361209901e-07 2.20442107092822e-05 
0.192861318588257 -0.000304708577459678 -4.85695636598393e-05 2.97134793072473e-05 
0.197526767849922 -0.00025881762849167 -7.84384246799164e-05 2.7923088055104e-05 
0.199345156550407 -0.000215095467865467 -9.51021793298423e-05 2.44350339926314e-05 
0.199165880680084 -0.000176521891262382 -9.1071538918186e-05 2.30236237257486e-05 
0.198240041732788 -0.000141492040711455 -9.58905802690424e-05 2.08877700060839e-05 
0.196177586913109 -0.000111789573566057 -9.91412307485007e-05 1.72236395883374e-05 
0.193153440952301 -8.86746565811336e-05 -9.54372517298907e-05 1.38636141855386e-05 
0.189921602606773 -6.46515109110624e-05 -0.000106182305898983 1.5426130630658e-05 
0.186283245682716 -4.77495705126785e-05 -0.000113694011815824 1.11292538349517e-05 
0.182566925883293 -3.3524014725117e-05 -0.000106775187305175 4.51875803264556e-06 
0.17906454205513 -1.95547472685575e-05 -9.23611223697662e-05 -2.87856619252125e-06 
0.175606459379196 -7.04010744811967e-06 -7.94916413724422e-05 -3.62577156920452e-06 
0.172219052910805 -4.24075915361755e-06 -6.26623150310479e-05 -1.1271724360995e-05 
0.16849373281002 7.76698107074481e-06 -4.92645558551885e-05 -1.37204224301968e-05 
0.164678305387497 2.73637451755349e-05 -3.65469422831666e-05 -1.09579186755582e-05 
0.160823494195938 4.12046574638225e-05 -3.05895737255923e-05 -9.832992873271e-06 
0.156957611441612 6.38871570117772e-05 -2.48525448114378e-05 -7.73251031205291e-06 
0.152522668242455 7.35114881535992e-05 -2.04078351089265e-05 -5.69456051380257e-06 
0.148522660136223 9.16774370125495e-05 -1.42130211315816e-05 -6.94190930516925e-06 
0.144302785396576 0.000101539029856212 -3.86295550924842e-06 -1.05973113022628e-05 
0.140078395605087 0.000121726203360595 9.68193126027472e-06 -1.25943597595324e-05 
0.13565431535244 0.00013388367369771 1.5218676708173e-05 -1.60979998327093e-05 
0.131269469857216 0.000147391197970137 2.18259665416554e-05 -1.95932316273684e-05 
0.127011016011238 0.00016087076801341 2.57129431702197e-05 -1.9272501958767e-05 
0.122780822217464 0.000170073559274897 2.01507773454068e-05 -1.81336999958148e-05 
0.118022248148918 0.000177786350832321 1.77623369381763e-05 -1.84219079528702e-05 
0.113728821277618 0.000188947582500987 2.30928089877125e-05 -2.02955980057595e-05 
0.109519384801388 0.000213901948882267 2.55791637755465e-05 -2.05092164833331e-05 
0.105212591588497 0.00022856195573695 2.94543806376169e-05 -2.43660506384913e-05 
0.100898735225201 0.00025291001657024 3.33433381456416e-05 -2.27407144848257e-05 
0.0970788076519966 0.000273369631031528 3.8374313589884e-05 -2.26424599532038e-05 
0.0929821208119392 0.000293147342745215 3.79397424694616e-05 -2.08591573027661e-05 
0.0891234055161476 0.000308731483528391 4.26681071985513e-05 -1.97733916138532e-05 
0.0852286443114281 0.000331032322719693 4.82256000395864e-05 -1.71348547155503e-05 
0.0813599228858948 0.000360480655217543 5.89983537793159e-05 -1.85704357136274e-05 
0.0769135430455208 0.0003848425403703 6.89178486936726e-05 -1.7702966943034e-05 
0.0723017826676369 0.000412422377848998 8.1124591815751e-05 -1.67264843184967e-05 
0.0673450604081154 0.000438318093074486 9.29798188735731e-05 -1.17392628453672e-05 
0.0620728172361851 0.000468576006824151 0.000105323051684536 -5.62577724849689e-06 
0.0566396042704582 0.000489034107886255 0.000116081595479045 5.01028637245327e-07 
0.0513683892786503 0.000523629714734852 0.000130744083435275 7.0861119638721e-06 
0.046054981648922 0.000550300406757742 0.000141140830237418 1.43980150824063e-05 
0.0406961776316166 0.000572358316276222 0.000148296225233935 2.00425511138747e-05 
0.0353915803134441 0.00058179214829579 0.000151731888763607 2.46667696046643e-05 
0.0301693994551897 0.000579538580495864 0.000149425817653537 2.8755130188074e-05 
0.0251438673585653 0.000549417687579989 0.000138297604280524 3.11367257381789e-05 
0.0205250363796949 0.00051101139979437 0.000123710924526677 3.12239390041213e-05 
0.0163954477757215 0.000456667330581695 0.000103302343632095 2.97933711408405e-05 
0.0127985160797834 0.000395943206967786 8.09244374977425e-05 2.65259477600921e-05 
0.00981251895427704 0.000331687449943274 6.00264429522213e-05 2.25953735935036e-05 
0.00740356044843793 0.000273682351689786 4.21179101977032e-05 1.83780248335097e-05 
0.00551496213302016 0.000220120913581923 2.69411339104408e-05 1.4742903658771e-05 
0.00404721545055509 0.00017277138249483 1.4808181731496e-05 1.15230823212187e-05 
0.0029576972592622 0.000133481356897391 5.88805187362595e-06 8.9357772594667e-06 
0.00215588905848563 0.000101811681815889 -4.08583019861908e-07 6.81528899804107e-06 
0.00157796731218696 7.68524114391766e-05 -4.59601187685621e-06 5.13749728270341e-06 
0.00116723857354373 5.8154637372354e-05 -7.15416354069021e-06 3.77009018848184e-06 
0.000883257365785539 4.42301279690582e-05 -8.68509050633293e-06 2.79103414868587e-06 
0.000682354089803994 3.41632585332263e-05 -9.55161158344708e-06 1.95424559024104e-06 
0.000536393083166331 2.66649221885018e-05 -9.89975796983344e-06 1.31735976083291e-06 
0.00043026587809436 2.12219547393033e-05 -9.94497077044798e-06 8.53228300456976e-07 
0.000348150264471769 1.71277370100142e-05 -9.94575748336501e-06 4.94391429128882e-07 
0.000285219488432631 1.41431355586974e-05 -9.85650785878533e-06 2.36702589972992e-07 
0.000234835766605102 1.19426804303657e-05 -9.68117910815636e-06 7.10675891468782e-08 
0.00019062333740294 1.04290247691097e-05 -9.51197489484912e-06 -3.85703842198382e-08 
0 0 0 0 
0 0 0 0 
0 0 0 0 
0 0 0 0 
0 0 0 0 
0 0 0 0 
0 0 0 0 
0 0 0 0 
0 0 0 0 
0 0 0 0 
0 0 0 0 
0 0 0 0 
0 0 0 0 
0 0 0 0 
99.6146545410156 0.270638048648834 0.096874050796032 0.0141289783641696 
