20080000  60240000  80320000  120480000
0.016000  5.120000  0.017700  28.700000
0.022600  5.120000  0.017700  40.600000
0.023800  5.120000  0.017700  42.600000
0.026900  5.120000  0.017700  48.100000
-0.2526119848302754  -0.13925479062247706
-0.2526119848302754  -0.13925479062247706
-0.2526119848302754  -0.13925479062247706
-0.2526119848302754  -0.13925479062247706
5.785426871e-3  1.86596402  2.453994259e-9  -0.107132409  320  768
2.5  3.5  6  10  14  18  28  42  56  100  154  263  400
0  1.369169  4.029747  5.636390  6.313537  6.878211  8.048907  9.364131  10.616276  12.569775  13.159638  13.479772  16.674058