0 0 0 0 
0 0 0 0 
0 0 0 0 
0 0 0 0 
0 0 0 0 
0 0 0 0 
0 0 0 0 
0 0 0 0 
0 0 0 0 
0 0 0 0 
0.0278469398617744 3.9138991269283e-05 1.50072807514334e-08 -3.8409982749954e-08 
0.0348886214196682 3.7628342397511e-05 -1.45314146493547e-07 3.78827564873063e-07 
0.0412357039749622 3.44495347235352e-05 -3.49104709584935e-08 9.23554210885413e-09 
0.0482778437435627 3.18824932037387e-05 1.65414945740849e-07 -2.49195409196545e-07 
0.0566937811672688 2.98917220789008e-05 -1.98916850990827e-07 4.38540620484318e-10 
0.0659735053777695 2.82541659544222e-05 3.3628316487011e-07 1.14817133578526e-07 
0.0755458474159241 2.582288288977e-05 -2.66633890078083e-07 -1.86886410347142e-07 
0.0851570963859558 2.21650116145611e-05 1.36191800947927e-07 7.78936311007783e-08 
0.0943146273493767 1.89462552953046e-05 -3.28853886344405e-08 -5.01442158906684e-08 
0.101653195917606 1.52063075802289e-05 1.15157616775718e-08 -1.17638987440216e-09 
0.107911303639412 1.10237988337758e-05 -3.41872818943045e-09 -3.03484859465186e-09 
0.113510750234127 7.03701562088099e-06 1.34167548182518e-08 -1.67267835138318e-08 
0.11874084174633 4.49525032308884e-06 -4.18931112022847e-09 -1.03888915248262e-08 
0.123493708670139 8.52126902373129e-07 -1.27739046007491e-08 1.24766792453102e-08 
0.128028839826584 -2.94546703116794e-06 -3.24608739887822e-09 1.16176783748756e-08 
0.132467985153198 -5.79685229240567e-06 -5.86958570636398e-09 1.89699100872076e-09 
0.136991664767265 -5.77787977817934e-06 -1.71414704652761e-08 2.73382774196307e-08 
0.141428261995316 -3.95919823859003e-06 -1.14026716957483e-08 5.07164366059243e-10 
0.146035373210907 4.93095558340428e-06 1.18905250090506e-08 -1.77334644746452e-08 
0.150107771158218 7.77528384787729e-06 -2.47391468422009e-10 -8.6212859073953e-09 
0.153811439871788 1.01303758128779e-05 2.57117038771071e-09 -1.333770605072e-08 
0.15705132484436 1.00369943538681e-05 -8.06099365036061e-09 1.43163827459603e-08 
0.159727469086647 8.44148598844185e-06 1.73602987540988e-09 -1.37741844596917e-08 
0.161540061235428 -1.87553621344705e-06 2.27949215059198e-09 -2.08213912777921e-09 
0.163367286324501 -6.62787306282553e-06 4.92122920192628e-09 -6.01896177343519e-09 
0.165069952607155 -9.42685710469959e-06 5.48153522572647e-09 6.90402623959585e-09 
0.166878119111061 -8.33069771033479e-06 -6.5969549822853e-09 -1.00802068914163e-08 
0.168782755732536 -6.6134161897935e-06 -4.42435865721791e-09 1.7510824790179e-08 
0.170616433024406 -1.82994517672341e-06 -8.90378526463564e-09 1.91170208552194e-08 
0.172327786684036 4.34045250585768e-06 -1.40719471630746e-08 -2.54419996181809e-09 
0.173191830515862 7.47008243706659e-06 8.27572943506993e-09 -4.83649120752716e-10 
0.173109203577042 3.1470797239308e-06 3.88398158079895e-09 5.4646656089119e-09 
0.172504276037216 2.11507972380787e-06 1.92319049574508e-08 -1.58572923680822e-08 
0.171095222234726 -1.54907229443779e-06 -3.34243610566887e-09 -1.87321056444034e-08 
0.168986350297928 -5.77644550503464e-06 2.11872883681963e-08 -1.15490204066759e-08 
0.166535168886185 -7.38584458304103e-06 4.43306902297991e-09 1.31704576133984e-08 
0.164316222071648 -5.59437012270791e-06 7.80354802998318e-09 -1.99901766251287e-08 
0.161453664302826 -9.9429271358531e-06 4.0668575174152e-09 4.72726169320481e-09 
0.158306047320366 -8.03986495157005e-06 6.79998946040428e-09 -1.16692522311723e-08 
0.15545129776001 -8.22818674350856e-06 2.74135758537852e-09 2.61973664983373e-09 
0.152227535843849 -5.55788437850424e-06 -3.06357439416871e-10 1.62115529889206e-08 
0.148076117038727 -2.96625171358755e-06 -8.91526941160237e-09 1.08181872349178e-08 
0.143795266747475 -1.37480427042647e-07 -9.05854946608997e-09 1.06204645078378e-08 
0.13889217376709 2.58704176303581e-06 -6.34478380945325e-09 -6.18330409096757e-09 
0.133128374814987 4.12519057135796e-06 3.64280028364306e-09 -1.17478791139547e-08 
0.126724809408188 1.09137067738629e-06 5.89430504405186e-09 -1.07128137472046e-08 
0.12024212628603 -3.06488971091312e-07 5.37518651810842e-09 8.61631388460182e-09 
0.113524720072746 -1.26711597658868e-06 2.24402874060559e-09 4.61394789041947e-09 
0.107037834823132 -5.97019879933214e-06 -5.77396930268037e-09 6.08594064033241e-09 
0.100565604865551 -7.82277038524626e-06 -4.60387328260481e-09 -4.01740996025524e-09 
0.094574972987175 -9.83167410595343e-06 -1.06090549678584e-08 1.28266357535267e-08 
0.0885545238852501 -1.16751098175882e-05 -3.72256314662422e-09 1.28927446496618e-08 
0.0824853032827377 -1.28636938825366e-05 -8.00691513092033e-09 1.06516253595146e-08 
0.0765070542693138 -1.38633158712764e-05 -4.36835190242846e-09 1.27883410527829e-08 
0.0705342143774033 -1.26921140690683e-05 -3.96370047894834e-09 6.45020481471192e-09 
0.064660057425499 -1.0377520993643e-05 2.86733237153669e-09 2.78593614844169e-09 
0.0590807572007179 -9.51571928453632e-06 -3.70895203438693e-09 6.82068623802934e-09 
0.0539560914039612 -6.21466006123228e-06 -4.20778212273376e-09 5.23296339594026e-09 
0.049357533454895 -2.88574551632337e-06 -3.50990747577384e-09 7.81453846077085e-10 
0.0452967807650566 -1.30929140595981e-06 7.49582562686868e-10 -8.28229096416777e-10 
0.0417669676244259 -7.90181342580354e-09 1.50376922025686e-09 -5.10081932247886e-09 
0.0386944301426411 2.29034208132362e-06 1.79214365569891e-09 -1.70951558464694e-10 
0.036056712269783 2.43660429077863e-06 -1.20320287066988e-09 -4.47083564614204e-10 
0.033862940967083 1.49560469253629e-06 2.37434982786056e-09 -1.02779784683094e-09 
0.031822931021452 8.94693641839694e-07 1.81269921295524e-09 -1.65929059381398e-09 
0.0300830360502005 3.31491037286469e-07 8.44383896136947e-10 -5.03781127925151e-10 
0.0285861063748598 -1.03596633493908e-08 -3.63847979523158e-10 2.12567141666398e-09 
0.0271380562335253 -1.06022838508579e-07 3.79859949051209e-10 -1.69774938552081e-09 
0.0257493481040001 1.02057640560815e-06 1.50078571792278e-09 -4.07089828513563e-09 
0.0244906060397625 1.26425265989383e-06 2.68534061653725e-09 -3.01547808945202e-09 
0.0232986398041248 6.34539730981487e-07 -1.20465915021128e-09 -1.35578592797003e-09 
0.0220470987260342 -5.20817366123083e-07 3.08400915915996e-10 -7.39994732157356e-10 
0.0208779461681843 -1.06298807622807e-06 -1.12878584257459e-09 5.65574920230461e-10 
0.0196570958942175 -1.85613157555053e-06 1.12866604951023e-09 -2.69310573841608e-10 
0.0185739416629076 -2.87828447653737e-06 -4.0503675413639e-10 9.45914901961942e-10 
0.0174390785396099 -2.78104425888159e-06 -7.24361182147248e-10 2.61368549026031e-09 
0.0163618493825197 -2.7351088647265e-06 2.24091356582079e-10 2.84632850622302e-09 
0.0154104344546795 -3.5660107187141e-06 -9.46336786711299e-10 3.22041948663809e-09 
0.0145512372255325 -3.96729683416197e-06 -1.33247279876514e-09 2.65846455960173e-09 
0.0137906465679407 -4.12622102885507e-06 -1.46812351164982e-09 3.61685947858348e-09 
0.0131273632869124 -4.47749653176288e-06 -1.05083086676672e-09 2.18994045120269e-09 
0.0126178376376629 -4.48111813966534e-06 -2.4926050112839e-10 2.45874809401414e-09 
0.0121823465451598 -4.28223120252369e-06 -1.20033449846346e-09 1.64132218927193e-09 
0.0118763260543346 -4.55863801107625e-06 -2.45312836710809e-09 1.77864334371947e-09 
0.0116298338398337 -4.91898481413955e-06 -4.79321360380425e-10 4.2745185169224e-09 
0.011513645760715 -5.60274111194303e-06 -1.82549586558167e-09 5.1249959831523e-09 
0.0114355375990272 -5.8382875067764e-06 -1.90725746307407e-09 4.48828529897582e-09 
0.0113803343847394 -5.95491837884765e-06 -6.39563624282857e-10 4.58674431769168e-09 
0.0113851735368371 -6.04738443144015e-06 -1.92753546457425e-09 3.80499454166738e-09 
0.0114559857174754 -6.00026987740421e-06 -1.12882914127255e-09 4.74573846886983e-09 
0.0115495463833213 -6.54619634588016e-06 -3.58535312550146e-10 5.70623548412641e-09 
0.011656055226922 -6.86188059262349e-06 -2.102381380098e-09 5.24949017588483e-09 
0.0118133025243878 -7.0586411311524e-06 -1.46911360854318e-09 4.4874681748297e-09 
0.0120050814002752 -7.42920974516892e-06 -1.89968618613534e-09 5.29389065917485e-09 
0.0121058486402035 -7.06936270944425e-06 -9.35389543599285e-10 2.26117480295329e-09 
0.0121308853849769 -6.52140352030983e-06 -2.9296489678643e-09 5.64255486779075e-09 
0.0121560543775558 -6.41349379293388e-06 -2.0091504016051e-09 4.22011758871577e-09 
0.0121408300474286 -6.36206868875888e-06 -1.86546156299983e-09 4.97994001591451e-09 
0.0120884561911225 -6.37216726318002e-06 -1.7635052307341e-09 5.22883869535917e-09 
0.0120370369404554 -6.50093352305703e-06 -1.25933463657191e-09 3.62654217767044e-09 
0.0120131885632873 -6.47418210064643e-06 -1.72300274048354e-09 4.80437067906792e-09 
0.0119680175557733 -6.36742242932087e-06 -2.17949702729925e-09 2.472231308559e-09 
0.0119034787639976 -6.61706508253701e-06 -1.98681693319713e-09 4.26699076072623e-09 
0.0118593983352184 -6.78308333590394e-06 -1.58982238485095e-09 4.88289053635071e-09 
0.0118022719398141 -6.88036834617378e-06 -2.26063945341082e-09 5.81586023784553e-09 
0.0117556415498257 -7.16299473424442e-06 -2.67625877015121e-09 4.70593031209887e-09 
0.0117391627281904 -7.86766486271517e-06 -2.49262366303071e-09 5.7865041647176e-09 
0.0117066884413362 -7.84187886893051e-06 -2.47517228935124e-09 4.49834924864945e-09 
0.0116427978500724 -7.8358707469306e-06 -2.63189448013179e-09 5.65369084881695e-09 
0.0115583566948771 -7.56615872887778e-06 -1.56571944298634e-09 5.87512127836476e-09 
0.0114769265055656 -7.026273124211e-06 -2.11443063058425e-09 4.56786963809463e-09 
0.01135662663728 -6.36645017948467e-06 -2.15380002721588e-09 5.28719690251478e-09 
0.0112354373559356 -6.4980181377905e-06 -2.93502178116967e-09 5.75587044693293e-09 
0.0110253719612956 -6.20209038970643e-06 -1.1234619901046e-09 3.46363271397365e-09 
0.0108408117666841 -6.71352199788089e-06 -1.66369229503971e-09 5.41044986590578e-09 
0.0106185218319297 -6.99516340318951e-06 -1.45976686294347e-09 3.38144801048657e-09 
0.0103816548362374 -7.28213217371376e-06 -1.68505864817092e-09 6.5854406372523e-09 
0.0100755412131548 -6.83425378156244e-06 -1.9918287019749e-09 3.84505227657428e-09 
0.00975825078785419 -7.08988454789505e-06 -2.21378115838888e-09 4.97601915228074e-09 
0.0094112204387784 -7.30488909539417e-06 -2.68929123414807e-09 6.27339735714827e-09 
0.00898040551692247 -7.36281663193949e-06 -3.44877659763654e-09 6.36816466226264e-09 
0.00848897825926542 -7.38557992008282e-06 -2.40129760520347e-09 5.72473313198429e-09 
0.00800929311662912 -7.78499179432401e-06 -2.41145792223563e-09 5.24139798230294e-09 
0.00750186201184988 -7.72492694522953e-06 -2.53227216973073e-09 6.10139361256756e-09 
0.00691745430231094 -7.28440272723674e-06 -2.43812547928712e-09 5.36174971088599e-09 
0.00633640866726637 -7.38063590688398e-06 -2.50252751854418e-09 5.70991254278397e-09 
0.0057520242407918 -7.38618018658599e-06 -2.24433227558052e-09 5.18858156439705e-09 
0.0051268101669848 -7.10605081621907e-06 -2.49235609928178e-09 5.48779510722852e-09 
0.00452014291658998 -6.84073393131257e-06 -1.57689916679971e-09 4.25898472045105e-09 
0.00395210040733218 -6.61600552120944e-06 -2.13145900929135e-09 4.88582774238466e-09 
0.00342085678130388 -6.42723580313032e-06 -1.91581928099538e-09 4.62663685141251e-09 
0.00289959763176739 -6.24610265731462e-06 -1.9559953656767e-09 4.77139971977181e-09 
0.00243295729160309 -6.33873878541635e-06 -2.11335482447339e-09 4.84630557906485e-09 
0.00199538725428283 -6.42163922748296e-06 -1.96034966037928e-09 4.78912820511823e-09 
0.00160701735876501 -6.51942082185997e-06 -2.0125952016059e-09 4.95639129738379e-09 
0.00126598426140845 -6.38297842669999e-06 -1.98178962129703e-09 4.90306728551104e-09 
0.00100872060284019 -6.29209944236209e-06 -1.913890601557e-09 4.91993690232562e-09 
0.000802530266810209 -6.11868654232239e-06 -1.80403392224804e-09 4.66259963971538e-09 
0.000643179460894316 -6.00084058532957e-06 -1.8234996845834e-09 4.60179228056745e-09 
0.000513416423927993 -6.01931242272258e-06 -1.86353599218592e-09 4.55019621981023e-09 
0.000407352519687265 -6.18048989053932e-06 -1.85630333326969e-09 4.64349891871052e-09 
0.000302609434584156 -6.37278571957722e-06 -1.91862326026637e-09 4.78574824214206e-09 
0.000217605280340649 -6.65068000671454e-06 -2.01557748269465e-09 5.03834751697241e-09 
0.000142117394716479 -6.91516106599011e-06 -2.10635442421392e-09 5.22652676693269e-09 
8.00619091023691e-05 -7.18877890903968e-06 -2.18496576387395e-09 5.43156586374494e-09 
2.13606381294085e-05 -7.40569521440193e-06 -2.24809237892032e-09 5.60197044308097e-09 
-2.14486190088792e-05 -7.54710799810709e-06 -2.29375229920947e-09 5.70195046734057e-09 
-6.17123005213216e-05 -7.73534702602774e-06 -2.35323027730772e-09 5.84318105012471e-09 
-9.40395912039094e-05 -7.87066255725222e-06 -2.39659470047116e-09 5.95411098203158e-09 
-0.000116962961328682 -7.84453277447028e-06 -2.3816149052891e-09 5.92129278942366e-09 
-0.000123812322271988 -7.6546857599169e-06 -2.32783081699495e-09 5.77578429528103e-09 
-0.000132730070617981 -7.43149166737567e-06 -2.23934604193232e-09 5.61981794433564e-09 
-0.000131003456772305 -7.07727076587616e-06 -2.1440804687245e-09 5.3356687956807e-09 
-0.000130330241518095 -6.64608205624972e-06 -2.02372985036448e-09 5.0207731305818e-09 
-0.00012528094521258 -6.24870244791964e-06 -1.91002258453921e-09 4.72063232948017e-09 
-0.000127484672702849 -5.88926877753693e-06 -1.79690551327383e-09 4.45369252588534e-09 
-0.000123695761431009 -5.56556278752396e-06 -1.6908373590141e-09 4.20248724708472e-09 
-0.000119695760076866 -5.28990631210036e-06 -1.60353774703026e-09 3.98862276540513e-09 
-0.000116230214189272 -5.10284007759765e-06 -1.54860457790562e-09 3.85486265130908e-09 
-0.00011556368554011 -4.94087862534798e-06 -1.50609213989128e-09 3.73939990083727e-09 
-0.000112344205263071 -4.79311802337179e-06 -1.45425416153699e-09 3.62755581129193e-09 
0 0 0 0 
0 0 0 0 
0 0 0 0 
0 0 0 0 
0 0 0 0 
0 0 0 0 
0 0 0 0 
0 0 0 0 
0 0 0 0 
0 0 0 0 
0 0 0 0 
0 0 0 0 
0 0 0 0 
0 0 0 0 
99.9864349365234 0.0121446093544364 5.44908652955201e-05 5.21855981787667e-05 
