0 0 0 0 
0 0 0 0 
0 0 0 0 
0 0 0 0 
0 0 0 0 
0 0 0 0 
0 0 0 0 
0 0 0 0 
0 0 0 0 
0 0 0 0 
0.00146216526627541 -6.60792125017906e-07 -1.48022261114988e-10 -5.62740791465455e-11 
0.00199403474107385 -2.69534695007678e-07 2.90641168021466e-07 8.65891678358821e-08 
0.00250178156420588 -6.05875072778872e-07 -2.98559186262537e-08 -3.64295427157657e-10 
0.00304235750809312 -6.14649650287902e-07 -2.65974563262716e-07 -1.44327945150735e-08 
0.00362720130942762 -1.09398285985662e-06 1.23772764482055e-07 -1.00779423917174e-07 
0.00417405180633068 -1.4000663668412e-06 -4.72726071620855e-08 2.32485092510615e-07 
0.00464476132765412 -1.65333460699912e-06 2.2270340238606e-08 -2.22863093313208e-07 
0.00500866444781423 -1.71273370597191e-06 -5.4800439741598e-09 1.05867670185944e-07 
0.0052254730835557 -1.89956949725456e-06 1.17652998454787e-09 -3.01674027980425e-08 
0.0052661974914372 -1.67088819580385e-06 2.64024413443309e-10 7.09637903995031e-09 
0.00519743468612432 -1.47204775657883e-06 -6.79021353033882e-11 -1.2700147600242e-09 
0.00508712558075786 -1.27572889141447e-06 1.26586959772919e-13 1.13390172251648e-10 
0.00496940361335874 -1.08660469777533e-06 -1.73950556649899e-12 -1.28759641837561e-10 
0.00488516269251704 -1.02208491625788e-06 -3.29929028541898e-10 2.26104884815115e-10 
0.00488432822749019 -1.07375251445774e-06 2.46251574687051e-10 -3.61822932726241e-11 
0.00498638628050685 -1.30319642721588e-06 -2.08746062102527e-10 4.56562045114683e-11 
0.00521847512573004 -1.5262183978848e-06 -2.98456814817882e-10 -1.07575080787736e-10 
0.00557637447491288 -2.17828505810758e-06 9.49573683572957e-11 1.0110984098588e-11 
0.00605066120624542 -2.72886381935677e-06 -2.27055648588381e-11 -3.36813438250871e-10 
0.00656071491539478 -3.34181049765903e-06 -1.09755975141734e-10 3.30892743760636e-11 
0.00705672055482864 -3.73566513189871e-06 -5.50759216011443e-10 7.54456358498246e-11 
0.00744209391996264 -4.21121740146191e-06 -7.03486990882851e-11 4.92323459777566e-10 
0.00765393860638142 -4.37358767158003e-06 -9.41083766470285e-10 8.80143180559401e-11 
0.00763161806389689 -4.34705725638196e-06 1.52140341991291e-10 1.85074303105104e-10 
0.00747263384982944 -4.27548047809978e-06 -3.67452068772423e-10 -5.71076276545401e-11 
0.00725962221622467 -4.43190128862625e-06 5.79096159913917e-10 5.29910282320856e-11 
0.0071589513681829 -4.75393972010352e-06 1.29055072184414e-10 -3.37632734270787e-11 
0.00737643614411354 -5.21349966220441e-06 -8.54641010739066e-11 3.14047426952513e-10 
0.00794634409248829 -6.00331213718164e-06 -3.35132088746803e-10 -4.4357455208921e-11 
0.00893067475408316 -6.89397984388052e-06 7.20985882107783e-10 -3.35765054648718e-10 
0.0104810772463679 -7.982436727616e-06 -1.26127031041534e-09 -5.47220324609299e-11 
0.0126915872097015 -9.1894507932011e-06 6.906242244753e-10 2.14784315333283e-10 
0.0157048143446445 -1.12385869215359e-05 -6.28954166526086e-10 5.12734354973787e-10 
0.0199103504419327 -1.34827350848354e-05 2.28957741654767e-09 -2.11369879932199e-10 
0.0255001429468393 -1.65281726367539e-05 1.65763180959289e-09 4.40982472760254e-10 
0.0326474569737911 -1.82959265657701e-05 7.62603036275067e-10 -3.23045368233466e-10 
0.0412782095372677 -2.18301538552623e-05 -1.21346743764406e-09 8.76715866571232e-10 
0.0512088760733604 -2.31114026973955e-05 1.56742274715072e-09 2.70468897278775e-10 
0.0619047954678535 -2.45759110839572e-05 1.86918169831074e-09 -1.07520214953638e-09 
0.0731089115142822 -2.49798213189933e-05 -7.64047547452407e-10 9.87520690221011e-11 
0.0841710343956947 -2.64470891124802e-05 -6.47617959259605e-09 3.05060887662023e-09 
0.0945640206336975 -2.34444505622378e-05 4.32566338304241e-09 2.93469160084214e-09 
0.103921659290791 -2.26530228246702e-05 1.35443976034821e-08 3.99411365092917e-10 
0.112421080470085 -2.1581783585134e-05 -8.0189421769461e-10 -5.77644765353824e-10 
0.11957960575819 -1.891836473078e-05 -3.09945669130229e-09 -5.81484416173339e-09 
0.125398069620132 -1.65587516676169e-05 -1.09835136541392e-08 -2.46854248153738e-09 
0.130513057112694 -1.65663986990694e-05 5.08909447916039e-09 -2.35530595027456e-09 
0.135028421878815 -1.43021961775958e-05 1.72984215840444e-09 -4.8462629465007e-09 
0.138501152396202 -1.55420420924202e-05 -5.5429061340817e-09 1.50214823219086e-11 
0.141526237130165 -1.88465364772128e-05 4.16879952780391e-09 8.07989786189012e-10 
0.14430183172226 -1.85512999451021e-05 1.22938637048264e-08 6.49127251950432e-10 
0.14628592133522 -1.85006501851603e-05 1.29608350718513e-08 1.2026399875964e-09 
0.148032516241074 -1.53684322867775e-05 -1.00991381923876e-09 -8.91762275134766e-10 
0.149584963917732 -7.29421344658476e-06 6.43524833421338e-09 -2.11325335008894e-09 
0.150454372167587 -4.6733152885281e-06 -2.71840749910268e-09 3.75453113043989e-10 
0.151137590408325 -2.9938091756776e-06 1.29104182899908e-09 -4.75661288135143e-10 
0.151702493429184 -2.17283650272293e-06 1.22736478758156e-08 6.73887701196918e-09 
0.151716992259026 -5.4940969675954e-06 5.30508570406596e-09 4.40660485878652e-09 
0.151561841368675 -8.12786402093479e-06 -6.34840757740562e-09 -9.49327816357481e-09 
0.151607051491737 -5.54016105525079e-06 -7.83955300676098e-09 8.45322389864123e-09 
0.151207134127617 -7.44500630389666e-06 1.66648828070493e-08 2.6807986941435e-09 
0.150550737977028 -6.91172999722767e-06 2.73016120821978e-09 -2.95652191617535e-09 
0.150398463010788 -7.16772456144099e-06 2.35048269736637e-09 -1.02956121406095e-09 
0.150141343474388 -1.23236377476132e-05 -1.81447745717378e-08 2.10569228720203e-09 
0.149880975484848 -1.01918785730959e-05 -1.21015677478908e-08 1.0677911888024e-09 
0.149724140763283 -5.22825757798273e-06 -1.98141481000391e-09 1.88530480116356e-09 
0.149668112397194 -1.96064934243623e-06 -8.51733406026511e-11 -3.87421783543118e-09 
0.148716151714325 -2.22813946493261e-06 1.96507432548287e-09 3.63092489408245e-09 
0.147872418165207 5.42544739801087e-06 -7.2863395317313e-09 1.70535932597637e-10 
0.146508231759071 3.0052885904297e-06 -2.75122218340584e-08 3.37526273597177e-09 
0.145265683531761 3.07080426864559e-06 -6.86885082146205e-09 -1.91803906091081e-09 
0.143876791000366 1.70597138549056e-06 8.48866310576568e-09 -4.75081085582474e-09 
0.14267073571682 1.70570410773507e-06 4.7576396156046e-09 -4.07245748235141e-09 
0.140849053859711 2.41785801335936e-06 -8.48681924736638e-09 4.94387863980705e-09 
0.139402166008949 -1.48513902331615e-06 -1.45875436174947e-08 2.65357269491062e-09 
0.137623324990273 3.83341603082954e-06 4.89960827465552e-09 1.01585240219748e-09 
0.135708525776863 7.76335036789533e-06 6.64054189414287e-09 -2.22385243553447e-09 
0.133085697889328 1.48978924698895e-05 -1.05548769724351e-08 -3.46292794439762e-09 
0.130764707922935 1.64296088769333e-05 8.95774743270294e-09 4.9229476051238e-10 
0.127967700362206 2.72136730927741e-05 -6.77346578825677e-09 1.29728072728597e-09 
0.125193610787392 2.0155290258117e-05 3.44030226528957e-09 3.3648495101346e-09 
0.122096054255962 1.91626440937398e-05 -8.13318035142174e-09 -5.17994758197915e-09 
0.119232207536697 1.66024638019735e-05 -1.28998955961634e-09 -5.73549119309291e-09 
0.116133980453014 1.89589918591082e-05 -1.57776425258049e-09 6.44642950131669e-10 
0.112836934626102 1.84178879862884e-05 2.87389934072735e-09 4.0462402317587e-09 
0.109183453023434 2.20554102270398e-05 -4.75058792304139e-09 -5.81540415822701e-09 
0.106086686253548 2.14912288356572e-05 7.25073168172941e-10 2.17895768095389e-09 
0.102618865668774 2.292972021678e-05 1.2870698284928e-08 -3.19474779963969e-10 
0.0991715714335442 1.85656535904855e-05 9.19349574246553e-09 -3.48300832619941e-09 
0.0959869474172592 1.46184775076108e-05 -5.44205791541685e-09 -2.70246691691511e-09 
0.0926684513688087 1.33476314658765e-05 1.46022944846891e-08 2.82233170167956e-09 
0.0890026167035103 1.6341593436664e-05 -4.8636654703671e-09 3.95258359375816e-09 
0.0855001583695412 1.43359138746746e-05 7.93497545448218e-10 2.3016255568109e-09 
0.0819047391414642 1.72157851920929e-05 6.22199447519733e-09 3.23427229442785e-10 
0.0778658092021942 2.03123618121026e-05 8.00257726751852e-09 3.69083430484807e-10 
0.0738638043403625 2.13165694731288e-05 5.72789593533685e-10 1.36337691136745e-10 
0.0693725496530533 1.9595425328589e-05 7.90876342193769e-09 -5.26374166476273e-10 
0.0650613754987717 1.96187611436471e-05 7.39113437120409e-10 1.64143187930677e-09 
0.0605147294700146 1.79674061655533e-05 -1.11605204244913e-10 -1.12239006977433e-09 
0.0562539137899876 1.60332310770173e-05 -1.58174895403818e-09 2.41194930694633e-09 
0.0518182143568993 1.41134660225362e-05 -3.63055119301237e-09 -4.29101448817804e-10 
0.0476972870528698 1.23498430184554e-05 2.6292485966195e-09 3.42879680204078e-09 
0.0437571369111538 1.28780611703405e-05 -4.17265422214541e-09 1.56443857868283e-09 
0.0401753783226013 1.12466168502579e-05 -1.66593586148345e-10 -1.03970676512688e-09 
0.0369351580739021 1.08002905108151e-05 -5.40753086752943e-09 1.50300744072851e-10 
0.0340475179255009 1.08054582597106e-05 1.41534672870591e-09 6.53606266332041e-11 
0.0315286107361317 1.00212691904744e-05 9.9761998662018e-10 -2.08371583876321e-10 
0.0293221771717072 9.30326677917037e-06 6.51974918497444e-10 3.6331429531522e-10 
0.0272799227386713 8.37813695397926e-06 -1.19058568559538e-10 -1.39279254796065e-09 
0.0253803692758083 7.51050129110808e-06 7.01092850441398e-10 -9.08754405060108e-10 
0.0238474234938622 7.52008327253861e-06 -1.27284682793771e-09 4.31898461439317e-10 
0.0224731899797916 8.12701728136744e-06 5.24670973334196e-10 -1.59633653518121e-10 
0.0211974214762449 8.02553677203832e-06 1.29044863683703e-09 5.0107057392168e-10 
0.020155556499958 7.50937942939345e-06 1.01296937504713e-09 -1.01946194541735e-10 
0.0191566646099091 7.41484291211236e-06 -2.87699281065201e-10 -2.28649182920648e-10 
0.0182755440473557 6.62261118122842e-06 1.80883030775902e-10 1.26410451550818e-10 
0.0174815114587545 5.15710280524218e-06 -1.26675592238001e-09 7.91716900372386e-11 
0.0167097486555576 4.73739692097297e-06 1.68221644947231e-10 -8.70114591489113e-10 
0.0159045662730932 4.24320933234412e-06 -4.67549554628022e-10 -2.61786259336816e-10 
0.0151887768879533 3.25146970681089e-06 2.74502115482633e-10 3.7523612689272e-12 
0.014382416382432 2.69915426542866e-06 1.43694800502914e-09 -7.66793240014607e-10 
0.0136013859882951 2.96468579108478e-06 1.69982541931013e-10 -1.23618615344157e-10 
0.0128468042239547 2.53620873991167e-06 2.33272318128641e-10 -1.76524531103617e-10 
0.0120612718164921 2.05712285605841e-06 8.03331401399987e-10 3.99203864409614e-11 
0.0113022597506642 1.75207355823659e-06 5.87208281999096e-10 2.70953870451507e-10 
0.0106346290558577 8.46874741000647e-07 5.50116840969395e-10 5.51712953100747e-10 
0.00996965169906616 2.32994512572304e-08 2.91349826209153e-11 -1.45656625649693e-10 
0.00935105420649052 -1.15023692615068e-06 4.83674655882282e-10 2.1807312899913e-10 
0.00885223597288132 -1.5481699620068e-06 -1.66391511680075e-10 2.48477322051244e-10 
0.00829525385051966 -2.25007261178689e-06 3.21666582259184e-11 1.39604827698037e-10 
0.00777264125645161 -2.75147203865345e-06 6.06594011132167e-11 4.78969537642815e-11 
0.00722685270011425 -3.59697105523082e-06 1.40756059585634e-10 2.33459467036123e-11 
0.00663603143766522 -3.75026957044611e-06 -5.72277614185879e-10 -1.0079194423529e-11 
0.00603285292163491 -4.23843948738067e-06 3.52874118814128e-10 -1.85878170494425e-11 
0.00544037623330951 -4.66355140815722e-06 3.91516180586748e-10 -8.9474705422532e-11 
0.00483812065795064 -4.77412868349347e-06 1.01691977061336e-09 6.32413149626032e-11 
0.00424446212127805 -5.03188402944943e-06 3.99191478483996e-11 1.01425007281719e-10 
0.00368277379311621 -5.09908431922668e-06 -4.40132930101811e-10 1.72630507111471e-10 
0.00313441292382777 -4.89314788865158e-06 1.24662974387846e-10 1.06491503115702e-10 
0.00263584265485406 -4.37037215306191e-06 6.02168800933889e-11 3.0418972896129e-11 
0.00215080380439758 -3.79462926503038e-06 -6.14061371195795e-11 7.17165085997729e-12 
0.00174475612584502 -2.96795451504295e-06 -1.46382517218768e-10 -3.56218700370281e-12 
0.00139374285936356 -2.28517956202268e-06 4.69979437311974e-11 8.73685082614095e-11 
0.00111202872358263 -1.55076281771471e-06 9.89053700051201e-11 1.42262165589435e-11 
0.00087949336739257 -9.75844727690856e-07 2.63584935128458e-11 3.3689603190501e-11 
0.000705623358953744 -6.19039099092333e-07 -3.08880317156923e-11 -1.2693244025308e-11 
0.000585488916840404 -3.60299566182221e-07 8.54652598691885e-11 5.67679670632204e-12 
0.000485682918224484 7.22567889965831e-08 2.91819086256639e-12 -1.12363547286054e-11 
0.00041055676410906 2.82868313661311e-07 2.13585329977839e-11 1.67206127416053e-11 
0.000349059904692695 4.84853842408484e-07 -3.41021724747925e-11 6.68730739186718e-12 
0.000305918365484104 6.95490541602339e-07 -7.35486584829692e-12 -2.22209381971206e-12 
0.000243530637817457 9.47476053170249e-07 3.1420172019736e-11 1.71296483941763e-12 
0.000209010962862521 8.73449948812777e-07 1.53229026689239e-11 -9.16090380637113e-12 
0.000175230568856932 9.01992166291166e-07 9.72425959200329e-12 2.58051652962665e-12 
0.000158750670379959 8.43314410303719e-07 3.17589669840412e-11 -1.08290481616591e-12 
0.000143226017826237 7.71278450883983e-07 3.41411100779343e-11 -9.27326249643146e-13 
0.000141088166856207 6.05334207648411e-07 7.6136076609945e-12 -5.51605419327195e-12 
0.000135408219648525 6.0030504300812e-07 6.95767315289642e-12 -2.66831218578845e-12 
0.00012722794781439 4.96065467814333e-07 2.21381316056757e-11 3.26180678604168e-13 
0.000120877601148095 4.68343870352328e-07 1.15989327517663e-11 -1.01076146150764e-12 
0.000107278159703128 4.63328490241111e-07 -2.47668639069554e-12 -5.18457152209884e-12 
0 0 0 0 
0 0 0 0 
0 0 0 0 
0 0 0 0 
0 0 0 0 
0 0 0 0 
0 0 0 0 
0 0 0 0 
0 0 0 0 
0 0 0 0 
0 0 0 0 
0 0 0 0 
0 0 0 0 
0 0 0 0 
99.9849624633789 0.0138950441032648 4.22501834691502e-05 3.66658350685611e-05 
