0 0 0 0 
0 0 0 0 
0 0 0 0 
0 0 0 0 
0 0 0 0 
0 0 0 0 
0 0 0 0 
0 0 0 0 
0 0 0 0 
0 0 0 0 
0.0294864475727081 5.49725973542081e-06 4.37269953579289e-09 -3.29881427729717e-10 
0.0365064963698387 2.88474461740407e-06 -2.13307643548433e-07 9.83714532054591e-09 
0.0429194867610931 2.04938714887248e-07 -4.12699119323179e-09 1.53661225965607e-08 
0.0500312745571136 -1.78399261585582e-06 3.71045160818539e-07 -2.93370128190418e-08 
0.0585515722632408 -2.87068496618303e-06 -3.18328829962411e-07 1.49077035160872e-08 
0.06791802495718 -3.76236471311131e-06 1.47337431144479e-07 9.37057320626877e-10 
0.0774125084280968 -4.20259311795235e-06 -7.8537780723309e-08 -3.34513892141786e-08 
0.0869784578680992 -4.34385219705291e-06 3.1820075463429e-08 4.79515769313821e-08 
0.0960308611392975 -4.14167288909084e-06 -1.78598789091211e-08 -1.80913502845215e-07 
0.103174917399883 -4.01652096115868e-06 1.44245451139113e-08 3.47653013932359e-07 
0.109226197004318 -3.63929211744107e-06 -1.65564593146428e-08 -3.07170211044649e-07 
0.114729396998882 -3.52732513420051e-06 3.95725896495946e-09 1.61355657724016e-07 
0.119778372347355 -3.26051667798311e-06 -4.12485290368636e-09 -1.2278628958029e-07 
0.124360240995884 -3.6119145079283e-06 -7.94198307119132e-09 5.03076620361753e-08 
0.128741964697838 -4.25047483076924e-06 -4.05931643854274e-09 6.12818185086184e-10 
0.13300633430481 -4.51781488663983e-06 -4.61531213247213e-09 7.88409160179526e-09 
0.137325450778008 -3.60078320227331e-06 2.06973396754684e-10 -3.74490571886099e-09 
0.14154540002346 -1.8737015352599e-06 -1.18008169902595e-09 9.55847134775922e-09 
0.145366564393044 6.86771954860887e-08 -5.26988408466877e-09 3.44567663290718e-09 
0.149249792098999 2.16432658817212e-06 1.83239146078762e-09 4.15512824147868e-09 
0.152805626392365 4.03383683078573e-06 2.07661621232091e-09 -6.93922297401173e-09 
0.155974105000496 4.49954359282856e-06 3.05571706826768e-10 -2.29629772974249e-08 
0.158669531345367 4.16280909121269e-06 6.21663875932654e-09 -7.62650120833541e-09 
0.161189898848534 3.07076561512076e-06 2.92288415693065e-09 1.14944738172085e-08 
0.163166552782059 1.99593819161237e-06 1.23990382405736e-08 1.81315673586369e-09 
0.16504280269146 1.55949442159908e-06 5.82686832117929e-09 8.37848457280188e-09 
0.166973754763603 2.47796970143099e-06 2.46171364542969e-11 1.13626557052271e-08 
0.168880417943001 3.48147295881063e-06 1.15930234301231e-08 -9.77023439929781e-09 
0.17065966129303 5.57944395040977e-06 -2.17497109211706e-09 4.55349180583653e-09 
0.172330975532532 7.80690970714204e-06 7.43570849337516e-09 4.69239358480422e-09 
0.173134684562683 8.48196214064956e-06 6.56457643799513e-09 1.61568480816499e-10 
0.173028290271759 6.05831610300811e-06 8.28651636197719e-09 -1.02172093008335e-08 
0.17246387898922 5.33472484676167e-06 2.07422914400013e-08 -8.34634761304187e-09 
0.171076759696007 3.16109503728512e-06 -6.0821259140198e-09 -1.74620784498813e-09 
0.168977692723274 5.9838748711627e-07 -1.25844543674702e-08 7.28828553064886e-10 
0.166570380330086 -2.97383252245709e-07 3.69514918663327e-10 1.64106217503956e-09 
0.1644207239151 5.07566028318251e-07 -9.03106034400025e-10 4.32997993016215e-09 
0.161669984459877 -1.9585199879657e-06 -8.81425954446513e-09 1.43441729605343e-08 
0.158551082015038 -1.48772312513756e-06 2.59436916394407e-09 -5.8676072889341e-09 
0.15571129322052 -2.10226608032826e-06 7.283377234657e-10 4.16963907845513e-10 
0.152466461062431 -1.27485941447958e-06 -6.07139227781772e-09 -4.60756366393866e-09 
0.148184880614281 -8.23697007490409e-07 -7.09873981818987e-09 1.44273188951161e-08 
0.143763288855553 2.23498659579491e-07 -6.80502543204398e-09 2.57916021872973e-09 
0.138332203030586 -1.07567086615745e-06 7.58864260319569e-09 8.13270339961036e-09 
0.132417425513268 -6.74373950459994e-07 -7.81769404767374e-09 9.57930801348539e-09 
0.12586385011673 -2.62745334111969e-06 2.12218909112494e-09 -2.84997714317115e-09 
0.119316466152668 -3.27751263284881e-06 -2.53377629988449e-09 -4.38013270098736e-09 
0.112506367266178 -3.93977097701281e-06 -4.02311561842339e-09 -3.78679221313405e-09 
0.106393732130527 -3.87424825021299e-06 -7.97047705614062e-11 -1.81142112420929e-09 
0.0999533906579018 -4.46461262981757e-06 -6.37151131854807e-09 -2.02241978719542e-09 
0.0940334349870682 -4.99823954669409e-06 3.98242150367878e-09 -7.5325212733901e-09 
0.0881133750081062 -5.4099677981867e-06 -1.05947584039257e-09 2.34052310865707e-09 
0.082139678299427 -5.39697066415101e-06 -2.02964378637205e-09 2.0177979287439e-09 
0.0762238204479218 -5.23498101756559e-06 5.42963340954827e-10 -6.80904710392838e-09 
0.0703006908297539 -4.0175095818995e-06 -1.13953024794e-09 -4.92046681177527e-10 
0.0644354149699211 -2.34946401178604e-06 -3.25919680133069e-10 -8.26904322792643e-09 
0.0588415190577507 -1.61412219767954e-06 -6.86078069356277e-11 1.85974224908847e-09 
0.0536911152303219 1.42508270073449e-07 -8.31588076177781e-10 -1.60105639857022e-09 
0.0490655936300755 1.67407165463374e-06 -3.34438587934471e-09 -5.3756137319283e-09 
0.0449668988585472 2.14353462979489e-06 1.37717104387036e-09 2.95777380365791e-09 
0.0414115376770496 2.28242674893409e-06 1.94580507262287e-09 2.75522360482228e-09 
0.0383306071162224 2.95057793664455e-06 4.47127179725726e-09 1.9752330882028e-09 
0.0357094928622246 2.64225127466489e-06 2.29093721770823e-09 3.44999473433916e-09 
0.0335442014038563 1.95214579434833e-06 1.57314150595056e-09 4.39315639422233e-10 
0.031538300216198 1.64502762345364e-06 -3.79258985327979e-10 1.49696421924972e-09 
0.0298249963670969 1.46365448472352e-06 1.21736432046049e-09 -1.08526720943303e-09 
0.0283271316438913 1.48014430578769e-06 2.70172906269295e-09 -3.39293843021338e-10 
0.0268721207976341 1.60842841978592e-06 1.96115790274121e-09 -1.06151465395499e-09 
0.0254776254296303 2.23687789002724e-06 2.53789478321664e-09 2.11107908931751e-09 
0.0242118500173092 2.35690117733611e-06 2.31576025022662e-09 -1.71033609497329e-09 
0.0230131316930056 2.05175024348137e-06 2.03582528612856e-09 1.69850786213566e-10 
0.0217559803277254 1.45898650316667e-06 1.11352227438744e-09 -5.07573427732666e-10 
0.0205800849944353 1.12271072794101e-06 2.57558446792316e-10 8.42956426883035e-10 
0.0193612892180681 7.26341284007503e-07 1.74700987010112e-09 -2.20628137981294e-09 
0.0182817988097668 2.12460790294244e-07 7.37439109776972e-10 1.15305195946824e-10 
0.0171482637524605 2.77122211400638e-07 4.71715888572533e-10 3.50769385759619e-10 
0.0160742830485106 2.95731268806776e-07 -4.39553782261015e-10 -1.12775433436241e-09 
0.0151231307536364 -9.46693177183988e-08 -2.00111871517805e-10 -1.04435649017631e-09 
0.0142572429031134 -2.72825246838693e-07 3.92778559676898e-10 1.39592282177858e-09 
0.0134950382634997 -3.17176926500906e-07 2.90976798211773e-10 -9.09394892723014e-10 
0.012836049310863 -4.90671084207861e-07 1.60786023384318e-10 -5.21602872005644e-10 
0.0123335868120193 -4.65786769154874e-07 2.67312727508795e-10 -6.5915045643905e-10 
0.0119059290736914 -3.43460214935476e-07 6.63371968467885e-10 -5.54335521929517e-10 
0.0116063272580504 -4.61768053128253e-07 1.81113748998207e-10 2.24583698860137e-10 
0.0113601451739669 -6.15449721408368e-07 3.75498798721452e-10 -3.14510639753962e-10 
0.0112423012033105 -8.96104950243171e-07 -3.37988387277832e-10 -6.93317972477736e-11 
0.0111673884093761 -9.64597916208731e-07 8.95510540721567e-11 7.18924086928752e-10 
0.0111100124195218 -9.77635409071809e-07 -2.52563525648952e-10 2.27146551567969e-10 
0.0111165577545762 -9.36680294216785e-07 -3.21963428140393e-11 5.5672022547526e-10 
0.0111842649057508 -8.3002851170022e-07 -4.90462948032899e-10 -6.76778424968383e-11 
0.0112750194966793 -1.00494958132913e-06 -2.99770652745224e-10 3.5671227083256e-10 
0.0113729126751423 -1.09892675936862e-06 -2.7008048575361e-10 2.36645147921877e-10 
0.0115223238244653 -1.0928414440059e-06 -6.69836519584521e-10 1.00087793608594e-09 
0.0117025207728148 -1.23208303648425e-06 -1.13165776749469e-09 -8.43005387718421e-10 
0.0117986975237727 -1.02492606401938e-06 -7.85914833212331e-10 6.70707716796115e-12 
0.0118185738101602 -7.67011385960359e-07 -1.70358727125119e-11 7.04944158602672e-11 
0.0118475845083594 -7.19051683972793e-07 6.51818599095577e-11 3.10654807433863e-10 
0.0118365520611405 -7.26879534340696e-07 -5.37190465721427e-11 2.55880511224049e-10 
0.0117848198860884 -7.22456491075718e-07 8.91967388838566e-10 9.399527822751e-10 
0.0117393536493182 -7.76825913817447e-07 -1.4189260877373e-10 -2.53291082552565e-10 
0.0117214052006602 -7.58488283736369e-07 7.35030869503106e-10 1.9786638993935e-10 
0.0116813639178872 -6.95033520514698e-07 -3.80113746034638e-10 1.03858543987201e-09 
0.0116237020120025 -8.68494112182816e-07 -4.07357869658398e-10 6.12452921711082e-10 
0.0115900943055749 -1.01021782938915e-06 -8.3505102832504e-10 3.0119676197593e-10 
0.0115340696647763 -1.10997098090593e-06 -3.45527828571335e-10 -7.06879665912652e-10 
0.011493363417685 -1.29614784327714e-06 -6.62842059018232e-10 -2.79410827808135e-10 
0.011481168679893 -1.71337285337358e-06 -5.77233039145142e-10 -3.11637660121988e-10 
0.0114616081118584 -1.76364801518503e-06 -4.6361739447498e-10 8.93995988349161e-10 
0.0114203626289964 -1.90848641068442e-06 -8.64457949667496e-10 -1.46454959271125e-10 
0.0113518517464399 -1.91982280739467e-06 -9.92156079515638e-11 3.32373961686727e-10 
0.0112775098532438 -1.76323362666153e-06 -1.09404063586283e-09 -5.15824938318588e-10 
0.011157164350152 -1.56089765823708e-06 -1.22461152329834e-10 3.64362401361618e-10 
0.0110407751053572 -1.72340492099465e-06 -1.89930973726327e-10 1.22903465182844e-09 
0.0108304796740413 -1.66489644470857e-06 -8.44931236088087e-10 6.34351571271452e-10 
0.010653231292963 -2.04776802092965e-06 -6.78296141476409e-10 -4.75162575952481e-10 
0.0104042971506715 -2.49728373091784e-06 -1.08289532896322e-09 -5.73843972340171e-10 
0.0101736923679709 -2.61924810729397e-06 -2.3782471547662e-09 5.10488040728063e-10 
0.0098609859123826 -2.38467760027561e-06 -9.21390130859123e-10 4.87740958732275e-10 
0.00953347701579332 -2.45248406827159e-06 -1.84128223779112e-09 -6.94300117398683e-10 
0.00918174814432859 -2.48875767283607e-06 -7.42569172818008e-10 -4.76192585363577e-10 
0.00879336521029472 -2.29242778004846e-06 -1.01542363406537e-09 -3.40410283294901e-10 
0.00830915104597807 -2.33675768868125e-06 -1.45268941320609e-09 -6.10671679890373e-10 
0.00784061942249537 -2.56107068707934e-06 -1.01856700851499e-09 1.3816858768223e-10 
0.00734185893088579 -2.53294774665846e-06 -9.05355568292521e-10 -5.67385860517078e-10 
0.00676821591332555 -2.28687054004695e-06 -1.21225141036518e-09 -5.10131936692915e-10 
0.00617990177124739 -2.32660681831476e-06 -1.12500675442107e-09 -4.15798118158506e-10 
0.00559221394360065 -2.30113323596015e-06 -1.22727661366895e-09 -7.03735680840367e-10 
0.00497218035161495 -2.1215116703388e-06 -7.74944053372195e-10 -4.27561597238224e-10 
0.00438242079690099 -1.95176880879444e-06 -1.12127174212162e-09 1.029384494311e-10 
0.00383313582278788 -1.82073870291788e-06 -1.091659207475e-09 -3.13186448996916e-10 
0.00333105912432075 -1.62720994012489e-06 -7.27240212494706e-10 -1.88497592534809e-10 
0.00282762642018497 -1.45782769322977e-06 -8.93975560245508e-10 -3.6566882855027e-10 
0.00236695981584489 -1.44193813866877e-06 -6.49179709988346e-10 -2.11625050816622e-10 
0.00192599243018776 -1.43097190630215e-06 -6.70192790153123e-10 -3.55747570290887e-10 
0.00153465196490288 -1.40602492137987e-06 -8.91324070106947e-10 -3.22731202873072e-10 
0.00118616526015103 -1.33749824726692e-06 -8.51268833201857e-10 -2.69104682981691e-10 
0.000931092305108905 -1.28051340197999e-06 -7.11077308146457e-10 -1.75686312720025e-10 
0.000734170782379806 -1.16858609544579e-06 -6.90090762311968e-10 -1.59831925472531e-10 
0.000585862726438791 -1.09250049717957e-06 -6.04748751076301e-10 -1.52936510677826e-10 
0.000467670848593116 -1.06829543256026e-06 -6.55581366970637e-10 -1.34057709377799e-10 
0.000373732327716425 -1.06399591004447e-06 -6.24696849804707e-10 -1.74534886543398e-10 
0.000289466028334573 -1.08072970306239e-06 -6.33006924655177e-10 -1.74121772555935e-10 
0.000215871492400765 -1.14789577310148e-06 -7.02772451344202e-10 -1.45969264453427e-10 
0.000150363688590005 -1.20400386549591e-06 -7.27351956442135e-10 -1.4828528682731e-10 
9.45341816986911e-05 -1.24872917695029e-06 -7.52528650505013e-10 -1.71719555241978e-10 
4.31139415013604e-05 -1.26932354760356e-06 -7.6780554136846e-10 -1.6889047105284e-10 
1.36658832161629e-06 -1.27372004499193e-06 -7.72240105195721e-10 -1.68612290796233e-10 
-3.56690434273332e-05 -1.29490285871725e-06 -7.85247866730288e-10 -1.70438788082983e-10 
-6.46797270746902e-05 -1.3074267144475e-06 -7.93000887178152e-10 -1.74876821357195e-10 
-8.67003691382706e-05 -1.30361229366827e-06 -7.92860832543596e-10 -1.71749670041521e-10 
-9.7098367405124e-05 -1.27404132399533e-06 -7.81868292332177e-10 -1.6755187515205e-10 
-0.000107695028418675 -1.25173119158717e-06 -7.59275864403719e-10 -1.69644548408954e-10 
-0.000110399756522384 -1.19948686005955e-06 -7.25759119468705e-10 -1.49720916220453e-10 
-0.000113210677227471 -1.1245765563217e-06 -6.82264744700234e-10 -1.43450556988611e-10 
-0.00011069836182287 -1.06867014437739e-06 -6.43305131386995e-10 -1.32815869413605e-10 
-0.000110057604615577 -1.02662045264879e-06 -6.2378852083711e-10 -1.35695163439031e-10 
-0.00010586923599476 -9.69440179687808e-07 -5.88434079240585e-10 -1.35026351211209e-10 
-0.000100798359198961 -9.24122161904961e-07 -5.6277782434222e-10 -1.28031349411195e-10 
-9.90834596450441e-05 -9.01926341612125e-07 -5.53446566353699e-10 -1.26889526663732e-10 
-0.000100184886832722 -8.60072191244399e-07 -5.18631082524479e-10 -1.16964229968097e-10 
-0.000110270804725587 -8.34088268675259e-07 -5.06437281000416e-10 -1.17241119590439e-10 
0 0 0 0 
0 0 0 0 
0 0 0 0 
0 0 0 0 
0 0 0 0 
0 0 0 0 
0 0 0 0 
0 0 0 0 
0 0 0 0 
0 0 0 0 
0 0 0 0 
0 0 0 0 
0 0 0 0 
0 0 0 0 
99.9953308105469 0.00320203648880124 5.62245877517853e-05 5.46706869499758e-05 
