0 0 0 0 
0 0 0 0 
0 0 0 0 
0 0 0 0 
0 0 0 0 
0 0 0 0 
0 0 0 0 
0 0 0 0 
0 0 0 0 
0 0 0 0 
0.00211952044628561 1.34357685510622e-06 -1.24278709545678e-09 0 
0.00236052949912846 1.30743762838392e-06 4.09552001201519e-07 1.22884005193669e-08 
0.00252378452569246 9.93759613265865e-07 1.60881707955696e-09 -6.59611600895005e-08 
0.00266874372027814 6.31990360488999e-07 -1.67660971328587e-07 6.09529138273501e-09 
0.00277637457475066 1.6371812705529e-07 3.68687587126715e-08 1.85169035660238e-08 
0.00284100300632417 -2.45339691673507e-07 -4.84915396725683e-09 4.39528093920671e-08 
0.00286823883652687 -5.28445184500015e-07 -3.50072554278213e-10 -3.16469801475705e-08 
0.0028592583257705 -7.08460049736459e-07 2.22644361280722e-10 -5.22097565180957e-08 
0.00281539070419967 -7.44042381484178e-07 1.54603066460091e-10 -2.53065994826329e-08 
0.00271327397786081 -6.83226744513377e-07 5.10144648746547e-10 2.49143226938031e-07 
0.00257569272071123 -6.61170702187519e-07 -4.80417754189499e-11 -2.46006010229394e-07 
0.00241566193290055 -7.0417524966615e-07 8.44898317975407e-11 1.19219748739852e-07 
0.00226170709356666 -7.58987596327643e-07 4.07022915371869e-10 -2.87109251928541e-08 
0.0021378134842962 -8.24398682652827e-07 1.78238729331426e-10 3.67617780661078e-09 
0.00206861319020391 -9.1038776872665e-07 -5.85827358845492e-11 -3.2674900979357e-11 
0.00206644111312926 -9.64605874287372e-07 1.1250331222179e-10 1.3296296008658e-10 
0.00213076244108379 -9.93237790680723e-07 1.19205464943484e-10 2.10650857868089e-10 
0.00224381661973894 -1.00648037459905e-06 -7.40806443966235e-11 1.1153422629917e-10 
0.00239326036535203 -9.37036020332016e-07 1.02326619400017e-10 -1.65099628413046e-10 
0.00254057114943862 -9.28906786157313e-07 -1.3766397743975e-10 -1.33996383433477e-10 
0.00266544194892049 -9.27224050428777e-07 -8.88736792492573e-11 -6.42356029478819e-11 
0.00274748890660703 -9.48059550864855e-07 1.58797017202339e-10 3.30152016836394e-11 
0.00278097996488214 -9.8555165095604e-07 -5.18956717876495e-11 3.27106536301969e-10 
0.00275488081388175 -1.14916531401832e-06 5.9281024533675e-11 1.43008924147203e-10 
0.00269019231200218 -1.26748875572957e-06 -3.12174674999e-10 1.52514098572532e-10 
0.00261613610200584 -1.35248274091282e-06 2.46065928050099e-11 4.82136996993177e-10 
0.00258519593626261 -1.34328388412541e-06 5.07435196292483e-12 3.29473739957287e-11 
0.0026354817673564 -1.28929468701244e-06 4.6354231564294e-10 -1.71748767985314e-10 
0.00282859383150935 -1.1734456393242e-06 1.45265882656176e-10 -2.90089424703766e-10 
0.00325753632932901 -1.01313366940303e-06 -3.51783185914556e-11 3.87108844979167e-10 
0.00400107353925705 -9.30063038140361e-07 -1.73780920209587e-11 -1.50478421390154e-10 
0.00519415223971009 -1.11366739474761e-06 -4.81390427520267e-10 7.69418861956694e-10 
0.00705494405701756 -1.26548638945678e-06 2.76550671252096e-10 -3.96781024702975e-10 
0.00978938397020102 -1.69485849710327e-06 -2.28935811280584e-11 -4.30799666772952e-11 
0.0136337205767632 -2.36145820053935e-06 1.34121003192433e-09 4.8779530414933e-10 
0.0187759678810835 -3.10212317344849e-06 1.46133383172042e-09 -3.05666625344259e-09 
0.0253691449761391 -4.13703992308001e-06 -4.61056644252e-11 -4.55216087047461e-10 
0.033114705234766 -5.91305479247239e-06 -1.77331083150989e-09 1.15918619147948e-09 
0.0416610948741436 -6.82585687172832e-06 -1.86575407901124e-10 3.08062286791255e-09 
0.0509234368801117 -8.22473066364182e-06 -4.67889682553846e-09 3.29021698775023e-09 
0.0601694323122501 -8.12971120467409e-06 -4.64660354637658e-09 -4.24338147952952e-10 
0.068858690559864 -7.93809158494696e-06 -2.24543872384686e-09 -3.9480316793572e-09 
0.0769957527518272 -7.59272143113776e-06 9.38017397089652e-09 -7.40822819755849e-11 
0.084715411067009 -5.42476982445805e-06 -1.07498161483477e-08 1.00063566321751e-08 
0.0912985503673553 -4.11260134569602e-06 2.55160848006142e-09 -3.18029802492958e-09 
0.0966498255729675 -4.04587717639515e-06 -2.23940532784184e-09 2.23288854073189e-09 
0.101294510066509 -3.2138823371497e-06 9.03915609029582e-09 -4.60091031939669e-09 
0.105153933167458 -2.49972117671859e-06 1.25853762966699e-08 -1.67107536697131e-08 
0.107958927750587 -4.16470447817119e-06 -1.0504811243095e-08 3.06002245764603e-09 
0.110358044505119 -4.65647826786153e-06 5.70330405125219e-09 7.20805592990814e-09 
0.1127849817276 -5.85692350796307e-06 -2.68613153941999e-09 1.23466326051869e-09 
0.114837668836117 -7.28235363567364e-06 -3.97878618940695e-09 1.32563127142049e-09 
0.116506092250347 -8.71975771588041e-06 5.69004798833816e-09 -1.05332598199226e-09 
0.118018440902233 -1.00749948614975e-05 4.74376715686731e-09 -1.50179069180467e-09 
0.119313754141331 -9.09598566067871e-06 5.95550231352604e-09 -2.1676105355084e-09 
0.12037767469883 -6.69219252813491e-06 4.88074425319951e-09 -1.82930008918447e-08 
0.121323302388191 -6.37626317256945e-06 4.0747427654253e-09 -1.25373811332707e-09 
0.122237741947174 -2.65998460236005e-06 -5.62545388049784e-09 4.45974945861849e-09 
0.123018592596054 1.12994575829362e-06 -8.53884696283558e-09 4.34044844510595e-09 
0.123696655035019 3.02325315715279e-06 -1.72227287986715e-09 1.33546054215117e-08 
0.124357178807259 4.70507393401931e-06 3.63431085226296e-09 -5.15948395118926e-09 
0.125088259577751 7.89706609793939e-06 1.27458443799355e-08 -1.60726116860133e-08 
0.125977799296379 7.60151897338801e-06 -8.13731482196545e-09 -6.41910569143533e-09 
0.127323418855667 5.0907092372654e-06 -1.41366385264519e-08 2.29179271116209e-08 
0.128036305308342 3.93633990825037e-06 -2.86175971808689e-09 -1.3349552574482e-08 
0.128831371665001 3.6308947528596e-06 -6.20412698992823e-09 -1.64717095518796e-09 
0.129639446735382 4.31015860158368e-06 -1.73972871664319e-08 1.43121123841183e-08 
0.129822820425034 6.07342462899396e-06 2.13232311807587e-08 -2.11288639917484e-08 
0.129841953516006 1.08407175503089e-05 -3.27346705297771e-10 -4.68924277186034e-09 
0.130065962672234 1.27104631246766e-05 1.49407497485043e-09 9.98628735260354e-09 
0.130500569939613 1.15049533633282e-05 -1.48565826307845e-08 5.79831382907514e-09 
0.130379572510719 8.1189391494263e-06 -7.08974301488752e-09 3.98581834204492e-09 
0.130512088537216 6.9535531110887e-06 -3.89068910422452e-09 2.61472954399267e-09 
0.130120024085045 5.31601926923031e-06 -8.8217468885432e-09 1.49704373342274e-08 
0.13037483394146 2.01695524992829e-06 7.74121122759652e-09 -1.07594724241267e-08 
0.12996943295002 3.90507193515077e-06 4.70664440754831e-09 -1.72267107245716e-08 
0.129376038908958 5.04114541399758e-06 -4.72396921580298e-09 6.58754784055304e-09 
0.129131942987442 2.11899373425695e-06 1.46047751670153e-08 -6.85276280165681e-09 
0.12862603366375 1.6815648677948e-06 3.69020658474994e-09 1.38231193158589e-09 
0.127969563007355 1.60390675318922e-06 -1.92568516688141e-09 8.91003892888875e-09 
0.126966744661331 8.73066426265723e-07 -1.11125135759949e-08 9.6289021200846e-09 
0.126233518123627 2.2056399302528e-06 3.28011440231535e-09 -5.01289720844511e-09 
0.125121384859085 4.545988758764e-06 -8.4591738058748e-09 1.25095018788102e-08 
0.124261908233166 4.02934165322222e-06 9.89731763212376e-09 -1.56317057076194e-08 
0.123083330690861 2.6888874344877e-06 -1.08663620324023e-08 1.55315174055204e-08 
0.122453831136227 -3.4634712164916e-07 -1.47046206322443e-08 1.13860068040594e-08 
0.121651485562325 -1.17023535040062e-06 1.97337057805669e-09 1.61067503778867e-09 
0.12051098048687 -1.32695527099713e-06 4.04044309121332e-09 -5.96774230032793e-09 
0.119575709104538 -9.85379870144243e-07 7.49353201712211e-09 -1.43856508927342e-08 
0.118955843150616 6.44584190467867e-07 -6.91846890887859e-09 8.73993855066146e-09 
0.118227012455463 -1.62160006311751e-06 -6.58561738475782e-09 1.58665471872155e-08 
0.117387749254704 -2.72784609478549e-06 -2.77092104816745e-09 -1.61559632338992e-09 
0.116960346698761 -3.09641495732649e-06 1.71598095732861e-08 -4.33773017505246e-09 
0.116752468049526 -4.80992957818671e-06 7.63273799719855e-09 4.37780967033063e-09 
0.115674763917923 -2.34546655519807e-06 1.24612054008821e-08 -5.304988448529e-09 
0.113943912088871 1.05708284081629e-06 3.15177905996222e-09 -7.59162688268589e-09 
0.112337708473206 1.82745998245082e-06 1.46909107101578e-09 -7.96693111482227e-09 
0.110376425087452 2.05408218789671e-06 -1.0361054236796e-08 6.59745325037875e-09 
0.10811423510313 1.94751714843733e-06 5.74800429475886e-09 -1.17813669930911e-08 
0.105970002710819 8.97969584912062e-07 1.23200596391371e-08 -1.09493178968023e-08 
0.104094229638577 1.46325021432858e-06 -5.97607163754788e-09 1.07369739765772e-08 
0.102051787078381 2.72333659268043e-06 1.16000737904187e-08 -1.28652102304727e-08 
0.0998368710279465 1.43511988426326e-06 8.51354597930509e-10 4.50160619891449e-09 
0.0977028831839561 5.87017041198123e-07 -7.01175117967523e-09 8.14856271347253e-09 
0.0954058617353439 6.82035334875764e-08 8.49386339041303e-09 -4.04865030390056e-09 
0.0932740122079849 -1.67377004345326e-06 -6.69500732630723e-10 -6.09865979939173e-09 
0.0913789719343185 -5.2864938879793e-06 -2.37398811719913e-09 -3.85324772089746e-10 
0.0894742086529732 -4.95539688927238e-06 3.27244187303677e-09 -7.07638969643654e-09 
0.0873493924736977 -4.96930715598864e-06 -1.26532944122459e-08 1.51539083503849e-08 
0.08511071652174 -4.31165608461015e-06 -6.57375798240878e-09 1.20351888455161e-08 
0.082841083407402 -2.42546457229764e-06 -1.28662280829417e-09 2.46025733119382e-09 
0.080288790166378 -2.47772845796135e-07 -2.38889241721552e-09 4.14795225944786e-10 
0.0777877420186996 -1.04689570434857e-06 -2.04984651475115e-09 4.10813161266788e-09 
0.0747152417898178 2.2843809688311e-07 6.04245264934633e-10 1.14345743984501e-09 
0.0718621611595154 -1.7155865634777e-06 -2.55153342898495e-09 -7.31792537678189e-09 
0.0689123570919037 -2.22305084207619e-06 -2.01655825371461e-09 -4.77953321365021e-09 
0.0658213794231415 -3.06447191178449e-06 -3.69287467272272e-09 7.11720415935702e-09 
0.0623882152140141 -1.38645577862917e-06 1.10435163236389e-08 -8.58514859203297e-09 
0.0589954406023026 -2.25001213038922e-06 4.22989154813536e-09 -1.17078213790478e-09 
0.0556225851178169 -2.85378132502956e-06 -3.94913168833e-09 1.10624203131238e-08 
0.0519157312810421 -3.30330431097536e-06 6.91451007561739e-10 1.11972686678286e-09 
0.0481285005807877 -3.13723353428941e-06 6.71840094668141e-09 -3.33150174114394e-09 
0.0445721410214901 -4.50530296802754e-06 1.98231919767977e-09 -3.43122219526037e-09 
0.0410978049039841 -4.34244520874927e-06 1.71681724392414e-10 1.94845917178554e-09 
0.0374197848141193 -2.60944580077194e-06 -8.39917413397728e-10 1.36679723095057e-09 
0.0338612385094166 -2.87283205580025e-06 4.83454387634197e-09 -4.73409089707388e-09 
0.0304661374539137 -2.94612618745305e-06 1.76739656243541e-09 -8.87199702592767e-10 
0.0270189307630062 -2.21763957597432e-06 -1.4653721569502e-09 9.72244063035532e-10 
0.0237422771751881 -1.85961459919781e-06 6.40261585069246e-12 1.62960211991248e-09 
0.0206997860223055 -2.00118120119441e-06 4.82195228190818e-10 -1.20868481889858e-09 
0.0178838949650526 -1.70372675256658e-06 1.85362974969294e-10 -6.29129470741674e-10 
0.0151579491794109 -1.09466066078312e-06 9.98754190462137e-10 -6.88447909791279e-10 
0.0126808825880289 -1.19647370411258e-06 5.57471735440629e-10 -2.63849636583657e-10 
0.0103704277426004 -1.15090142571717e-06 5.2278209539125e-10 -2.75908219882215e-11 
0.00830398686230183 -1.19485480354342e-06 8.11536671196933e-10 -1.28818802846986e-10 
0.00647601345553994 -1.12090526727116e-06 -2.09998310407578e-10 9.39487265760874e-10 
0.00503072701394558 -1.40599377118633e-06 -2.21133111821814e-10 7.11392778018904e-10 
0.00386779406107962 -1.45743695156852e-06 1.01646614736328e-10 -8.50114839634486e-11 
0.00293744751252234 -1.42219528243004e-06 4.19613371827054e-10 9.56493651643742e-12 
0.00220856163650751 -1.3278671531225e-06 2.51637932713322e-10 -2.19355505981511e-10 
0.00164443219546229 -1.33907144572731e-06 -2.392094335113e-11 8.71736294261183e-11 
0.00119580584578216 -1.33543164793082e-06 1.51012952143148e-11 1.78012937723793e-10 
0.000865137146320194 -1.46716888593801e-06 1.11745772357619e-10 1.19872431425527e-10 
0.000611300813034177 -1.56547616825264e-06 7.42418071464357e-11 1.49674536653599e-10 
0.000412003573728725 -1.6787909089544e-06 1.38785788417195e-10 1.20407170345338e-10 
0.000260177766904235 -1.75292564108531e-06 1.35424574332355e-10 1.33654781686587e-10 
0.00014972138160374 -1.818613100113e-06 1.66016561609084e-10 1.03379312055285e-10 
6.25906031928025e-05 -1.85726446488843e-06 1.4409590187725e-10 1.35588471006365e-10 
-5.80750429435284e-06 -1.89930642591207e-06 1.52538981446071e-10 1.35944130952304e-10 
-5.58117499167565e-05 -1.90847572412167e-06 1.50813403432259e-10 1.41947509302298e-10 
-8.9967084932141e-05 -1.89680270068493e-06 1.65254726569586e-10 1.32431843269387e-10 
-0.000118193886009976 -1.8631048988027e-06 1.46275824786102e-10 1.40236391943382e-10 
-0.000134895759401843 -1.80869346877444e-06 1.48114701059576e-10 1.28588611980618e-10 
-0.000145711499499157 -1.73220462329482e-06 1.46871695361206e-10 1.16961038076902e-10 
-0.000150743842823431 -1.64890423093311e-06 1.41969810907305e-10 1.12260367668426e-10 
-0.000155468471348286 -1.56324585987022e-06 1.35490507702229e-10 1.09230263722893e-10 
-0.000155516958329827 -1.4720980061611e-06 1.04778047349541e-10 1.15784715148948e-10 
-0.000155784669914283 -1.39989072067692e-06 1.01085126380518e-10 1.19336748816146e-10 
-0.000156264708493836 -1.34861159040156e-06 8.18703646543462e-11 1.17102869068297e-10 
-0.000155416375491768 -1.29188788378087e-06 9.04265551326944e-11 8.65798266413975e-11 
-0.000156079753651284 -1.2636121482501e-06 8.57627996397881e-11 8.65623822621231e-11 
0 0 0 0 
0 0 0 0 
0 0 0 0 
0 0 0 0 
0 0 0 0 
0 0 0 0 
0 0 0 0 
0 0 0 0 
0 0 0 0 
0 0 0 0 
0 0 0 0 
0 0 0 0 
0 0 0 0 
0 0 0 0 
99.9940490722656 0.00476203719154 4.50000370619819e-05 3.94703274650965e-05 
